phoenix-commits mailing list archives

Site index · List index
Message view « Date » · « Thread »
Top « Date » · « Thread »
From Apache Jenkins Server <jenk...@builds.apache.org>
Subject Build failed in Jenkins: Phoenix | 4.x-HBase-0.98 #884
Date Tue, 03 Nov 2015 01:48:10 GMT
See <https://builds.apache.org/job/Phoenix-4.x-HBase-0.98/884/changes>

Changes:

[cmarcel] PHOENIX-2366 - Pherf NPE on Data loader

------------------------------------------
[...truncated 5777 lines...]
Tests run: 4, Failures: 0, Errors: 0, Skipped: 0, Time elapsed: 3.578 sec - in org.apache.phoenix.end2end.DynamicFamilyIT
Running org.apache.phoenix.end2end.ExecuteStatementsIT
Tests run: 3, Failures: 0, Errors: 0, Skipped: 0, Time elapsed: 5.306 sec - in org.apache.phoenix.end2end.ReverseScanIT
Running org.apache.phoenix.end2end.TenantSpecificViewIndexIT
Tests run: 15, Failures: 0, Errors: 0, Skipped: 0, Time elapsed: 65.757 sec - in org.apache.phoenix.end2end.TenantIdTypeIT
Running org.apache.phoenix.end2end.LastValueFunctionIT
Tests run: 2, Failures: 0, Errors: 0, Skipped: 0, Time elapsed: 13.837 sec - in org.apache.phoenix.end2end.ExecuteStatementsIT
Running org.apache.phoenix.end2end.PowerFunctionEnd2EndIT
Tests run: 1, Failures: 0, Errors: 0, Skipped: 0, Time elapsed: 3.944 sec - in org.apache.phoenix.end2end.PowerFunctionEnd2EndIT
Running org.apache.phoenix.end2end.ReverseFunctionIT
Tests run: 5, Failures: 0, Errors: 0, Skipped: 0, Time elapsed: 2.27 sec - in org.apache.phoenix.end2end.ReverseFunctionIT
Running org.apache.phoenix.end2end.InstrFunctionIT
Tests run: 11, Failures: 0, Errors: 0, Skipped: 0, Time elapsed: 8.731 sec - in org.apache.phoenix.end2end.LastValueFunctionIT
Running org.apache.phoenix.end2end.QueryMoreIT
Tests run: 8, Failures: 0, Errors: 0, Skipped: 0, Time elapsed: 16.785 sec - in org.apache.phoenix.end2end.TenantSpecificViewIndexIT
Running org.apache.phoenix.end2end.LikeExpressionIT
Tests run: 8, Failures: 0, Errors: 0, Skipped: 0, Time elapsed: 3.71 sec - in org.apache.phoenix.end2end.InstrFunctionIT
Running org.apache.phoenix.end2end.ArrayConcatFunctionIT
Tests run: 2, Failures: 0, Errors: 0, Skipped: 0, Time elapsed: 5.031 sec - in org.apache.phoenix.end2end.LikeExpressionIT
Running org.apache.phoenix.end2end.RoundFloorCeilFunctionsEnd2EndIT
Tests run: 62, Failures: 0, Errors: 0, Skipped: 0, Time elapsed: 180.776 sec - in org.apache.phoenix.end2end.index.IndexExpressionIT
Tests run: 30, Failures: 0, Errors: 0, Skipped: 0, Time elapsed: 9.62 sec - in org.apache.phoenix.end2end.ArrayConcatFunctionIT
Running org.apache.phoenix.end2end.ArrayAppendFunctionIT
Running org.apache.phoenix.end2end.CSVCommonsLoaderIT
Tests run: 5, Failures: 0, Errors: 0, Skipped: 0, Time elapsed: 17.955 sec - in org.apache.phoenix.end2end.QueryMoreIT
Running org.apache.phoenix.end2end.AlterTableWithViewsIT
Tests run: 34, Failures: 0, Errors: 0, Skipped: 0, Time elapsed: 11.225 sec - in org.apache.phoenix.end2end.ArrayAppendFunctionIT
Running org.apache.phoenix.end2end.salted.SaltedTableUpsertSelectIT
Tests run: 31, Failures: 0, Errors: 0, Skipped: 0, Time elapsed: 18.789 sec - in org.apache.phoenix.end2end.RoundFloorCeilFunctionsEnd2EndIT
Running org.apache.phoenix.end2end.salted.SaltedTableVarLengthRowKeyIT
Tests run: 1, Failures: 0, Errors: 0, Skipped: 0, Time elapsed: 3.129 sec - in org.apache.phoenix.end2end.salted.SaltedTableVarLengthRowKeyIT
Running org.apache.phoenix.end2end.DisableLocalIndexIT
Tests run: 5, Failures: 0, Errors: 0, Skipped: 0, Time elapsed: 7.638 sec - in org.apache.phoenix.end2end.salted.SaltedTableUpsertSelectIT
Running org.apache.phoenix.end2end.RTrimFunctionIT
Tests run: 16, Failures: 0, Errors: 0, Skipped: 0, Time elapsed: 20.587 sec - in org.apache.phoenix.end2end.CSVCommonsLoaderIT
Tests run: 1, Failures: 0, Errors: 0, Skipped: 0, Time elapsed: 4.44 sec - in org.apache.phoenix.end2end.DisableLocalIndexIT
Running org.apache.phoenix.end2end.UpsertSelectAutoCommitIT
Tests run: 2, Failures: 0, Errors: 0, Skipped: 0, Time elapsed: 2.419 sec - in org.apache.phoenix.end2end.RTrimFunctionIT
Running org.apache.phoenix.end2end.SubqueryIT
Running org.apache.phoenix.end2end.CoalesceFunctionIT
Tests run: 3, Failures: 0, Errors: 0, Skipped: 0, Time elapsed: 10.408 sec - in org.apache.phoenix.end2end.UpsertSelectAutoCommitIT
Running org.apache.phoenix.end2end.DateTimeIT
Tests run: 10, Failures: 0, Errors: 0, Skipped: 0, Time elapsed: 10.957 sec - in org.apache.phoenix.end2end.CoalesceFunctionIT
Running org.apache.phoenix.end2end.ServerExceptionIT
Tests run: 1, Failures: 0, Errors: 0, Skipped: 0, Time elapsed: 2.194 sec - in org.apache.phoenix.end2end.ServerExceptionIT
Tests run: 108, Failures: 0, Errors: 0, Skipped: 0, Time elapsed: 102.606 sec - in org.apache.phoenix.end2end.HashJoinIT
Running org.apache.phoenix.end2end.ModulusExpressionIT
Running org.apache.phoenix.end2end.SubqueryUsingSortMergeJoinIT
Tests run: 11, Failures: 0, Errors: 0, Skipped: 0, Time elapsed: 8.279 sec - in org.apache.phoenix.end2end.ModulusExpressionIT
Running org.apache.phoenix.end2end.BinaryRowKeyIT
Tests run: 3, Failures: 0, Errors: 0, Skipped: 0, Time elapsed: 3.169 sec - in org.apache.phoenix.end2end.BinaryRowKeyIT
Running org.apache.phoenix.end2end.ReadOnlyIT
Tests run: 19, Failures: 0, Errors: 0, Skipped: 0, Time elapsed: 16.651 sec - in org.apache.phoenix.end2end.DateTimeIT
Running org.apache.phoenix.end2end.DeleteIT
Tests run: 1, Failures: 0, Errors: 0, Skipped: 0, Time elapsed: 7.787 sec - in org.apache.phoenix.end2end.ReadOnlyIT
Running org.apache.phoenix.end2end.HashJoinLocalIndexIT
Tests run: 21, Failures: 0, Errors: 0, Skipped: 0, Time elapsed: 40.489 sec - in org.apache.phoenix.end2end.SubqueryIT
Running org.apache.phoenix.end2end.ArrayFillFunctionIT
Tests run: 15, Failures: 0, Errors: 0, Skipped: 0, Time elapsed: 35.409 sec - in org.apache.phoenix.end2end.SubqueryUsingSortMergeJoinIT
Running org.apache.phoenix.end2end.StatementHintsIT
Tests run: 26, Failures: 0, Errors: 0, Skipped: 0, Time elapsed: 9.628 sec - in org.apache.phoenix.end2end.ArrayFillFunctionIT
Running org.apache.phoenix.end2end.DecodeFunctionIT
Tests run: 1, Failures: 0, Errors: 0, Skipped: 0, Time elapsed: 15 sec - in org.apache.phoenix.end2end.HashJoinLocalIndexIT
Running org.apache.phoenix.end2end.TimezoneOffsetFunctionIT
Tests run: 2, Failures: 0, Errors: 0, Skipped: 0, Time elapsed: 2.445 sec - in org.apache.phoenix.end2end.StatementHintsIT
Running org.apache.phoenix.end2end.SpooledSortMergeJoinIT
Tests run: 6, Failures: 0, Errors: 0, Skipped: 0, Time elapsed: 2.997 sec - in org.apache.phoenix.end2end.DecodeFunctionIT
Running org.apache.phoenix.end2end.ArrayPrependFunctionIT
Tests run: 7, Failures: 0, Errors: 0, Skipped: 0, Time elapsed: 7.03 sec - in org.apache.phoenix.end2end.TimezoneOffsetFunctionIT
Running org.apache.phoenix.end2end.ArithmeticQueryIT
Tests run: 22, Failures: 0, Errors: 0, Skipped: 0, Time elapsed: 35.956 sec - in org.apache.phoenix.end2end.DeleteIT
Running org.apache.phoenix.end2end.IsNullIT
Tests run: 34, Failures: 0, Errors: 0, Skipped: 0, Time elapsed: 14.201 sec - in org.apache.phoenix.end2end.ArrayPrependFunctionIT
Running org.apache.phoenix.end2end.SpooledTmpFileDeleteIT
Tests run: 3, Failures: 0, Errors: 0, Skipped: 0, Time elapsed: 4.573 sec - in org.apache.phoenix.end2end.IsNullIT
Running org.apache.phoenix.end2end.AbsFunctionEnd2EndIT
Tests run: 1, Failures: 0, Errors: 0, Skipped: 0, Time elapsed: 2.293 sec - in org.apache.phoenix.end2end.SpooledTmpFileDeleteIT
Running org.apache.phoenix.end2end.FirstValueFunctionIT
Tests run: 1, Failures: 0, Errors: 0, Skipped: 0, Time elapsed: 2.776 sec - in org.apache.phoenix.end2end.AbsFunctionEnd2EndIT
Running org.apache.phoenix.end2end.RegexpSubstrFunctionIT
Tests run: 7, Failures: 0, Errors: 0, Skipped: 0, Time elapsed: 2.844 sec - in org.apache.phoenix.end2end.FirstValueFunctionIT
Running org.apache.phoenix.end2end.QueryExecWithoutSCNIT
Tests run: 1, Failures: 0, Errors: 0, Skipped: 0, Time elapsed: 2.33 sec - in org.apache.phoenix.end2end.QueryExecWithoutSCNIT
Running org.apache.phoenix.end2end.PhoenixRuntimeIT
Tests run: 2, Failures: 0, Errors: 0, Skipped: 0, Time elapsed: 3.261 sec - in org.apache.phoenix.end2end.RegexpSubstrFunctionIT
Running org.apache.phoenix.end2end.UpgradeIT
Tests run: 26, Failures: 0, Errors: 0, Skipped: 0, Time elapsed: 29.38 sec - in org.apache.phoenix.end2end.ArithmeticQueryIT
Tests run: 2, Failures: 0, Errors: 0, Skipped: 0, Time elapsed: 12.305 sec - in org.apache.phoenix.end2end.PhoenixRuntimeIT
Running org.apache.phoenix.end2end.ExpFunctionEnd2EndIT
Running org.apache.phoenix.end2end.InListIT
Tests run: 3, Failures: 0, Errors: 0, Skipped: 0, Time elapsed: 6.74 sec - in org.apache.phoenix.end2end.ExpFunctionEnd2EndIT
Running org.apache.phoenix.end2end.SortMergeJoinIT
Tests run: 6, Failures: 0, Errors: 0, Skipped: 0, Time elapsed: 44.717 sec - in org.apache.phoenix.end2end.UpgradeIT
Running org.apache.phoenix.end2end.StoreNullsIT
Tests run: 15, Failures: 0, Errors: 0, Skipped: 0, Time elapsed: 143.471 sec - in org.apache.phoenix.end2end.AlterTableWithViewsIT
Running org.apache.phoenix.end2end.GetSetByteBitFunctionEnd2EndIT
Tests run: 1, Failures: 0, Errors: 0, Skipped: 0, Time elapsed: 1.771 sec - in org.apache.phoenix.end2end.GetSetByteBitFunctionEnd2EndIT
Running org.apache.phoenix.iterate.RoundRobinResultIteratorIT
Tests run: 3, Failures: 0, Errors: 0, Skipped: 0, Time elapsed: 17.074 sec - in org.apache.phoenix.end2end.StoreNullsIT
Running org.apache.phoenix.iterate.PhoenixQueryTimeoutIT
Tests run: 2, Failures: 0, Errors: 0, Skipped: 0, Time elapsed: 3.099 sec - in org.apache.phoenix.iterate.PhoenixQueryTimeoutIT
Tests run: 108, Failures: 0, Errors: 0, Skipped: 0, Time elapsed: 122.111 sec - in org.apache.phoenix.end2end.SpooledSortMergeJoinIT
Tests run: 9, Failures: 0, Errors: 0, Skipped: 0, Time elapsed: 46.974 sec - in org.apache.phoenix.iterate.RoundRobinResultIteratorIT
Tests run: 108, Failures: 0, Errors: 0, Skipped: 0, Time elapsed: 111.466 sec - in org.apache.phoenix.end2end.SortMergeJoinIT
Tests run: 28, Failures: 0, Errors: 0, Skipped: 0, Time elapsed: 125.654 sec - in org.apache.phoenix.end2end.InListIT

Results :




Tests run: 1174, Failures: 0, Errors: 0, Skipped: 0

[INFO] 
[INFO] --- maven-failsafe-plugin:2.18:integration-test (NeedTheirOwnClusterTests) @ phoenix-core
---
[INFO] Failsafe report directory: <https://builds.apache.org/job/Phoenix-4.x-HBase-0.98/ws/phoenix-core/target/failsafe-reports>
[INFO] parallel='none', perCoreThreadCount=true, threadCount=0, useUnlimitedThreads=false,
threadCountSuites=0, threadCountClasses=0, threadCountMethods=0, parallelOptimized=true

-------------------------------------------------------
 T E S T S
-------------------------------------------------------
Running org.apache.hadoop.hbase.regionserver.wal.WALReplayWithIndexWritesAndUncompressedWALInHBase_094_9_IT
Running org.apache.hadoop.hbase.regionserver.wal.WALReplayWithIndexWritesAndCompressedWALIT
Running org.apache.phoenix.hbase.index.covered.EndToEndCoveredColumnsIndexBuilderIT
Tests run: 1, Failures: 0, Errors: 0, Skipped: 0, Time elapsed: 15.973 sec - in org.apache.hadoop.hbase.regionserver.wal.WALReplayWithIndexWritesAndUncompressedWALInHBase_094_9_IT
Tests run: 1, Failures: 0, Errors: 0, Skipped: 0, Time elapsed: 15.947 sec - in org.apache.hadoop.hbase.regionserver.wal.WALReplayWithIndexWritesAndCompressedWALIT
Tests run: 2, Failures: 0, Errors: 0, Skipped: 0, Time elapsed: 7.838 sec - in org.apache.phoenix.hbase.index.covered.EndToEndCoveredColumnsIndexBuilderIT
Running org.apache.phoenix.rpc.PhoenixClientRpcIT
Running org.apache.phoenix.rpc.PhoenixServerRpcIT
Running org.apache.phoenix.hbase.index.covered.example.EndToEndCoveredIndexingIT
Running org.apache.phoenix.hbase.index.covered.example.EndtoEndIndexingWithCompressionIT
Running org.apache.phoenix.hbase.index.covered.example.FailWithoutRetriesIT
Tests run: 2, Failures: 0, Errors: 0, Skipped: 0, Time elapsed: 6.744 sec - in org.apache.phoenix.rpc.PhoenixClientRpcIT
Running org.apache.phoenix.hbase.index.FailForUnsupportedHBaseVersionsIT
Tests run: 1, Failures: 0, Errors: 0, Skipped: 0, Time elapsed: 8.494 sec - in org.apache.phoenix.hbase.index.covered.example.FailWithoutRetriesIT
Tests run: 2, Failures: 0, Errors: 0, Skipped: 0, Time elapsed: 16.762 sec - in org.apache.phoenix.rpc.PhoenixServerRpcIT
Running org.apache.phoenix.hbase.index.balancer.IndexLoadBalancerIT
Tests run: 2, Failures: 0, Errors: 0, Skipped: 0, Time elapsed: 15.416 sec - in org.apache.phoenix.hbase.index.FailForUnsupportedHBaseVersionsIT
Running org.apache.phoenix.end2end.index.ImmutableIndexWithStatsIT
Running org.apache.phoenix.end2end.index.MutableIndexReplicationIT
Tests run: 1, Failures: 0, Errors: 0, Skipped: 0, Time elapsed: 11.197 sec - in org.apache.phoenix.end2end.index.ImmutableIndexWithStatsIT
Running org.apache.phoenix.end2end.index.MutableIndexFailureIT
Tests run: 11, Failures: 0, Errors: 0, Skipped: 0, Time elapsed: 48.47 sec - in org.apache.phoenix.hbase.index.covered.example.EndToEndCoveredIndexingIT
Tests run: 11, Failures: 0, Errors: 0, Skipped: 0, Time elapsed: 49.008 sec - in org.apache.phoenix.hbase.index.covered.example.EndtoEndIndexingWithCompressionIT
Tests run: 1, Failures: 0, Errors: 0, Skipped: 0, Time elapsed: 17.253 sec - in org.apache.phoenix.end2end.index.MutableIndexReplicationIT
Running org.apache.phoenix.end2end.TenantSpecificTablesDDLIT
Running org.apache.phoenix.end2end.StatsCollectorIT
Running org.apache.phoenix.end2end.StatsCollectorWithSplitsAndMultiCFIT
Tests run: 3, Failures: 0, Errors: 0, Skipped: 2, Time elapsed: 35.441 sec - in org.apache.phoenix.end2end.index.MutableIndexFailureIT
Running org.apache.phoenix.end2end.CountDistinctCompressionIT
Tests run: 17, Failures: 0, Errors: 0, Skipped: 0, Time elapsed: 31.209 sec - in org.apache.phoenix.end2end.TenantSpecificTablesDDLIT
Tests run: 2, Failures: 0, Errors: 0, Skipped: 0, Time elapsed: 27.154 sec - in org.apache.phoenix.end2end.StatsCollectorWithSplitsAndMultiCFIT
Tests run: 1, Failures: 0, Errors: 0, Skipped: 0, Time elapsed: 9.575 sec - in org.apache.phoenix.end2end.CountDistinctCompressionIT
Running org.apache.phoenix.end2end.SpillableGroupByIT
Running org.apache.phoenix.end2end.UnionAllIT
Tests run: 4, Failures: 0, Errors: 0, Skipped: 0, Time elapsed: 48.864 sec - in org.apache.phoenix.end2end.StatsCollectorIT
Running org.apache.phoenix.end2end.KeyOnlyIT
Tests run: 1, Failures: 0, Errors: 0, Skipped: 0, Time elapsed: 11.103 sec - in org.apache.phoenix.end2end.SpillableGroupByIT
Tests run: 9, Failures: 1, Errors: 0, Skipped: 0, Time elapsed: 108.272 sec <<< FAILURE!
- in org.apache.phoenix.hbase.index.balancer.IndexLoadBalancerIT
testRoundRobinAssignmentAfterRegionServerDown(org.apache.phoenix.hbase.index.balancer.IndexLoadBalancerIT)
 Time elapsed: 10.185 sec  <<< FAILURE!
java.lang.AssertionError: User regions and index regions should colocate.
	at org.junit.Assert.fail(Assert.java:88)
	at org.junit.Assert.assertTrue(Assert.java:41)
	at org.apache.phoenix.hbase.index.balancer.IndexLoadBalancerIT.testRoundRobinAssignmentAfterRegionServerDown(IndexLoadBalancerIT.java:367)

Tests run: 3, Failures: 0, Errors: 0, Skipped: 0, Time elapsed: 9.999 sec - in org.apache.phoenix.end2end.KeyOnlyIT
Tests run: 12, Failures: 0, Errors: 0, Skipped: 0, Time elapsed: 19.942 sec - in org.apache.phoenix.end2end.UnionAllIT
Running org.apache.phoenix.end2end.ViewIT
Running org.apache.phoenix.end2end.MultiCfQueryExecIT
Running org.apache.phoenix.end2end.ContextClassloaderIT
Tests run: 7, Failures: 0, Errors: 0, Skipped: 0, Time elapsed: 11.678 sec - in org.apache.phoenix.end2end.MultiCfQueryExecIT
Running org.apache.phoenix.end2end.QueryWithLimitIT
Running org.apache.phoenix.end2end.UserDefinedFunctionsIT
Tests run: 3, Failures: 0, Errors: 0, Skipped: 0, Time elapsed: 9.158 sec - in org.apache.phoenix.end2end.ContextClassloaderIT
Tests run: 2, Failures: 0, Errors: 0, Skipped: 0, Time elapsed: 10.124 sec - in org.apache.phoenix.end2end.QueryWithLimitIT
Running org.apache.phoenix.end2end.ParallelIteratorsIT
Tests run: 13, Failures: 0, Errors: 0, Skipped: 0, Time elapsed: 13.711 sec - in org.apache.phoenix.end2end.UserDefinedFunctionsIT
Running org.apache.phoenix.end2end.TenantSpecificTablesDMLIT
Tests run: 22, Failures: 0, Errors: 0, Skipped: 0, Time elapsed: 38.405 sec - in org.apache.phoenix.end2end.ViewIT
Running org.apache.phoenix.end2end.AlterTableIT
Running org.apache.phoenix.end2end.SaltedViewIT
Tests run: 3, Failures: 0, Errors: 0, Skipped: 0, Time elapsed: 22.085 sec - in org.apache.phoenix.end2end.ParallelIteratorsIT
Running org.apache.phoenix.end2end.QueryTimeoutIT
Tests run: 2, Failures: 0, Errors: 0, Skipped: 0, Time elapsed: 11.527 sec - in org.apache.phoenix.end2end.SaltedViewIT
Running org.apache.phoenix.end2end.ConnectionUtilIT
Tests run: 16, Failures: 0, Errors: 0, Skipped: 0, Time elapsed: 28.505 sec - in org.apache.phoenix.end2end.TenantSpecificTablesDMLIT
Tests run: 1, Failures: 0, Errors: 0, Skipped: 0, Time elapsed: 9.451 sec - in org.apache.phoenix.end2end.QueryTimeoutIT
Running org.apache.phoenix.mapreduce.IndexToolIT
Tests run: 1, Failures: 0, Errors: 0, Skipped: 0, Time elapsed: 18.655 sec - in org.apache.phoenix.end2end.ConnectionUtilIT
Running org.apache.phoenix.monitoring.PhoenixMetricsIT
Running org.apache.phoenix.mapreduce.CsvBulkLoadToolIT
Running org.apache.phoenix.execute.PartialCommitIT
Tests run: 6, Failures: 0, Errors: 0, Skipped: 0, Time elapsed: 6.312 sec - in org.apache.phoenix.execute.PartialCommitIT
Tests run: 17, Failures: 0, Errors: 0, Skipped: 0, Time elapsed: 34.187 sec - in org.apache.phoenix.monitoring.PhoenixMetricsIT
Tests run: 5, Failures: 0, Errors: 0, Skipped: 0, Time elapsed: 154.52 sec - in org.apache.phoenix.mapreduce.CsvBulkLoadToolIT
Tests run: 53, Failures: 0, Errors: 0, Skipped: 0, Time elapsed: 298.314 sec - in org.apache.phoenix.end2end.AlterTableIT
Tests run: 9, Failures: 0, Errors: 0, Skipped: 0, Time elapsed: 311.708 sec - in org.apache.phoenix.mapreduce.IndexToolIT
Running org.apache.phoenix.iterate.RoundRobinResultIteratorWithStatsIT
Tests run: 1, Failures: 0, Errors: 0, Skipped: 0, Time elapsed: 10.469 sec - in org.apache.phoenix.iterate.RoundRobinResultIteratorWithStatsIT

Results :

Failed tests: 
  IndexLoadBalancerIT.testRoundRobinAssignmentAfterRegionServerDown:367 User regions and index
regions should colocate.



Tests run: 248, Failures: 1, Errors: 0, Skipped: 2

[INFO] 
[INFO] --- maven-failsafe-plugin:2.18:verify (ClientManagedTimeTests) @ phoenix-core ---
[INFO] Failsafe report directory: <https://builds.apache.org/job/Phoenix-4.x-HBase-0.98/ws/phoenix-core/target/failsafe-reports>
[INFO] ------------------------------------------------------------------------
[INFO] Reactor Summary:
[INFO] 
[INFO] Apache Phoenix .................................... SUCCESS [4.155s]
[INFO] Phoenix Core ...................................... FAILURE [40:00.636s]
[INFO] Phoenix - Flume ................................... SKIPPED
[INFO] Phoenix - Pig ..................................... SKIPPED
[INFO] Phoenix Query Server Client ....................... SKIPPED
[INFO] Phoenix Query Server .............................. SKIPPED
[INFO] Phoenix - Pherf ................................... SKIPPED
[INFO] Phoenix - Spark ................................... SKIPPED
[INFO] Phoenix Assembly .................................. SKIPPED
[INFO] Phoenix - Tracing Web Application ................. SKIPPED
[INFO] ------------------------------------------------------------------------
[INFO] BUILD FAILURE
[INFO] ------------------------------------------------------------------------
[INFO] Total time: 40:05.483s
[INFO] Finished at: Tue Nov 03 01:40:08 UTC 2015
[INFO] Final Memory: 58M/1076M
[INFO] ------------------------------------------------------------------------
[ERROR] Failed to execute goal org.apache.maven.plugins:maven-failsafe-plugin:2.18:verify
(ClientManagedTimeTests) on project phoenix-core: There are test failures.
[ERROR] 
[ERROR] Please refer to <https://builds.apache.org/job/Phoenix-4.x-HBase-0.98/ws/phoenix-core/target/failsafe-reports>
for the individual test results.
[ERROR] -> [Help 1]
[ERROR] 
[ERROR] To see the full stack trace of the errors, re-run Maven with the -e switch.
[ERROR] Re-run Maven using the -X switch to enable full debug logging.
[ERROR] 
[ERROR] For more information about the errors and possible solutions, please read the following
articles:
[ERROR] [Help 1] http://cwiki.apache.org/confluence/display/MAVEN/MojoFailureException
[ERROR] 
[ERROR] After correcting the problems, you can resume the build with the command
[ERROR]   mvn <goals> -rf :phoenix-core
Build step 'Invoke top-level Maven targets' marked build as failure
Archiving artifacts
Compressed 1.13 GB of artifacts by 50.5% relative to #883
Recording test results

Mime
View raw message