phoenix-commits mailing list archives

Site index · List index
Message view « Date » · « Thread »
Top « Date » · « Thread »
From Apache Jenkins Server <jenk...@builds.apache.org>
Subject Build failed in Jenkins: Phoenix | Master #954
Date Fri, 13 Nov 2015 02:15:14 GMT
See <https://builds.apache.org/job/Phoenix-master/954/changes>

Changes:

[jtaylor] PHOENIX-2409 Create getTable() convenience method on PhoenixConnection

[jtaylor] PHOENIX-2410 Move NUM_MILLIS_IN_DAY constant to TestUtil

------------------------------------------
[...truncated 7238 lines...]
Running org.apache.phoenix.end2end.InstrFunctionIT
Tests run: 8, Failures: 0, Errors: 0, Skipped: 0, Time elapsed: 9.928 sec - in org.apache.phoenix.end2end.InstrFunctionIT
Running org.apache.phoenix.end2end.MD5FunctionIT
Tests run: 22, Failures: 0, Errors: 0, Skipped: 0, Time elapsed: 52.463 sec - in org.apache.phoenix.end2end.DeleteIT
Running org.apache.phoenix.end2end.SqrtFunctionEnd2EndIT
Tests run: 3, Failures: 0, Errors: 0, Skipped: 0, Time elapsed: 12.095 sec - in org.apache.phoenix.end2end.MD5FunctionIT
Running org.apache.phoenix.end2end.UpsertSelectAutoCommitIT
Tests run: 2, Failures: 0, Errors: 0, Skipped: 0, Time elapsed: 11.022 sec - in org.apache.phoenix.end2end.SqrtFunctionEnd2EndIT
Running org.apache.phoenix.end2end.ExecuteStatementsIT
Tests run: 62, Failures: 0, Errors: 0, Skipped: 0, Time elapsed: 268.494 sec - in org.apache.phoenix.end2end.index.IndexExpressionIT
Running org.apache.phoenix.end2end.StringToArrayFunctionIT
Tests run: 3, Failures: 0, Errors: 0, Skipped: 0, Time elapsed: 27.102 sec - in org.apache.phoenix.end2end.UpsertSelectAutoCommitIT
Running org.apache.phoenix.end2end.GetSetByteBitFunctionEnd2EndIT
Tests run: 1, Failures: 0, Errors: 0, Skipped: 0, Time elapsed: 5.407 sec - in org.apache.phoenix.end2end.GetSetByteBitFunctionEnd2EndIT
Running org.apache.phoenix.end2end.HashJoinIT
Tests run: 2, Failures: 0, Errors: 0, Skipped: 0, Time elapsed: 28.507 sec - in org.apache.phoenix.end2end.ExecuteStatementsIT
Running org.apache.phoenix.end2end.TenantSpecificViewIndexIT
Tests run: 15, Failures: 0, Errors: 0, Skipped: 0, Time elapsed: 158.204 sec - in org.apache.phoenix.end2end.TenantIdTypeIT
Running org.apache.phoenix.end2end.CoalesceFunctionIT
Tests run: 22, Failures: 0, Errors: 0, Skipped: 0, Time elapsed: 26.557 sec - in org.apache.phoenix.end2end.StringToArrayFunctionIT
Running org.apache.phoenix.end2end.ArraysWithNullsIT
Tests run: 10, Failures: 0, Errors: 0, Skipped: 0, Time elapsed: 20.361 sec - in org.apache.phoenix.end2end.CoalesceFunctionIT
Running org.apache.phoenix.end2end.TimezoneOffsetFunctionIT
Tests run: 8, Failures: 0, Errors: 0, Skipped: 0, Time elapsed: 32.915 sec - in org.apache.phoenix.end2end.TenantSpecificViewIndexIT
Running org.apache.phoenix.end2end.SubqueryIT
Tests run: 7, Failures: 0, Errors: 0, Skipped: 0, Time elapsed: 13.202 sec - in org.apache.phoenix.end2end.TimezoneOffsetFunctionIT
Running org.apache.phoenix.end2end.ArithmeticQueryIT
Tests run: 28, Failures: 0, Errors: 0, Skipped: 0, Time elapsed: 172.3 sec - in org.apache.phoenix.end2end.InListIT
Running org.apache.phoenix.end2end.ArrayToStringFunctionIT
Tests run: 36, Failures: 0, Errors: 0, Skipped: 0, Time elapsed: 35.258 sec - in org.apache.phoenix.end2end.ArrayToStringFunctionIT
Running org.apache.phoenix.end2end.ReverseFunctionIT
Tests run: 5, Failures: 0, Errors: 0, Skipped: 0, Time elapsed: 7.617 sec - in org.apache.phoenix.end2end.ReverseFunctionIT
Running org.apache.phoenix.end2end.DateTimeIT
Tests run: 16, Failures: 0, Errors: 0, Skipped: 0, Time elapsed: 84.979 sec - in org.apache.phoenix.end2end.ArraysWithNullsIT
Running org.apache.phoenix.end2end.SortOrderIT
Tests run: 26, Failures: 0, Errors: 0, Skipped: 0, Time elapsed: 56.546 sec - in org.apache.phoenix.end2end.ArithmeticQueryIT
Running org.apache.phoenix.end2end.RegexpSplitFunctionIT
Tests run: 11, Failures: 0, Errors: 0, Skipped: 0, Time elapsed: 10.465 sec - in org.apache.phoenix.end2end.RegexpSplitFunctionIT
Running org.apache.phoenix.end2end.LnLogFunctionEnd2EndIT
Tests run: 21, Failures: 0, Errors: 0, Skipped: 0, Time elapsed: 79.79 sec - in org.apache.phoenix.end2end.SubqueryIT
Running org.apache.phoenix.end2end.PowerFunctionEnd2EndIT
Tests run: 19, Failures: 0, Errors: 0, Skipped: 0, Time elapsed: 23.143 sec - in org.apache.phoenix.end2end.DateTimeIT
Running org.apache.phoenix.end2end.FirstValueFunctionIT
Tests run: 1, Failures: 0, Errors: 0, Skipped: 0, Time elapsed: 9.934 sec - in org.apache.phoenix.end2end.PowerFunctionEnd2EndIT
Running org.apache.phoenix.end2end.QueryExecWithoutSCNIT
Tests run: 1, Failures: 0, Errors: 0, Skipped: 0, Time elapsed: 11.751 sec - in org.apache.phoenix.end2end.LnLogFunctionEnd2EndIT
Running org.apache.phoenix.end2end.ConvertTimezoneFunctionIT
Tests run: 7, Failures: 0, Errors: 0, Skipped: 0, Time elapsed: 8.682 sec - in org.apache.phoenix.end2end.FirstValueFunctionIT
Running org.apache.phoenix.end2end.StatementHintsIT
Tests run: 1, Failures: 0, Errors: 0, Skipped: 0, Time elapsed: 6.02 sec - in org.apache.phoenix.end2end.QueryExecWithoutSCNIT
Running org.apache.phoenix.end2end.UpsertBigValuesIT
Tests run: 7, Failures: 0, Errors: 0, Skipped: 0, Time elapsed: 8.572 sec - in org.apache.phoenix.end2end.ConvertTimezoneFunctionIT
Running org.apache.phoenix.end2end.AlterTableWithViewsIT
Tests run: 2, Failures: 0, Errors: 0, Skipped: 0, Time elapsed: 6.995 sec - in org.apache.phoenix.end2end.StatementHintsIT
Running org.apache.phoenix.end2end.salted.SaltedTableUpsertSelectIT
Tests run: 4, Failures: 0, Errors: 0, Skipped: 0, Time elapsed: 19.737 sec - in org.apache.phoenix.end2end.UpsertBigValuesIT
Running org.apache.phoenix.end2end.salted.SaltedTableVarLengthRowKeyIT
Tests run: 1, Failures: 0, Errors: 0, Skipped: 0, Time elapsed: 6.011 sec - in org.apache.phoenix.end2end.salted.SaltedTableVarLengthRowKeyIT
Running org.apache.phoenix.end2end.QueryMoreIT
Tests run: 5, Failures: 0, Errors: 0, Skipped: 0, Time elapsed: 21.365 sec - in org.apache.phoenix.end2end.salted.SaltedTableUpsertSelectIT
Running org.apache.phoenix.end2end.ReverseScanIT
Tests run: 3, Failures: 0, Errors: 0, Skipped: 0, Time elapsed: 12.52 sec - in org.apache.phoenix.end2end.ReverseScanIT
Running org.apache.phoenix.end2end.AlterSessionIT
Tests run: 2, Failures: 0, Errors: 0, Skipped: 0, Time elapsed: 6.046 sec - in org.apache.phoenix.end2end.AlterSessionIT
Running org.apache.phoenix.end2end.RTrimFunctionIT
Tests run: 2, Failures: 0, Errors: 0, Skipped: 0, Time elapsed: 6.993 sec - in org.apache.phoenix.end2end.RTrimFunctionIT
Running org.apache.phoenix.end2end.StoreNullsIT
Tests run: 5, Failures: 0, Errors: 0, Skipped: 0, Time elapsed: 33.915 sec - in org.apache.phoenix.end2end.QueryMoreIT
Running org.apache.phoenix.end2end.PhoenixRuntimeIT
Tests run: 45, Failures: 0, Errors: 0, Skipped: 0, Time elapsed: 101.779 sec - in org.apache.phoenix.end2end.SortOrderIT
Running org.apache.phoenix.end2end.RegexpSubstrFunctionIT
Tests run: 2, Failures: 0, Errors: 0, Skipped: 0, Time elapsed: 6.045 sec - in org.apache.phoenix.end2end.RegexpSubstrFunctionIT
Running org.apache.phoenix.end2end.ServerExceptionIT
Tests run: 1, Failures: 0, Errors: 0, Skipped: 0, Time elapsed: 5.455 sec - in org.apache.phoenix.end2end.ServerExceptionIT
Running org.apache.phoenix.end2end.ExpFunctionEnd2EndIT
Tests run: 3, Failures: 0, Errors: 0, Skipped: 0, Time elapsed: 29.869 sec - in org.apache.phoenix.end2end.StoreNullsIT
Running org.apache.phoenix.end2end.ArrayAppendFunctionIT
Tests run: 2, Failures: 0, Errors: 0, Skipped: 0, Time elapsed: 31.596 sec - in org.apache.phoenix.end2end.PhoenixRuntimeIT
Running org.apache.phoenix.end2end.AutoCommitIT
Tests run: 1, Failures: 0, Errors: 0, Skipped: 0, Time elapsed: 5.003 sec - in org.apache.phoenix.end2end.AutoCommitIT
Running org.apache.phoenix.end2end.SortMergeJoinIT
Tests run: 3, Failures: 0, Errors: 0, Skipped: 0, Time elapsed: 17.522 sec - in org.apache.phoenix.end2end.ExpFunctionEnd2EndIT
Running org.apache.phoenix.end2end.StddevIT
Tests run: 4, Failures: 0, Errors: 0, Skipped: 0, Time elapsed: 8.227 sec - in org.apache.phoenix.end2end.StddevIT
Running org.apache.phoenix.end2end.IsNullIT
Tests run: 34, Failures: 0, Errors: 0, Skipped: 0, Time elapsed: 34.543 sec - in org.apache.phoenix.end2end.ArrayAppendFunctionIT
Running org.apache.phoenix.end2end.SignFunctionEnd2EndIT
Tests run: 3, Failures: 0, Errors: 0, Skipped: 0, Time elapsed: 11.193 sec - in org.apache.phoenix.end2end.IsNullIT
Running org.apache.phoenix.end2end.LastValueFunctionIT
Tests run: 2, Failures: 0, Errors: 0, Skipped: 0, Time elapsed: 11.612 sec - in org.apache.phoenix.end2end.SignFunctionEnd2EndIT
Running org.apache.phoenix.end2end.HashJoinLocalIndexIT
Tests run: 11, Failures: 0, Errors: 0, Skipped: 0, Time elapsed: 15.492 sec - in org.apache.phoenix.end2end.LastValueFunctionIT
Running org.apache.phoenix.end2end.RoundFloorCeilFunctionsEnd2EndIT
Tests run: 31, Failures: 0, Errors: 0, Skipped: 0, Time elapsed: 27.98 sec - in org.apache.phoenix.end2end.RoundFloorCeilFunctionsEnd2EndIT
Running org.apache.phoenix.end2end.LpadFunctionIT
Tests run: 1, Failures: 0, Errors: 0, Skipped: 0, Time elapsed: 36.739 sec - in org.apache.phoenix.end2end.HashJoinLocalIndexIT
Running org.apache.phoenix.iterate.RoundRobinResultIteratorIT
Tests run: 12, Failures: 0, Errors: 0, Skipped: 0, Time elapsed: 31.208 sec - in org.apache.phoenix.end2end.LpadFunctionIT
Running org.apache.phoenix.iterate.PhoenixQueryTimeoutIT
Tests run: 2, Failures: 0, Errors: 0, Skipped: 0, Time elapsed: 6.378 sec - in org.apache.phoenix.iterate.PhoenixQueryTimeoutIT
Tests run: 15, Failures: 0, Errors: 0, Skipped: 0, Time elapsed: 234.082 sec - in org.apache.phoenix.end2end.AlterTableWithViewsIT
Tests run: 111, Failures: 0, Errors: 0, Skipped: 0, Time elapsed: 381.116 sec - in org.apache.phoenix.end2end.HashJoinIT
Tests run: 9, Failures: 0, Errors: 0, Skipped: 0, Time elapsed: 96.609 sec - in org.apache.phoenix.iterate.RoundRobinResultIteratorIT
Tests run: 108, Failures: 0, Errors: 0, Skipped: 0, Time elapsed: 178.905 sec - in org.apache.phoenix.end2end.SortMergeJoinIT

Results :

Tests run: 1179, Failures: 0, Errors: 0, Skipped: 0

[INFO] 
[INFO] --- maven-failsafe-plugin:2.19:integration-test (NeedTheirOwnClusterTests) @ phoenix-core
---

-------------------------------------------------------
 T E S T S
-------------------------------------------------------
Running org.apache.phoenix.hbase.index.balancer.IndexLoadBalancerIT
Running org.apache.phoenix.rpc.PhoenixServerRpcIT
Running org.apache.phoenix.rpc.PhoenixClientRpcIT
Running org.apache.phoenix.monitoring.PhoenixMetricsIT
Running org.apache.phoenix.hbase.index.covered.example.EndToEndCoveredIndexingIT
Tests run: 2, Failures: 0, Errors: 0, Skipped: 0, Time elapsed: 14.196 sec - in org.apache.phoenix.rpc.PhoenixServerRpcIT
Tests run: 2, Failures: 0, Errors: 0, Skipped: 0, Time elapsed: 14.318 sec - in org.apache.phoenix.rpc.PhoenixClientRpcIT
Running org.apache.phoenix.hbase.index.covered.example.FailWithoutRetriesIT
Tests run: 1, Failures: 0, Errors: 0, Skipped: 0, Time elapsed: 9.077 sec - in org.apache.phoenix.hbase.index.covered.example.FailWithoutRetriesIT
Running org.apache.phoenix.hbase.index.covered.example.EndtoEndIndexingWithCompressionIT
Running org.apache.phoenix.hbase.index.covered.EndToEndCoveredColumnsIndexBuilderIT
Tests run: 2, Failures: 0, Errors: 0, Skipped: 0, Time elapsed: 19.393 sec - in org.apache.phoenix.hbase.index.covered.EndToEndCoveredColumnsIndexBuilderIT
Running org.apache.phoenix.hbase.index.FailForUnsupportedHBaseVersionsIT
Tests run: 17, Failures: 2, Errors: 0, Skipped: 0, Time elapsed: 64.934 sec <<< FAILURE!
- in org.apache.phoenix.monitoring.PhoenixMetricsIT
testMetricsForUpsertSelectWithAutoCommit(org.apache.phoenix.monitoring.PhoenixMetricsIT) 
Time elapsed: 5.478 sec  <<< FAILURE!
java.lang.AssertionError: Unequal values for metric MUTATION_BYTES expected:<5600> but
was:<16240>
	at org.apache.phoenix.monitoring.PhoenixMetricsIT.assertMetricsHaveSameValues(PhoenixMetricsIT.java:654)
	at org.apache.phoenix.monitoring.PhoenixMetricsIT.assertMetricsAreSame(PhoenixMetricsIT.java:643)
	at org.apache.phoenix.monitoring.PhoenixMetricsIT.testMetricsForUpsertSelectWithAutoCommit(PhoenixMetricsIT.java:462)

testMetricsForUpsertSelectSameTable(org.apache.phoenix.monitoring.PhoenixMetricsIT)  Time
elapsed: 3.426 sec  <<< FAILURE!
java.lang.AssertionError: Unequal values for metric MUTATION_BYTES expected:<5600> but
was:<16240>
	at org.apache.phoenix.monitoring.PhoenixMetricsIT.assertMetricsHaveSameValues(PhoenixMetricsIT.java:654)
	at org.apache.phoenix.monitoring.PhoenixMetricsIT.assertMetricsAreSame(PhoenixMetricsIT.java:643)
	at org.apache.phoenix.monitoring.PhoenixMetricsIT.testMetricsForUpsertSelectSameTable(PhoenixMetricsIT.java:615)

Tests run: 2, Failures: 0, Errors: 0, Skipped: 0, Time elapsed: 16.329 sec - in org.apache.phoenix.hbase.index.FailForUnsupportedHBaseVersionsIT
Running org.apache.phoenix.end2end.ConnectionUtilIT
Running org.apache.phoenix.end2end.SpillableGroupByIT
Tests run: 1, Failures: 0, Errors: 0, Skipped: 0, Time elapsed: 19.478 sec - in org.apache.phoenix.end2end.ConnectionUtilIT
Tests run: 1, Failures: 0, Errors: 0, Skipped: 0, Time elapsed: 7.829 sec - in org.apache.phoenix.end2end.SpillableGroupByIT
Running org.apache.phoenix.end2end.KeyOnlyIT
Running org.apache.phoenix.end2end.ParallelIteratorsIT
Tests run: 11, Failures: 0, Errors: 0, Skipped: 0, Time elapsed: 123.542 sec - in org.apache.phoenix.hbase.index.covered.example.EndToEndCoveredIndexingIT
Tests run: 3, Failures: 0, Errors: 0, Skipped: 0, Time elapsed: 17.281 sec - in org.apache.phoenix.end2end.KeyOnlyIT
Running org.apache.phoenix.end2end.index.MutableIndexReplicationIT
Tests run: 9, Failures: 0, Errors: 0, Skipped: 0, Time elapsed: 161.915 sec - in org.apache.phoenix.hbase.index.balancer.IndexLoadBalancerIT
Running org.apache.phoenix.end2end.index.MutableIndexFailureIT
Tests run: 3, Failures: 0, Errors: 0, Skipped: 0, Time elapsed: 37.209 sec - in org.apache.phoenix.end2end.ParallelIteratorsIT
Tests run: 11, Failures: 0, Errors: 0, Skipped: 0, Time elapsed: 117.461 sec - in org.apache.phoenix.hbase.index.covered.example.EndtoEndIndexingWithCompressionIT
Running org.apache.phoenix.end2end.index.ImmutableIndexWithStatsIT
Tests run: 1, Failures: 0, Errors: 0, Skipped: 0, Time elapsed: 27.765 sec - in org.apache.phoenix.end2end.index.MutableIndexReplicationIT
Tests run: 1, Failures: 0, Errors: 0, Skipped: 0, Time elapsed: 8.134 sec - in org.apache.phoenix.end2end.index.ImmutableIndexWithStatsIT
Running org.apache.phoenix.end2end.ViewIT
Tests run: 3, Failures: 0, Errors: 0, Skipped: 2, Time elapsed: 43.672 sec - in org.apache.phoenix.end2end.index.MutableIndexFailureIT
Running org.apache.phoenix.end2end.AlterTableIT
Running org.apache.phoenix.end2end.QueryWithLimitIT
Tests run: 2, Failures: 0, Errors: 0, Skipped: 0, Time elapsed: 18.8 sec - in org.apache.phoenix.end2end.QueryWithLimitIT
Running org.apache.phoenix.end2end.StatsCollectorIT
Tests run: 22, Failures: 0, Errors: 0, Skipped: 0, Time elapsed: 68.06 sec - in org.apache.phoenix.end2end.ViewIT
Running org.apache.phoenix.end2end.StatsCollectorWithSplitsAndMultiCFIT
Tests run: 2, Failures: 0, Errors: 0, Skipped: 0, Time elapsed: 28.199 sec - in org.apache.phoenix.end2end.StatsCollectorWithSplitsAndMultiCFIT
Tests run: 4, Failures: 0, Errors: 0, Skipped: 0, Time elapsed: 57.681 sec - in org.apache.phoenix.end2end.StatsCollectorIT
Running org.apache.phoenix.end2end.CountDistinctCompressionIT
Tests run: 1, Failures: 0, Errors: 0, Skipped: 0, Time elapsed: 8.179 sec - in org.apache.phoenix.end2end.CountDistinctCompressionIT
Running org.apache.phoenix.end2end.UserDefinedFunctionsIT
Running org.apache.phoenix.end2end.TenantSpecificTablesDMLIT
Tests run: 13, Failures: 0, Errors: 0, Skipped: 0, Time elapsed: 31.297 sec - in org.apache.phoenix.end2end.UserDefinedFunctionsIT
Tests run: 16, Failures: 0, Errors: 0, Skipped: 0, Time elapsed: 38.19 sec - in org.apache.phoenix.end2end.TenantSpecificTablesDMLIT
Running org.apache.phoenix.end2end.SaltedViewIT
Running org.apache.phoenix.end2end.QueryTimeoutIT
Tests run: 2, Failures: 0, Errors: 0, Skipped: 0, Time elapsed: 15.691 sec - in org.apache.phoenix.end2end.SaltedViewIT
Tests run: 1, Failures: 0, Errors: 0, Skipped: 0, Time elapsed: 18.221 sec - in org.apache.phoenix.end2end.QueryTimeoutIT
Running org.apache.phoenix.end2end.UnionAllIT
Running org.apache.phoenix.end2end.MultiCfQueryExecIT
Tests run: 12, Failures: 0, Errors: 0, Skipped: 0, Time elapsed: 28.239 sec - in org.apache.phoenix.end2end.UnionAllIT
Tests run: 7, Failures: 0, Errors: 0, Skipped: 0, Time elapsed: 18.356 sec - in org.apache.phoenix.end2end.MultiCfQueryExecIT
Running org.apache.phoenix.iterate.RoundRobinResultIteratorWithStatsIT
Running org.apache.phoenix.execute.PartialCommitIT
Tests run: 6, Failures: 0, Errors: 0, Skipped: 0, Time elapsed: 3.508 sec - in org.apache.phoenix.execute.PartialCommitIT
Tests run: 1, Failures: 0, Errors: 0, Skipped: 0, Time elapsed: 8.254 sec - in org.apache.phoenix.iterate.RoundRobinResultIteratorWithStatsIT
Running org.apache.phoenix.mapreduce.IndexToolIT
Running org.apache.phoenix.mapreduce.CsvBulkLoadToolIT
Tests run: 55, Failures: 0, Errors: 0, Skipped: 0, Time elapsed: 398.157 sec - in org.apache.phoenix.end2end.AlterTableIT
Running org.apache.hadoop.hbase.regionserver.wal.WALReplayWithIndexWritesAndCompressedWALIT
Tests run: 1, Failures: 0, Errors: 0, Skipped: 0, Time elapsed: 22.51 sec - in org.apache.hadoop.hbase.regionserver.wal.WALReplayWithIndexWritesAndCompressedWALIT
Running org.apache.hadoop.hbase.regionserver.wal.WALReplayWithIndexWritesAndUncompressedWALInHBase_094_9_IT
Tests run: 1, Failures: 0, Errors: 0, Skipped: 0, Time elapsed: 22.426 sec - in org.apache.hadoop.hbase.regionserver.wal.WALReplayWithIndexWritesAndUncompressedWALInHBase_094_9_IT
Tests run: 5, Failures: 0, Errors: 0, Skipped: 0, Time elapsed: 172.128 sec - in org.apache.phoenix.mapreduce.CsvBulkLoadToolIT
Tests run: 9, Failures: 0, Errors: 0, Skipped: 0, Time elapsed: 352.381 sec - in org.apache.phoenix.mapreduce.IndexToolIT
Running org.apache.phoenix.end2end.TenantSpecificTablesDDLIT
Running org.apache.phoenix.end2end.ContextClassloaderIT
Tests run: 3, Failures: 0, Errors: 0, Skipped: 0, Time elapsed: 6.192 sec - in org.apache.phoenix.end2end.ContextClassloaderIT
Tests run: 17, Failures: 0, Errors: 0, Skipped: 0, Time elapsed: 42.064 sec - in org.apache.phoenix.end2end.TenantSpecificTablesDDLIT

Results :

Failed tests: 
  PhoenixMetricsIT.testMetricsForUpsertSelectSameTable:615->assertMetricsAreSame:643->assertMetricsHaveSameValues:654
Unequal values for metric MUTATION_BYTES expected:<5600> but was:<16240>
  PhoenixMetricsIT.testMetricsForUpsertSelectWithAutoCommit:462->assertMetricsAreSame:643->assertMetricsHaveSameValues:654
Unequal values for metric MUTATION_BYTES expected:<5600> but was:<16240>

Tests run: 250, Failures: 2, Errors: 0, Skipped: 2

[INFO] 
[INFO] --- maven-failsafe-plugin:2.19:verify (ClientManagedTimeTests) @ phoenix-core ---
[INFO] ------------------------------------------------------------------------
[INFO] Reactor Summary:
[INFO] 
[INFO] Apache Phoenix .................................... SUCCESS [3.064s]
[INFO] Phoenix Core ...................................... FAILURE [48:16.103s]
[INFO] Phoenix - Flume ................................... SKIPPED
[INFO] Phoenix - Pig ..................................... SKIPPED
[INFO] Phoenix Query Server Client ....................... SKIPPED
[INFO] Phoenix Query Server .............................. SKIPPED
[INFO] Phoenix - Pherf ................................... SKIPPED
[INFO] Phoenix - Spark ................................... SKIPPED
[INFO] Phoenix Assembly .................................. SKIPPED
[INFO] Phoenix - Tracing Web Application ................. SKIPPED
[INFO] ------------------------------------------------------------------------
[INFO] BUILD FAILURE
[INFO] ------------------------------------------------------------------------
[INFO] Total time: 48:19.697s
[INFO] Finished at: Fri Nov 13 02:11:44 UTC 2015
[INFO] Final Memory: 63M/1025M
[INFO] ------------------------------------------------------------------------
[ERROR] Failed to execute goal org.apache.maven.plugins:maven-failsafe-plugin:2.19:verify
(ClientManagedTimeTests) on project phoenix-core: There are test failures.
[ERROR] 
[ERROR] Please refer to <https://builds.apache.org/job/Phoenix-master/ws/phoenix-core/target/failsafe-reports>
for the individual test results.
[ERROR] -> [Help 1]
[ERROR] 
[ERROR] To see the full stack trace of the errors, re-run Maven with the -e switch.
[ERROR] Re-run Maven using the -X switch to enable full debug logging.
[ERROR] 
[ERROR] For more information about the errors and possible solutions, please read the following
articles:
[ERROR] [Help 1] http://cwiki.apache.org/confluence/display/MAVEN/MojoFailureException
[ERROR] 
[ERROR] After correcting the problems, you can resume the build with the command
[ERROR]   mvn <goals> -rf :phoenix-core
Build step 'Invoke top-level Maven targets' marked build as failure
Archiving artifacts
Compressed 1.24 GB of artifacts by 56.0% relative to #951
Updating PHOENIX-2409
Updating PHOENIX-2410
Recording test results

Mime
View raw message