phoenix-commits mailing list archives

Site index · List index
Message view « Date » · « Thread »
Top « Date » · « Thread »
From Apache Jenkins Server <jenk...@builds.apache.org>
Subject Build failed in Jenkins: Phoenix | Master #928
Date Sun, 18 Oct 2015 05:23:31 GMT
See <https://builds.apache.org/job/Phoenix-master/928/changes>

Changes:

[rajeshbabu] PHOENIX-2313 TypeMismatchException thrown while querying a table that

------------------------------------------
[...truncated 7327 lines...]
Running org.apache.phoenix.end2end.QueryMoreIT
Tests run: 2, Failures: 0, Errors: 0, Skipped: 0, Time elapsed: 17.112 sec - in org.apache.phoenix.end2end.SignFunctionEnd2EndIT
Running org.apache.phoenix.end2end.TenantIdTypeIT
Tests run: 108, Failures: 0, Errors: 0, Skipped: 0, Time elapsed: 626.585 sec - in org.apache.phoenix.end2end.SpooledSortMergeJoinIT
Running org.apache.phoenix.end2end.ArrayConcatFunctionIT
Tests run: 5, Failures: 0, Errors: 0, Skipped: 0, Time elapsed: 52.404 sec - in org.apache.phoenix.end2end.QueryMoreIT
Running org.apache.phoenix.end2end.ConvertTimezoneFunctionIT
Tests run: 30, Failures: 0, Errors: 0, Skipped: 0, Time elapsed: 42.334 sec - in org.apache.phoenix.end2end.ArrayConcatFunctionIT
Running org.apache.phoenix.end2end.LnLogFunctionEnd2EndIT
Tests run: 7, Failures: 0, Errors: 0, Skipped: 0, Time elapsed: 11.188 sec - in org.apache.phoenix.end2end.ConvertTimezoneFunctionIT
Running org.apache.phoenix.trace.PhoenixTraceReaderIT
Tests run: 21, Failures: 0, Errors: 0, Skipped: 0, Time elapsed: 115.044 sec - in org.apache.phoenix.end2end.SubqueryIT
Running org.apache.phoenix.trace.PhoenixTracingEndToEndIT
Tests run: 2, Failures: 0, Errors: 0, Skipped: 0, Time elapsed: 3.348 sec - in org.apache.phoenix.trace.PhoenixTraceReaderIT
Running org.apache.phoenix.trace.PhoenixTableMetricsWriterIT
Tests run: 2, Failures: 0, Errors: 0, Skipped: 0, Time elapsed: 1.069 sec - in org.apache.phoenix.trace.PhoenixTableMetricsWriterIT
Running org.apache.phoenix.rpc.UpdateCacheIT
Tests run: 1, Failures: 0, Errors: 0, Skipped: 0, Time elapsed: 13.551 sec - in org.apache.phoenix.end2end.LnLogFunctionEnd2EndIT
Tests run: 1, Failures: 0, Errors: 0, Skipped: 0, Time elapsed: 7.262 sec - in org.apache.phoenix.rpc.UpdateCacheIT
Tests run: 6, Failures: 0, Errors: 0, Skipped: 0, Time elapsed: 91.121 sec - in org.apache.phoenix.trace.PhoenixTracingEndToEndIT
Tests run: 15, Failures: 0, Errors: 0, Skipped: 0, Time elapsed: 184.877 sec - in org.apache.phoenix.end2end.TenantIdTypeIT
Tests run: 108, Failures: 0, Errors: 0, Skipped: 0, Time elapsed: 445.448 sec - in org.apache.phoenix.end2end.SortMergeJoinIT

Results :




Tests run: 1176, Failures: 0, Errors: 0, Skipped: 0

[INFO] 
[INFO] --- maven-failsafe-plugin:2.18:integration-test (NeedTheirOwnClusterTests) @ phoenix-core
---
[INFO] Failsafe report directory: <https://builds.apache.org/job/Phoenix-master/ws/phoenix-core/target/failsafe-reports>
[INFO] parallel='none', perCoreThreadCount=true, threadCount=0, useUnlimitedThreads=false,
threadCountSuites=0, threadCountClasses=0, threadCountMethods=0, parallelOptimized=true

-------------------------------------------------------
 T E S T S
-------------------------------------------------------
Running org.apache.phoenix.end2end.ConnectionUtilIT
Running org.apache.phoenix.end2end.TenantSpecificTablesDMLIT
Running org.apache.phoenix.end2end.ViewIT
Running org.apache.phoenix.iterate.RoundRobinResultIteratorWithStatsIT
Running org.apache.phoenix.execute.PartialCommitIT
Tests run: 1, Failures: 0, Errors: 0, Skipped: 0, Time elapsed: 28.081 sec - in org.apache.phoenix.end2end.ConnectionUtilIT
Running org.apache.phoenix.end2end.index.MutableIndexFailureIT
Tests run: 6, Failures: 0, Errors: 0, Skipped: 0, Time elapsed: 4.774 sec - in org.apache.phoenix.execute.PartialCommitIT
Tests run: 1, Failures: 0, Errors: 0, Skipped: 0, Time elapsed: 18.189 sec - in org.apache.phoenix.iterate.RoundRobinResultIteratorWithStatsIT
Running org.apache.phoenix.end2end.index.MutableIndexReplicationIT
Tests run: 16, Failures: 0, Errors: 0, Skipped: 0, Time elapsed: 52.369 sec - in org.apache.phoenix.end2end.TenantSpecificTablesDMLIT
Tests run: 3, Failures: 0, Errors: 0, Skipped: 2, Time elapsed: 55.122 sec - in org.apache.phoenix.end2end.index.MutableIndexFailureIT
Running org.apache.phoenix.end2end.QueryTimeoutIT
Tests run: 22, Failures: 0, Errors: 0, Skipped: 0, Time elapsed: 82.128 sec - in org.apache.phoenix.end2end.ViewIT
Tests run: 1, Failures: 0, Errors: 0, Skipped: 0, Time elapsed: 39.155 sec - in org.apache.phoenix.end2end.index.MutableIndexReplicationIT
Running org.apache.phoenix.end2end.QueryWithLimitIT
Tests run: 1, Failures: 0, Errors: 0, Skipped: 0, Time elapsed: 21.248 sec - in org.apache.phoenix.end2end.QueryTimeoutIT
Running org.apache.phoenix.end2end.StatsCollectorIT
Running org.apache.phoenix.end2end.KeyOnlyIT
Tests run: 2, Failures: 0, Errors: 0, Skipped: 0, Time elapsed: 24.079 sec - in org.apache.phoenix.end2end.QueryWithLimitIT
Running org.apache.phoenix.end2end.ContextClassloaderIT
Tests run: 3, Failures: 0, Errors: 0, Skipped: 0, Time elapsed: 15.304 sec - in org.apache.phoenix.end2end.KeyOnlyIT
Tests run: 3, Failures: 0, Errors: 0, Skipped: 0, Time elapsed: 11.417 sec - in org.apache.phoenix.end2end.ContextClassloaderIT
Running org.apache.phoenix.end2end.UnionAllIT
Running org.apache.phoenix.end2end.MultiCfQueryExecIT
Running org.apache.phoenix.end2end.UserDefinedFunctionsIT
Tests run: 7, Failures: 0, Errors: 0, Skipped: 0, Time elapsed: 24.906 sec - in org.apache.phoenix.end2end.MultiCfQueryExecIT
Tests run: 4, Failures: 0, Errors: 0, Skipped: 0, Time elapsed: 72.911 sec - in org.apache.phoenix.end2end.StatsCollectorIT
Tests run: 12, Failures: 0, Errors: 0, Skipped: 0, Time elapsed: 44.413 sec - in org.apache.phoenix.end2end.UnionAllIT
Running org.apache.phoenix.end2end.SaltedViewIT
Running org.apache.phoenix.end2end.AlterTableIT
Running org.apache.phoenix.end2end.TenantSpecificTablesDDLIT
Tests run: 13, Failures: 0, Errors: 0, Skipped: 0, Time elapsed: 48.156 sec - in org.apache.phoenix.end2end.UserDefinedFunctionsIT
Tests run: 2, Failures: 0, Errors: 0, Skipped: 0, Time elapsed: 21.899 sec - in org.apache.phoenix.end2end.SaltedViewIT
Running org.apache.phoenix.end2end.CountDistinctCompressionIT
Running org.apache.phoenix.end2end.SpillableGroupByIT
Tests run: 1, Failures: 0, Errors: 0, Skipped: 0, Time elapsed: 12.717 sec - in org.apache.phoenix.end2end.CountDistinctCompressionIT
Tests run: 1, Failures: 0, Errors: 0, Skipped: 0, Time elapsed: 11.99 sec - in org.apache.phoenix.end2end.SpillableGroupByIT
Tests run: 17, Failures: 0, Errors: 0, Skipped: 0, Time elapsed: 62.499 sec - in org.apache.phoenix.end2end.TenantSpecificTablesDDLIT
Running org.apache.phoenix.end2end.StatsCollectorWithSplitsAndMultiCFIT
Running org.apache.phoenix.end2end.ParallelIteratorsIT
Running org.apache.phoenix.mapreduce.IndexToolIT
Tests run: 9, Failures: 0, Errors: 9, Skipped: 0, Time elapsed: 2.557 sec <<< FAILURE!
- in org.apache.phoenix.mapreduce.IndexToolIT
testMutableGlobalIndex(org.apache.phoenix.mapreduce.IndexToolIT)  Time elapsed: 0.008 sec
 <<< ERROR!
java.sql.SQLException: No suitable driver found for jdbc:phoenix:localhost:64547
	at java.sql.DriverManager.getConnection(DriverManager.java:596)
	at java.sql.DriverManager.getConnection(DriverManager.java:187)
	at org.apache.phoenix.mapreduce.IndexToolIT.testSecondaryIndex(IndexToolIT.java:122)
	at org.apache.phoenix.mapreduce.IndexToolIT.testSecondaryIndex(IndexToolIT.java:114)
	at org.apache.phoenix.mapreduce.IndexToolIT.testMutableGlobalIndex(IndexToolIT.java:85)

testMutableGlobalIndexDirectApi(org.apache.phoenix.mapreduce.IndexToolIT)  Time elapsed: 0
sec  <<< ERROR!
java.sql.SQLException: No suitable driver found for jdbc:phoenix:localhost:64547
	at java.sql.DriverManager.getConnection(DriverManager.java:596)
	at java.sql.DriverManager.getConnection(DriverManager.java:187)
	at org.apache.phoenix.mapreduce.IndexToolIT.testSecondaryIndex(IndexToolIT.java:122)
	at org.apache.phoenix.mapreduce.IndexToolIT.testMutableGlobalIndexDirectApi(IndexToolIT.java:105)

testImmutableLocalIndexDirectApi(org.apache.phoenix.mapreduce.IndexToolIT)  Time elapsed:
0 sec  <<< ERROR!
java.sql.SQLException: No suitable driver found for jdbc:phoenix:localhost:64547
	at java.sql.DriverManager.getConnection(DriverManager.java:596)
	at java.sql.DriverManager.getConnection(DriverManager.java:187)
	at org.apache.phoenix.mapreduce.IndexToolIT.testSecondaryIndex(IndexToolIT.java:122)
	at org.apache.phoenix.mapreduce.IndexToolIT.testImmutableLocalIndexDirectApi(IndexToolIT.java:100)

testMutableLocalIndex(org.apache.phoenix.mapreduce.IndexToolIT)  Time elapsed: 0.001 sec 
<<< ERROR!
java.sql.SQLException: No suitable driver found for jdbc:phoenix:localhost:64547
	at java.sql.DriverManager.getConnection(DriverManager.java:596)
	at java.sql.DriverManager.getConnection(DriverManager.java:187)
	at org.apache.phoenix.mapreduce.IndexToolIT.testSecondaryIndex(IndexToolIT.java:122)
	at org.apache.phoenix.mapreduce.IndexToolIT.testSecondaryIndex(IndexToolIT.java:114)
	at org.apache.phoenix.mapreduce.IndexToolIT.testMutableLocalIndex(IndexToolIT.java:90)

testImmutableGlobalIndex(org.apache.phoenix.mapreduce.IndexToolIT)  Time elapsed: 0 sec  <<<
ERROR!
java.sql.SQLException: No suitable driver found for jdbc:phoenix:localhost:64547
	at java.sql.DriverManager.getConnection(DriverManager.java:596)
	at java.sql.DriverManager.getConnection(DriverManager.java:187)
	at org.apache.phoenix.mapreduce.IndexToolIT.testSecondaryIndex(IndexToolIT.java:122)
	at org.apache.phoenix.mapreduce.IndexToolIT.testSecondaryIndex(IndexToolIT.java:114)
	at org.apache.phoenix.mapreduce.IndexToolIT.testImmutableGlobalIndex(IndexToolIT.java:75)

testImmutableGlobalIndexDirectApi(org.apache.phoenix.mapreduce.IndexToolIT)  Time elapsed:
0 sec  <<< ERROR!
java.sql.SQLException: No suitable driver found for jdbc:phoenix:localhost:64547
	at java.sql.DriverManager.getConnection(DriverManager.java:596)
	at java.sql.DriverManager.getConnection(DriverManager.java:187)
	at org.apache.phoenix.mapreduce.IndexToolIT.testSecondaryIndex(IndexToolIT.java:122)
	at org.apache.phoenix.mapreduce.IndexToolIT.testImmutableGlobalIndexDirectApi(IndexToolIT.java:95)

testImmutableLocalIndex(org.apache.phoenix.mapreduce.IndexToolIT)  Time elapsed: 0 sec  <<<
ERROR!
java.sql.SQLException: No suitable driver found for jdbc:phoenix:localhost:64547
	at java.sql.DriverManager.getConnection(DriverManager.java:596)
	at java.sql.DriverManager.getConnection(DriverManager.java:187)
	at org.apache.phoenix.mapreduce.IndexToolIT.testSecondaryIndex(IndexToolIT.java:122)
	at org.apache.phoenix.mapreduce.IndexToolIT.testSecondaryIndex(IndexToolIT.java:114)
	at org.apache.phoenix.mapreduce.IndexToolIT.testImmutableLocalIndex(IndexToolIT.java:80)

testMutableLocalIndexDirectApi(org.apache.phoenix.mapreduce.IndexToolIT)  Time elapsed: 0.001
sec  <<< ERROR!
java.sql.SQLException: No suitable driver found for jdbc:phoenix:localhost:64547
	at java.sql.DriverManager.getConnection(DriverManager.java:596)
	at java.sql.DriverManager.getConnection(DriverManager.java:187)
	at org.apache.phoenix.mapreduce.IndexToolIT.testSecondaryIndex(IndexToolIT.java:122)
	at org.apache.phoenix.mapreduce.IndexToolIT.testMutableLocalIndexDirectApi(IndexToolIT.java:110)

testMutalbleIndexWithUpdates(org.apache.phoenix.mapreduce.IndexToolIT)  Time elapsed: 0 sec
 <<< ERROR!
java.sql.SQLException: No suitable driver found for jdbc:phoenix:localhost:64547
	at java.sql.DriverManager.getConnection(DriverManager.java:596)
	at java.sql.DriverManager.getConnection(DriverManager.java:187)
	at org.apache.phoenix.mapreduce.IndexToolIT.testMutalbleIndexWithUpdates(IndexToolIT.java:209)

Tests run: 2, Failures: 0, Errors: 0, Skipped: 0, Time elapsed: 32.982 sec - in org.apache.phoenix.end2end.StatsCollectorWithSplitsAndMultiCFIT
Tests run: 2, Failures: 0, Errors: 0, Skipped: 0, Time elapsed: 33.913 sec - in org.apache.phoenix.end2end.ParallelIteratorsIT
Running org.apache.phoenix.hbase.index.FailForUnsupportedHBaseVersionsIT
Running org.apache.phoenix.mapreduce.CsvBulkLoadToolIT
Tests run: 2, Failures: 0, Errors: 2, Skipped: 0, Time elapsed: 0.001 sec <<< FAILURE!
- in org.apache.phoenix.mapreduce.CsvBulkLoadToolIT
org.apache.phoenix.mapreduce.CsvBulkLoadToolIT  Time elapsed: 0 sec  <<< ERROR!
java.sql.SQLException: No suitable driver found for jdbc:phoenix:localhost:54021
	at java.sql.DriverManager.getConnection(DriverManager.java:596)
	at java.sql.DriverManager.getConnection(DriverManager.java:233)
	at org.apache.phoenix.mapreduce.CsvBulkLoadToolIT.setUp(CsvBulkLoadToolIT.java:66)

org.apache.phoenix.mapreduce.CsvBulkLoadToolIT  Time elapsed: 0.001 sec  <<< ERROR!
java.lang.NullPointerException: null
	at org.apache.phoenix.mapreduce.CsvBulkLoadToolIT.tearDownAfterClass(CsvBulkLoadToolIT.java:73)

Running org.apache.phoenix.monitoring.PhoenixMetricsIT
Running org.apache.phoenix.hbase.index.covered.example.EndToEndCoveredIndexingIT
Tests run: 2, Failures: 0, Errors: 0, Skipped: 0, Time elapsed: 17.565 sec - in org.apache.phoenix.hbase.index.FailForUnsupportedHBaseVersionsIT
Running org.apache.phoenix.hbase.index.covered.example.EndtoEndIndexingWithCompressionIT
Tests run: 17, Failures: 0, Errors: 0, Skipped: 0, Time elapsed: 79.683 sec - in org.apache.phoenix.monitoring.PhoenixMetricsIT
Running org.apache.phoenix.hbase.index.covered.example.FailWithoutRetriesIT
Tests run: 1, Failures: 0, Errors: 0, Skipped: 0, Time elapsed: 8.984 sec - in org.apache.phoenix.hbase.index.covered.example.FailWithoutRetriesIT
Running org.apache.phoenix.hbase.index.covered.EndToEndCoveredColumnsIndexBuilderIT
Tests run: 2, Failures: 0, Errors: 0, Skipped: 0, Time elapsed: 18.724 sec - in org.apache.phoenix.hbase.index.covered.EndToEndCoveredColumnsIndexBuilderIT
Running org.apache.phoenix.hbase.index.balancer.IndexLoadBalancerIT
Tests run: 11, Failures: 0, Errors: 0, Skipped: 0, Time elapsed: 149.085 sec - in org.apache.phoenix.hbase.index.covered.example.EndToEndCoveredIndexingIT
Running org.apache.phoenix.rpc.PhoenixClientRpcIT
Tests run: 11, Failures: 0, Errors: 0, Skipped: 0, Time elapsed: 158.765 sec - in org.apache.phoenix.hbase.index.covered.example.EndtoEndIndexingWithCompressionIT
Tests run: 2, Failures: 0, Errors: 0, Skipped: 0, Time elapsed: 14.469 sec - in org.apache.phoenix.rpc.PhoenixClientRpcIT
Running org.apache.hadoop.hbase.regionserver.wal.WALReplayWithIndexWritesAndCompressedWALIT
Running org.apache.phoenix.rpc.PhoenixServerRpcIT
Tests run: 1, Failures: 0, Errors: 0, Skipped: 0, Time elapsed: 27.297 sec - in org.apache.hadoop.hbase.regionserver.wal.WALReplayWithIndexWritesAndCompressedWALIT
Running org.apache.hadoop.hbase.regionserver.wal.WALReplayWithIndexWritesAndUncompressedWALInHBase_094_9_IT
Tests run: 2, Failures: 0, Errors: 0, Skipped: 0, Time elapsed: 22.184 sec - in org.apache.phoenix.rpc.PhoenixServerRpcIT
Tests run: 1, Failures: 0, Errors: 0, Skipped: 0, Time elapsed: 28.637 sec - in org.apache.hadoop.hbase.regionserver.wal.WALReplayWithIndexWritesAndUncompressedWALInHBase_094_9_IT
Tests run: 53, Failures: 0, Errors: 0, Skipped: 0, Time elapsed: 472.797 sec - in org.apache.phoenix.end2end.AlterTableIT
Tests run: 9, Failures: 0, Errors: 0, Skipped: 0, Time elapsed: 252.06 sec - in org.apache.phoenix.hbase.index.balancer.IndexLoadBalancerIT
Running org.apache.phoenix.end2end.index.ImmutableIndexWithStatsIT
Tests run: 1, Failures: 0, Errors: 0, Skipped: 0, Time elapsed: 9.639 sec - in org.apache.phoenix.end2end.index.ImmutableIndexWithStatsIT

Results :


Tests in error: 
org.apache.phoenix.mapreduce.CsvBulkLoadToolIT.org.apache.phoenix.mapreduce.CsvBulkLoadToolIT
  Run 1: CsvBulkLoadToolIT.setUp:66 » SQL No suitable driver found for jdbc:phoenix:loc...
  Run 2: CsvBulkLoadToolIT.tearDownAfterClass:73 NullPointer

  IndexToolIT.testImmutableGlobalIndex:75->testSecondaryIndex:114->testSecondaryIndex:122
» SQL
  IndexToolIT.testImmutableGlobalIndexDirectApi:95->testSecondaryIndex:122 » SQL
  IndexToolIT.testImmutableLocalIndex:80->testSecondaryIndex:114->testSecondaryIndex:122
» SQL
  IndexToolIT.testImmutableLocalIndexDirectApi:100->testSecondaryIndex:122 » SQL
  IndexToolIT.testMutableGlobalIndex:85->testSecondaryIndex:114->testSecondaryIndex:122
» SQL
  IndexToolIT.testMutableGlobalIndexDirectApi:105->testSecondaryIndex:122 » SQL ...
  IndexToolIT.testMutableLocalIndex:90->testSecondaryIndex:114->testSecondaryIndex:122
» SQL
  IndexToolIT.testMutableLocalIndexDirectApi:110->testSecondaryIndex:122 » SQL N...
  IndexToolIT.testMutalbleIndexWithUpdates:209 » SQL No suitable driver found fo...


Tests run: 243, Failures: 0, Errors: 10, Skipped: 2

[INFO] 
[INFO] --- maven-failsafe-plugin:2.18:verify (ClientManagedTimeTests) @ phoenix-core ---
[INFO] Failsafe report directory: <https://builds.apache.org/job/Phoenix-master/ws/phoenix-core/target/failsafe-reports>
[INFO] ------------------------------------------------------------------------
[INFO] Reactor Summary:
[INFO] 
[INFO] Apache Phoenix .................................... SUCCESS [4.204s]
[INFO] Phoenix Core ...................................... FAILURE [57:10.450s]
[INFO] Phoenix - Flume ................................... SKIPPED
[INFO] Phoenix - Pig ..................................... SKIPPED
[INFO] Phoenix Query Server Client ....................... SKIPPED
[INFO] Phoenix Query Server .............................. SKIPPED
[INFO] Phoenix - Pherf ................................... SKIPPED
[INFO] Phoenix - Spark ................................... SKIPPED
[INFO] Phoenix Assembly .................................. SKIPPED
[INFO] Phoenix - Tracing Web Application ................. SKIPPED
[INFO] ------------------------------------------------------------------------
[INFO] BUILD FAILURE
[INFO] ------------------------------------------------------------------------
[INFO] Total time: 57:15.286s
[INFO] Finished at: Sun Oct 18 05:21:17 UTC 2015
[INFO] Final Memory: 50M/1078M
[INFO] ------------------------------------------------------------------------
[ERROR] Failed to execute goal org.apache.maven.plugins:maven-failsafe-plugin:2.18:verify
(ClientManagedTimeTests) on project phoenix-core: There are test failures.
[ERROR] 
[ERROR] Please refer to <https://builds.apache.org/job/Phoenix-master/ws/phoenix-core/target/failsafe-reports>
for the individual test results.
[ERROR] -> [Help 1]
[ERROR] 
[ERROR] To see the full stack trace of the errors, re-run Maven with the -e switch.
[ERROR] Re-run Maven using the -X switch to enable full debug logging.
[ERROR] 
[ERROR] For more information about the errors and possible solutions, please read the following
articles:
[ERROR] [Help 1] http://cwiki.apache.org/confluence/display/MAVEN/MojoFailureException
[ERROR] 
[ERROR] After correcting the problems, you can resume the build with the command
[ERROR]   mvn <goals> -rf :phoenix-core
Build step 'Invoke top-level Maven targets' marked build as failure
Archiving artifacts
Compressed 777.08 MB of artifacts by 38.5% relative to #927
Updating PHOENIX-2313
Recording test results

Mime
View raw message