phoenix-commits mailing list archives

Site index · List index
Message view « Date » · « Thread »
Top « Date » · « Thread »
From Apache Jenkins Server <jenk...@builds.apache.org>
Subject Build failed in Jenkins: Phoenix-4.x-HBase-1.0 #177
Date Wed, 07 Oct 2015 03:16:47 GMT
See <https://builds.apache.org/job/Phoenix-4.x-HBase-1.0/177/changes>

Changes:

[samarth] PHOENIX-914 Addendum remove System.out and unused import

------------------------------------------
[...truncated 117787 lines...]
[ERROR] GoogleChartGenerator.java[157:142] (whitespace) WhitespaceAround: ':' is not preceded
with whitespace.
[ERROR] GoogleChartGenerator.java[157:142] (whitespace) OperatorWrap: ':' should be on a new
line.
[ERROR] GoogleChartGenerator.java[158] (sizes) LineLength: Line is longer than 100 characters
(found 105).
[ERROR] GoogleChartGenerator.java[159] (sizes) LineLength: Line is longer than 100 characters
(found 119).
[ERROR] GoogleChartGenerator.java[160] (sizes) LineLength: Line is longer than 100 characters
(found 126).
[ERROR] GoogleChartGenerator.java[161] (indentation) Indentation: method def child at indentation
level 16 not at correct indentation, 8
[ERROR] GoogleChartGenerator.java[165] (misc) Regexp: Line matches the illegal pattern 'Trailing
whitespace'.
[ERROR] GoogleChartGenerator.java[172] (blocks) NeedBraces: 'for' construct must use '{}'s.
[ERROR] GoogleChartGenerator.java[172:19] (whitespace) WhitespaceAround: '=' is not preceded
with whitespace.
[ERROR] GoogleChartGenerator.java[172:20] (whitespace) WhitespaceAround: '=' is not followed
by whitespace.
[ERROR] GoogleChartGenerator.java[172:24] (whitespace) WhitespaceAround: '<' is not preceded
with whitespace.
[ERROR] GoogleChartGenerator.java[172:25] (whitespace) WhitespaceAround: '<' is not followed
by whitespace.
[ERROR] GoogleChartGenerator.java[176] (indentation) Indentation: method def rcurly at indentation
level 8 not at correct indentation, 4
[ERROR] GoogleChartGenerator.java[183] (indentation) Indentation: method def modifier at indentation
level 8 not at correct indentation, 4
[ERROR] GoogleChartGenerator.java[185] (blocks) NeedBraces: 'for' construct must use '{}'s.
[ERROR] GoogleChartGenerator.java[185] (misc) Regexp: Line matches the illegal pattern 'Trailing
whitespace'.
[ERROR] GoogleChartGenerator.java[189] (misc) Regexp: Line matches the illegal pattern 'Trailing
whitespace'.
[ERROR] GoogleChartGenerator.java[196] (misc) Regexp: Line matches the illegal pattern 'Trailing
whitespace'.
[ERROR] GoogleChartGenerator.java[204] (misc) Regexp: Line matches the illegal pattern 'Trailing
whitespace'.
[ERROR] GoogleChartGenerator.java[206] (misc) Regexp: Line matches the illegal pattern 'Trailing
whitespace'.
[ERROR] GoogleChartGenerator.java[210] (misc) Regexp: Line matches the illegal pattern 'Trailing
whitespace'.
[ERROR] GoogleChartGenerator.java[212] (indentation) Indentation: ctor def child at indentation
level 16 not at correct indentation, 12
[ERROR] GoogleChartGenerator.java[214] (misc) Regexp: Line matches the illegal pattern 'Trailing
whitespace'.
[ERROR] GoogleChartGenerator.java[215] (indentation) Indentation: method def modifier at indentation
level 16 not at correct indentation, 8
[ERROR] GoogleChartGenerator.java[216] (indentation) Indentation: method def child at indentation
level 24 not at correct indentation, 12
[ERROR] GoogleChartGenerator.java[217] (indentation) Indentation: method def rcurly at indentation
level 16 not at correct indentation, 8
[ERROR] GoogleChartGenerator.java[218] (indentation) Indentation: method def modifier at indentation
level 16 not at correct indentation, 8
[ERROR] GoogleChartGenerator.java[219] (indentation) Indentation: method def child at indentation
level 24 not at correct indentation, 12
[ERROR] GoogleChartGenerator.java[220] (indentation) Indentation: method def rcurly at indentation
level 16 not at correct indentation, 8
[ERROR] GoogleChartGenerator.java[222] (misc) Regexp: Line matches the illegal pattern 'Trailing
whitespace'.
[ERROR] GoogleChartGenerator.java[223] (javadoc) JavadocType: Missing a Javadoc comment.
[ERROR] GoogleChartGenerator.java[233] (misc) Regexp: Line matches the illegal pattern 'Trailing
whitespace'.
[ERROR] GoogleChartGenerator.java[234] (sizes) LineLength: Line is longer than 100 characters
(found 143).
[ERROR] GoogleChartGenerator.java[235] (indentation) Indentation: ctor def child at indentation
level 16 not at correct indentation, 12
[ERROR] GoogleChartGenerator.java[236] (indentation) Indentation: ctor def child at indentation
level 16 not at correct indentation, 12
[ERROR] GoogleChartGenerator.java[237] (indentation) Indentation: ctor def child at indentation
level 16 not at correct indentation, 12
[ERROR] GoogleChartGenerator.java[238] (indentation) Indentation: ctor def child at indentation
level 16 not at correct indentation, 12
[ERROR] GoogleChartGenerator.java[239] (indentation) Indentation: ctor def child at indentation
level 16 not at correct indentation, 12
[ERROR] GoogleChartGenerator.java[240] (indentation) Indentation: ctor def child at indentation
level 16 not at correct indentation, 12
[ERROR] GoogleChartGenerator.java[241] (indentation) Indentation: ctor def child at indentation
level 16 not at correct indentation, 12
[ERROR] GoogleChartGenerator.java[242] (indentation) Indentation: ctor def child at indentation
level 16 not at correct indentation, 12
[ERROR] GoogleChartGenerator.java[244] (misc) Regexp: Line matches the illegal pattern 'Trailing
whitespace'.
[ERROR] GoogleChartGenerator.java[245] (indentation) Indentation: method def return type at
indentation level 16 not at correct indentation, 8
[ERROR] GoogleChartGenerator.java[246] (indentation) Indentation: method def child at indentation
level 24 not at correct indentation, 12
[ERROR] GoogleChartGenerator.java[247] (indentation) Indentation: method def rcurly at indentation
level 16 not at correct indentation, 8
[ERROR] GoogleChartGenerator.java[248] (indentation) Indentation: method def return type at
indentation level 16 not at correct indentation, 8
[ERROR] GoogleChartGenerator.java[249] (indentation) Indentation: method def child at indentation
level 24 not at correct indentation, 12
[ERROR] GoogleChartGenerator.java[251] (indentation) Indentation: method def rcurly at indentation
level 16 not at correct indentation, 8
[ERROR] GoogleChartGenerator.java[252] (misc) Regexp: Line matches the illegal pattern 'Trailing
whitespace'.
[ERROR] GoogleChartGenerator.java[253] (indentation) Indentation: method def return type at
indentation level 16 not at correct indentation, 8
[ERROR] GoogleChartGenerator.java[254] (indentation) Indentation: method def child at indentation
level 24 not at correct indentation, 12
[ERROR] GoogleChartGenerator.java[255] (indentation) Indentation: method def rcurly at indentation
level 16 not at correct indentation, 8
[ERROR] GoogleChartGenerator.java[256] (indentation) Indentation: method def return type at
indentation level 16 not at correct indentation, 8
[ERROR] GoogleChartGenerator.java[257] (blocks) NeedBraces: 'if' construct must use '{}'s.
[ERROR] GoogleChartGenerator.java[257] (misc) Regexp: Line matches the illegal pattern 'Trailing
whitespace'.
[ERROR] GoogleChartGenerator.java[257] (indentation) Indentation: if at indentation level
24 not at correct indentation, 12
[ERROR] GoogleChartGenerator.java[259] (blocks) NeedBraces: 'else' construct must use '{}'s.
[ERROR] GoogleChartGenerator.java[259] (indentation) Indentation: else at indentation level
24 not at correct indentation, 12
[ERROR] GoogleChartGenerator.java[261] (indentation) Indentation: method def rcurly at indentation
level 16 not at correct indentation, 8
[ERROR] GoogleChartGenerator.java[262] (indentation) Indentation: method def modifier at indentation
level 16 not at correct indentation, 8
[ERROR] GoogleChartGenerator.java[263] (sizes) LineLength: Line is longer than 100 characters
(found 104).
[ERROR] GoogleChartGenerator.java[263] (indentation) Indentation: method def child at indentation
level 24 not at correct indentation, 12
[ERROR] GoogleChartGenerator.java[268] (indentation) Indentation: method def rcurly at indentation
level 16 not at correct indentation, 8
[ERROR] GoogleChartGenerator.java[269] (indentation) Indentation: method def return type at
indentation level 16 not at correct indentation, 8
[ERROR] GoogleChartGenerator.java[270] (indentation) Indentation: method def child at indentation
level 24 not at correct indentation, 12
[ERROR] GoogleChartGenerator.java[271] (indentation) Indentation: method def rcurly at indentation
level 16 not at correct indentation, 8
[ERROR] GoogleChartGenerator.java[272] (indentation) Indentation: method def return type at
indentation level 16 not at correct indentation, 8
[ERROR] GoogleChartGenerator.java[273] (indentation) Indentation: method def child at indentation
level 24 not at correct indentation, 12
[ERROR] GoogleChartGenerator.java[274] (indentation) Indentation: method def rcurly at indentation
level 16 not at correct indentation, 8
[ERROR] GoogleChartGenerator.java[275] (indentation) Indentation: method def modifier at indentation
level 16 not at correct indentation, 8
[ERROR] GoogleChartGenerator.java[276] (sizes) LineLength: Line is longer than 100 characters
(found 108).
[ERROR] GoogleChartGenerator.java[276] (indentation) Indentation: method def child at indentation
level 24 not at correct indentation, 12
[ERROR] GoogleChartGenerator.java[281] (indentation) Indentation: method def rcurly at indentation
level 16 not at correct indentation, 8
[ERROR] GoogleChartGenerator.java[282] (indentation) Indentation: method def return type at
indentation level 16 not at correct indentation, 8
[ERROR] GoogleChartGenerator.java[283] (indentation) Indentation: method def child at indentation
level 24 not at correct indentation, 12
[ERROR] GoogleChartGenerator.java[284] (indentation) Indentation: method def rcurly at indentation
level 16 not at correct indentation, 8
[ERROR] GoogleChartGenerator.java[286] (indentation) Indentation: method def modifier at indentation
level 16 not at correct indentation, 8
[ERROR] GoogleChartGenerator.java[287] (indentation) Indentation: method def child at indentation
level 24 not at correct indentation, 12
[ERROR] GoogleChartGenerator.java[288] (indentation) Indentation: method def rcurly at indentation
level 16 not at correct indentation, 8
[ERROR] GoogleChartGenerator.java[289] (indentation) Indentation: method def modifier at indentation
level 16 not at correct indentation, 8
[ERROR] GoogleChartGenerator.java[290] (sizes) LineLength: Line is longer than 100 characters
(found 110).
[ERROR] GoogleChartGenerator.java[290] (indentation) Indentation: method def child at indentation
level 24 not at correct indentation, 12
[ERROR] GoogleChartGenerator.java[292] (indentation) Indentation: method def rcurly at indentation
level 16 not at correct indentation, 8
[ERROR] GoogleChartGenerator.java[294] (indentation) Indentation: method def modifier at indentation
level 16 not at correct indentation, 8
[ERROR] GoogleChartGenerator.java[295] (indentation) Indentation: method def child at indentation
level 24 not at correct indentation, 12
[ERROR] GoogleChartGenerator.java[296] (indentation) Indentation: method def rcurly at indentation
level 16 not at correct indentation, 8
[ERROR] GoogleChartGenerator.java[298] (indentation) Indentation: method def modifier at indentation
level 16 not at correct indentation, 8
[ERROR] GoogleChartGenerator.java[299] (indentation) Indentation: method def child at indentation
level 24 not at correct indentation, 12
[ERROR] GoogleChartGenerator.java[300] (indentation) Indentation: method def rcurly at indentation
level 16 not at correct indentation, 8
[ERROR] GoogleChartGenerator.java[302] (indentation) Indentation: method def modifier at indentation
level 16 not at correct indentation, 8
[ERROR] GoogleChartGenerator.java[303] (indentation) Indentation: method def child at indentation
level 24 not at correct indentation, 12
[ERROR] GoogleChartGenerator.java[306] (indentation) Indentation: method def rcurly at indentation
level 16 not at correct indentation, 8
[ERROR] GoogleChartGenerator.java[307] (misc) Regexp: Line matches the illegal pattern 'Trailing
whitespace'.
[ERROR] GoogleChartGenerator.java[308] (indentation) Indentation: method def modifier at indentation
level 16 not at correct indentation, 8
[ERROR] GoogleChartGenerator.java[309] (indentation) Indentation: method def child at indentation
level 24 not at correct indentation, 12
[ERROR] GoogleChartGenerator.java[310] (indentation) Indentation: method def rcurly at indentation
level 16 not at correct indentation, 8
[ERROR] GoogleChartGenerator.java[312] (indentation) Indentation: method def modifier at indentation
level 16 not at correct indentation, 8
[ERROR] GoogleChartGenerator.java[313] (indentation) Indentation: method def child at indentation
level 24 not at correct indentation, 12
[ERROR] GoogleChartGenerator.java[314] (indentation) Indentation: method def rcurly at indentation
level 16 not at correct indentation, 8
[ERROR] GoogleChartGenerator.java[315] (misc) Regexp: Line matches the illegal pattern 'Trailing
whitespace'.
[ERROR] GoogleChartGenerator.java[316] (indentation) Indentation: method def modifier at indentation
level 16 not at correct indentation, 8
[ERROR] GoogleChartGenerator.java[317] (indentation) Indentation: method def child at indentation
level 24 not at correct indentation, 12
[ERROR] GoogleChartGenerator.java[318] (indentation) Indentation: method def rcurly at indentation
level 16 not at correct indentation, 8
[ERROR] GoogleChartGenerator.java[320] (indentation) Indentation: method def modifier at indentation
level 16 not at correct indentation, 8
[ERROR] GoogleChartGenerator.java[321] (indentation) Indentation: method def child at indentation
level 24 not at correct indentation, 12
[ERROR] GoogleChartGenerator.java[322] (indentation) Indentation: method def rcurly at indentation
level 16 not at correct indentation, 8
[ERROR] GoogleChartGenerator.java[323] (misc) Regexp: Line matches the illegal pattern 'Trailing
whitespace'.
[ERROR] GoogleChartGenerator.java[324] (indentation) Indentation: method def modifier at indentation
level 16 not at correct indentation, 8
[ERROR] GoogleChartGenerator.java[325] (indentation) Indentation: method def child at indentation
level 24 not at correct indentation, 12
[ERROR] GoogleChartGenerator.java[327] (indentation) Indentation: method def rcurly at indentation
level 16 not at correct indentation, 8
[ERROR] GoogleChartGenerator.java[329] (indentation) Indentation: method def modifier at indentation
level 16 not at correct indentation, 8
[ERROR] GoogleChartGenerator.java[330] (indentation) Indentation: method def child at indentation
level 24 not at correct indentation, 12
[ERROR] GoogleChartGenerator.java[331] (indentation) Indentation: method def rcurly at indentation
level 16 not at correct indentation, 8
[ERROR] GoogleChartGenerator.java[333] (indentation) Indentation: method def modifier at indentation
level 16 not at correct indentation, 8
[ERROR] GoogleChartGenerator.java[334] (indentation) Indentation: method def child at indentation
level 24 not at correct indentation, 12
[ERROR] GoogleChartGenerator.java[335] (indentation) Indentation: method def rcurly at indentation
level 16 not at correct indentation, 8
[ERROR] GoogleChartGenerator.java[336] (indentation) Indentation: method def modifier at indentation
level 16 not at correct indentation, 8
[ERROR] GoogleChartGenerator.java[337] (sizes) LineLength: Line is longer than 100 characters
(found 112).
[ERROR] GoogleChartGenerator.java[337] (indentation) Indentation: method def child at indentation
level 24 not at correct indentation, 12
[ERROR] GoogleChartGenerator.java[339] (indentation) Indentation: method def rcurly at indentation
level 16 not at correct indentation, 8
[ERROR] GoogleChartGenerator.java[341] (indentation) Indentation: method def modifier at indentation
level 16 not at correct indentation, 8
[ERROR] GoogleChartGenerator.java[342] (indentation) Indentation: method def child at indentation
level 24 not at correct indentation, 12
[ERROR] GoogleChartGenerator.java[343] (indentation) Indentation: method def rcurly at indentation
level 16 not at correct indentation, 8
[ERROR] GoogleChartGenerator.java[345] (misc) Regexp: Line matches the illegal pattern 'Trailing
whitespace'.
[ERROR] GoogleChartGenerator.java[346] (javadoc) JavadocType: Missing a Javadoc comment.
[ERROR] GoogleChartGenerator.java[347] (indentation) Indentation: member def modifier at indentation
level 16 not at correct indentation, 8
[ERROR] GoogleChartGenerator.java[347:38] (naming) StaticVariableName: Name 'HEADER' must
match pattern '^[a-z][a-zA-Z0-9]*$'.
[ERROR] GoogleChartGenerator.java[348] (sizes) LineLength: Line is longer than 100 characters
(found 111).
[ERROR] GoogleChartGenerator.java[349] (sizes) LineLength: Line is longer than 100 characters
(found 174).
[ERROR] GoogleChartGenerator.java[350] (sizes) LineLength: Line is longer than 100 characters
(found 154).
[ERROR] GoogleChartGenerator.java[351] (sizes) LineLength: Line is longer than 100 characters
(found 322).
[ERROR] GoogleChartGenerator.java[351] (indentation) Indentation: member def modifier at indentation
level 16 not at correct indentation, 8
[ERROR] GoogleChartGenerator.java[351:38] (naming) StaticVariableName: Name 'FOOTER' must
match pattern '^[a-z][a-zA-Z0-9]*$'.
[ERROR] GoogleChartGenerator.java[352] (sizes) LineLength: Line is longer than 100 characters
(found 230).
[ERROR] GoogleChartGenerator.java[353] (sizes) LineLength: Line is longer than 100 characters
(found 104).
[ERROR] GoogleChartGenerator.java[356] (sizes) LineLength: Line is longer than 100 characters
(found 124).
[ERROR] GoogleChartGenerator.java[357] (sizes) LineLength: Line is longer than 100 characters
(found 123).
[ERROR] GoogleChartGenerator.java[359] (sizes) LineLength: Line is longer than 100 characters
(found 232).
[ERROR] log4j.properties[1] (header) Header: Line does not match expected header line of '/*'.
[ERROR] pherf.properties[0] (misc) NewlineAtEndOfFile: File does not end with a newline.
[ERROR] pherf.properties[1] (header) Header: Line does not match expected header line of '/*'.
[WARNING] checkstyle:check violations detected but failOnViolation set to false
[INFO] 
[INFO] --- build-helper-maven-plugin:1.9.1:add-test-source (add-test-source) @ phoenix-pherf
---
[INFO] Test Source directory: <https://builds.apache.org/job/Phoenix-4.x-HBase-1.0/ws/phoenix-pherf/src/it/java>
added.
[INFO] 
[INFO] --- build-helper-maven-plugin:1.9.1:add-test-resource (add-test-resource) @ phoenix-pherf
---
[INFO] 
[INFO] --- maven-remote-resources-plugin:1.5:process (default) @ phoenix-pherf ---
[INFO] artifact junit:junit-dep: checking for updates from apache release
[INFO] artifact junit:junit-dep: checking for updates from conjars.org
[INFO] artifact junit:junit-dep: checking for updates from apache snapshot
[INFO] artifact junit:junit-dep: checking for updates from sonatype-nexus-snapshots
[INFO] artifact junit:junit-dep: checking for updates from central
[INFO] artifact junit:junit: checking for updates from apache release
[INFO] artifact junit:junit: checking for updates from conjars.org
[INFO] artifact junit:junit: checking for updates from apache snapshot
[INFO] artifact junit:junit: checking for updates from sonatype-nexus-snapshots
[INFO] artifact junit:junit: checking for updates from central
[INFO] artifact commons-io:commons-io: checking for updates from apache release
[INFO] artifact commons-io:commons-io: checking for updates from conjars.org
[INFO] artifact commons-io:commons-io: checking for updates from apache snapshot
[INFO] artifact commons-io:commons-io: checking for updates from sonatype-nexus-snapshots
[INFO] artifact commons-io:commons-io: checking for updates from central
[INFO] 
[INFO] --- maven-resources-plugin:2.6:resources (default-resources) @ phoenix-pherf ---
[INFO] Using 'UTF-8' encoding to copy filtered resources.
[INFO] Copying 3 resources
[INFO] Copying 5 resources
[INFO] Copying 3 resources
[INFO] 
[INFO] --- maven-compiler-plugin:3.0:compile (default-compile) @ phoenix-pherf ---
[INFO] Changes detected - recompiling the module!
[INFO] Compiling 65 source files to <https://builds.apache.org/job/Phoenix-4.x-HBase-1.0/ws/phoenix-pherf/target/classes>
[WARNING] <https://builds.apache.org/job/Phoenix-4.x-HBase-1.0/ws/phoenix-pherf/src/main/java/org/apache/phoenix/pherf/jmx/monitors/TotalMemoryMonitor.java>:
Some input files use unchecked or unsafe operations.
[WARNING] <https://builds.apache.org/job/Phoenix-4.x-HBase-1.0/ws/phoenix-pherf/src/main/java/org/apache/phoenix/pherf/jmx/monitors/TotalMemoryMonitor.java>:
Recompile with -Xlint:unchecked for details.
[INFO] 
[INFO] --- maven-dependency-plugin:2.1:build-classpath (create-mrapp-generated-classpath)
@ phoenix-pherf ---
[INFO] Wrote classpath file '<https://builds.apache.org/job/Phoenix-4.x-HBase-1.0/ws/phoenix-pherf/target/classes/mrapp-generated-classpath'.>
[INFO] 
[INFO] --- maven-resources-plugin:2.6:testResources (default-testResources) @ phoenix-pherf
---
[INFO] Using 'UTF-8' encoding to copy filtered resources.
[INFO] Copying 5 resources
[INFO] Copying 5 resources
[INFO] skip non existing resourceDirectory <https://builds.apache.org/job/Phoenix-4.x-HBase-1.0/ws/phoenix-pherf/src/it/resources>
[INFO] Copying 3 resources
[INFO] 
[INFO] --- maven-compiler-plugin:3.0:testCompile (default-testCompile) @ phoenix-pherf ---
[INFO] Changes detected - recompiling the module!
[INFO] Compiling 13 source files to <https://builds.apache.org/job/Phoenix-4.x-HBase-1.0/ws/phoenix-pherf/target/test-classes>
[WARNING] <https://builds.apache.org/job/Phoenix-4.x-HBase-1.0/ws/phoenix-pherf/src/test/java/org/apache/phoenix/pherf/RowCalculatorTest.java>:
<https://builds.apache.org/job/Phoenix-4.x-HBase-1.0/ws/phoenix-pherf/src/test/java/org/apache/phoenix/pherf/RowCalculatorTest.java>
uses or overrides a deprecated API.
[WARNING] <https://builds.apache.org/job/Phoenix-4.x-HBase-1.0/ws/phoenix-pherf/src/test/java/org/apache/phoenix/pherf/RowCalculatorTest.java>:
Recompile with -Xlint:deprecation for details.
[WARNING] <https://builds.apache.org/job/Phoenix-4.x-HBase-1.0/ws/phoenix-pherf/src/test/java/org/apache/phoenix/pherf/ResultTest.java>:
Some input files use unchecked or unsafe operations.
[WARNING] <https://builds.apache.org/job/Phoenix-4.x-HBase-1.0/ws/phoenix-pherf/src/test/java/org/apache/phoenix/pherf/ResultTest.java>:
Recompile with -Xlint:unchecked for details.
[INFO] 
[INFO] --- maven-surefire-plugin:2.18:test (default-test) @ phoenix-pherf ---
[INFO] Surefire report directory: <https://builds.apache.org/job/Phoenix-4.x-HBase-1.0/ws/phoenix-pherf/target/surefire-reports>

-------------------------------------------------------
 T E S T S
-------------------------------------------------------
Running org.apache.phoenix.pherf.PherfTest
Tests run: 2, Failures: 0, Errors: 0, Skipped: 0, Time elapsed: 1.358 sec - in org.apache.phoenix.pherf.PherfTest
Running org.apache.phoenix.pherf.ResultTest
Killed

Results :




Tests run: 2, Failures: 0, Errors: 0, Skipped: 0

[INFO] ------------------------------------------------------------------------
[INFO] Reactor Summary:
[INFO] 
[INFO] Apache Phoenix .................................... SUCCESS [5.922s]
[INFO] Phoenix Core ...................................... SUCCESS [30:20.576s]
[INFO] Phoenix - Flume ................................... SUCCESS [1:01.870s]
[INFO] Phoenix - Pig ..................................... SUCCESS [1:16.495s]
[INFO] Phoenix Query Server Client ....................... SUCCESS [1.549s]
[INFO] Phoenix Query Server .............................. SUCCESS [1:52.344s]
[INFO] Phoenix - Pherf ................................... FAILURE [7:56.137s]
[INFO] Phoenix - Spark ................................... SKIPPED
[INFO] Phoenix Assembly .................................. SKIPPED
[INFO] Phoenix - Tracing Web Application ................. SKIPPED
[INFO] ------------------------------------------------------------------------
[INFO] BUILD FAILURE
[INFO] ------------------------------------------------------------------------
[INFO] Total time: 42:35.572s
[INFO] Finished at: Wed Oct 07 03:13:47 UTC 2015
[INFO] Final Memory: 82M/1027M
[INFO] ------------------------------------------------------------------------
[ERROR] Failed to execute goal org.apache.maven.plugins:maven-surefire-plugin:2.18:test (default-test)
on project phoenix-pherf: ExecutionException: java.lang.RuntimeException: The forked VM terminated
without properly saying goodbye. VM crash or System.exit called?
[ERROR] Command was /bin/sh -c cd <https://builds.apache.org/job/Phoenix-4.x-HBase-1.0/ws/phoenix-pherf>
&& /home/jenkins/tools/java/jdk1.7.0_25-32/jre/bin/java -enableassertions -Xmx2250m
-XX:MaxPermSize=128m -Djava.security.egd=file:/dev/./urandom '-Djava.library.path=${hadoop.library.path}:/usr/java/packages/lib/i386:/lib:/usr/lib'
-jar <https://builds.apache.org/job/Phoenix-4.x-HBase-1.0/177/artifact/phoenix-pherf/target/surefire/surefirebooter1537634265097208360.jar>
<https://builds.apache.org/job/Phoenix-4.x-HBase-1.0/ws/phoenix-pherf/target/surefire/surefire313160396969107411tmp>
<https://builds.apache.org/job/Phoenix-4.x-HBase-1.0/ws/phoenix-pherf/target/surefire/surefire_88172111938873127094tmp>
[ERROR] -> [Help 1]
[ERROR] 
[ERROR] To see the full stack trace of the errors, re-run Maven with the -e switch.
[ERROR] Re-run Maven using the -X switch to enable full debug logging.
[ERROR] 
[ERROR] For more information about the errors and possible solutions, please read the following
articles:
[ERROR] [Help 1] http://cwiki.apache.org/confluence/display/MAVEN/MojoFailureException
[ERROR] 
[ERROR] After correcting the problems, you can resume the build with the command
[ERROR]   mvn <goals> -rf :phoenix-pherf
Build step 'Invoke top-level Maven targets' marked build as failure
Archiving artifacts
Compressed 1.28 GB of artifacts by 56.0% relative to #175
Recording test results

Mime
View raw message