phoenix-commits mailing list archives

Site index · List index
Message view « Date » · « Thread »
Top « Date » · « Thread »
From Apache Jenkins Server <jenk...@builds.apache.org>
Subject Build failed in Jenkins: Phoenix-4.x-HBase-1.0 #186
Date Thu, 15 Oct 2015 20:08:11 GMT
See <https://builds.apache.org/job/Phoenix-4.x-HBase-1.0/186/changes>

Changes:

[jtaylor] PHOENIX-2319 SELECT failed on secondary index when table's columns are

[samarth] Update MetaDataProtocol to 4.6.0

------------------------------------------
[...truncated 6703 lines...]
Running org.apache.phoenix.end2end.index.LocalMutableIndexIT
Tests run: 1, Failures: 0, Errors: 0, Skipped: 0, Time elapsed: 4.457 sec - in org.apache.phoenix.end2end.index.ViewIndexIT
Running org.apache.phoenix.end2end.index.ImmutableIndexIT
Tests run: 13, Failures: 0, Errors: 0, Skipped: 0, Time elapsed: 27.068 sec - in org.apache.phoenix.end2end.index.ImmutableIndexIT
Running org.apache.phoenix.end2end.index.IndexMetadataIT
Tests run: 15, Failures: 0, Errors: 0, Skipped: 0, Time elapsed: 56.826 sec - in org.apache.phoenix.end2end.index.LocalMutableIndexIT
Running org.apache.phoenix.end2end.index.GlobalMutableIndexIT
Tests run: 6, Failures: 0, Errors: 0, Skipped: 0, Time elapsed: 34.903 sec - in org.apache.phoenix.end2end.index.IndexMetadataIT
Running org.apache.phoenix.end2end.CSVCommonsLoaderIT
Tests run: 16, Failures: 0, Errors: 0, Skipped: 0, Time elapsed: 16.431 sec - in org.apache.phoenix.end2end.CSVCommonsLoaderIT
Running org.apache.phoenix.end2end.OctetLengthFunctionEnd2EndIT
Tests run: 1, Failures: 0, Errors: 0, Skipped: 0, Time elapsed: 2.701 sec - in org.apache.phoenix.end2end.OctetLengthFunctionEnd2EndIT
Running org.apache.phoenix.end2end.LpadFunctionIT
Tests run: 12, Failures: 0, Errors: 0, Skipped: 0, Time elapsed: 10.544 sec - in org.apache.phoenix.end2end.LpadFunctionIT
Running org.apache.phoenix.end2end.MinMaxAggregateFunctionIT
Tests run: 1, Failures: 0, Errors: 0, Skipped: 0, Time elapsed: 2.796 sec - in org.apache.phoenix.end2end.MinMaxAggregateFunctionIT
Running org.apache.phoenix.end2end.TimezoneOffsetFunctionIT
Tests run: 7, Failures: 0, Errors: 0, Skipped: 0, Time elapsed: 4.695 sec - in org.apache.phoenix.end2end.TimezoneOffsetFunctionIT
Running org.apache.phoenix.end2end.RegexpSubstrFunctionIT
Tests run: 2, Failures: 0, Errors: 0, Skipped: 0, Time elapsed: 1.958 sec - in org.apache.phoenix.end2end.RegexpSubstrFunctionIT
Running org.apache.phoenix.end2end.BinaryRowKeyIT
Tests run: 3, Failures: 0, Errors: 0, Skipped: 0, Time elapsed: 3.121 sec - in org.apache.phoenix.end2end.BinaryRowKeyIT
Running org.apache.phoenix.end2end.SignFunctionEnd2EndIT
Tests run: 20, Failures: 0, Errors: 0, Skipped: 0, Time elapsed: 135.617 sec - in org.apache.phoenix.end2end.index.LocalIndexIT
Running org.apache.phoenix.end2end.SortMergeJoinIT
Tests run: 15, Failures: 0, Errors: 0, Skipped: 0, Time elapsed: 55.143 sec - in org.apache.phoenix.end2end.index.GlobalMutableIndexIT
Running org.apache.phoenix.end2end.DecodeFunctionIT
Tests run: 2, Failures: 0, Errors: 0, Skipped: 0, Time elapsed: 4.617 sec - in org.apache.phoenix.end2end.SignFunctionEnd2EndIT
Running org.apache.phoenix.end2end.RTrimFunctionIT
Tests run: 6, Failures: 0, Errors: 0, Skipped: 0, Time elapsed: 2.442 sec - in org.apache.phoenix.end2end.DecodeFunctionIT
Running org.apache.phoenix.end2end.DisableLocalIndexIT
Tests run: 2, Failures: 0, Errors: 0, Skipped: 0, Time elapsed: 2.457 sec - in org.apache.phoenix.end2end.RTrimFunctionIT
Running org.apache.phoenix.end2end.HashJoinIT
Tests run: 108, Failures: 0, Errors: 0, Skipped: 0, Time elapsed: 282.985 sec - in org.apache.phoenix.end2end.SpooledSortMergeJoinIT
Running org.apache.phoenix.end2end.HashJoinLocalIndexIT
Tests run: 1, Failures: 0, Errors: 0, Skipped: 0, Time elapsed: 3.759 sec - in org.apache.phoenix.end2end.DisableLocalIndexIT
Running org.apache.phoenix.end2end.ModulusExpressionIT
Tests run: 11, Failures: 0, Errors: 0, Skipped: 0, Time elapsed: 4.238 sec - in org.apache.phoenix.end2end.ModulusExpressionIT
Running org.apache.phoenix.end2end.ArrayToStringFunctionIT
Tests run: 1, Failures: 0, Errors: 0, Skipped: 0, Time elapsed: 14.758 sec - in org.apache.phoenix.end2end.HashJoinLocalIndexIT
Running org.apache.phoenix.end2end.StoreNullsIT
Tests run: 36, Failures: 0, Errors: 0, Skipped: 0, Time elapsed: 12.726 sec - in org.apache.phoenix.end2end.ArrayToStringFunctionIT
Running org.apache.phoenix.end2end.EvaluationOfORIT
Tests run: 2, Failures: 0, Errors: 0, Skipped: 0, Time elapsed: 2.385 sec - in org.apache.phoenix.end2end.EvaluationOfORIT
Running org.apache.phoenix.end2end.ExecuteStatementsIT
Tests run: 2, Failures: 0, Errors: 0, Skipped: 0, Time elapsed: 13.368 sec - in org.apache.phoenix.end2end.ExecuteStatementsIT
Running org.apache.phoenix.end2end.ConvertTimezoneFunctionIT
Tests run: 3, Failures: 0, Errors: 0, Skipped: 0, Time elapsed: 20.122 sec - in org.apache.phoenix.end2end.StoreNullsIT
Tests run: 62, Failures: 0, Errors: 0, Skipped: 0, Time elapsed: 175.162 sec - in org.apache.phoenix.end2end.index.IndexExpressionIT
Running org.apache.phoenix.end2end.ExpFunctionEnd2EndIT
Running org.apache.phoenix.end2end.PowerFunctionEnd2EndIT
Tests run: 7, Failures: 0, Errors: 0, Skipped: 0, Time elapsed: 3.783 sec - in org.apache.phoenix.end2end.ConvertTimezoneFunctionIT
Running org.apache.phoenix.end2end.StddevIT
Tests run: 4, Failures: 0, Errors: 0, Skipped: 0, Time elapsed: 2.907 sec - in org.apache.phoenix.end2end.StddevIT
Running org.apache.phoenix.end2end.TenantSpecificViewIndexSaltedIT
Tests run: 1, Failures: 0, Errors: 0, Skipped: 0, Time elapsed: 5.198 sec - in org.apache.phoenix.end2end.PowerFunctionEnd2EndIT
Running org.apache.phoenix.end2end.AlterSessionIT
Tests run: 3, Failures: 0, Errors: 0, Skipped: 0, Time elapsed: 8.195 sec - in org.apache.phoenix.end2end.ExpFunctionEnd2EndIT
Running org.apache.phoenix.end2end.FirstValueFunctionIT
Tests run: 2, Failures: 0, Errors: 0, Skipped: 0, Time elapsed: 3.185 sec - in org.apache.phoenix.end2end.AlterSessionIT
Running org.apache.phoenix.end2end.SkipScanAfterManualSplitIT
Tests run: 4, Failures: 0, Errors: 0, Skipped: 0, Time elapsed: 8.384 sec - in org.apache.phoenix.end2end.TenantSpecificViewIndexSaltedIT
Running org.apache.phoenix.end2end.ArrayAppendFunctionIT
Tests run: 7, Failures: 0, Errors: 0, Skipped: 0, Time elapsed: 5.959 sec - in org.apache.phoenix.end2end.FirstValueFunctionIT
Running org.apache.phoenix.end2end.TenantSpecificViewIndexIT
Tests run: 34, Failures: 0, Errors: 0, Skipped: 0, Time elapsed: 11.85 sec - in org.apache.phoenix.end2end.ArrayAppendFunctionIT
Running org.apache.phoenix.end2end.GetSetByteBitFunctionEnd2EndIT
Tests run: 1, Failures: 0, Errors: 0, Skipped: 0, Time elapsed: 1.755 sec - in org.apache.phoenix.end2end.GetSetByteBitFunctionEnd2EndIT
Running org.apache.phoenix.end2end.UpgradeIT
Tests run: 8, Failures: 0, Errors: 0, Skipped: 0, Time elapsed: 18.029 sec - in org.apache.phoenix.end2end.TenantSpecificViewIndexIT
Running org.apache.phoenix.end2end.LnLogFunctionEnd2EndIT
Tests run: 3, Failures: 0, Errors: 0, Skipped: 0, Time elapsed: 25.757 sec - in org.apache.phoenix.end2end.SkipScanAfterManualSplitIT
Running org.apache.phoenix.end2end.SpooledTmpFileDeleteIT
Tests run: 1, Failures: 0, Errors: 0, Skipped: 0, Time elapsed: 4.193 sec - in org.apache.phoenix.end2end.LnLogFunctionEnd2EndIT
Running org.apache.phoenix.end2end.SkipScanQueryIT
Tests run: 1, Failures: 0, Errors: 0, Skipped: 0, Time elapsed: 2.677 sec - in org.apache.phoenix.end2end.SpooledTmpFileDeleteIT
Running org.apache.phoenix.end2end.ArrayConcatFunctionIT
Tests run: 9, Failures: 0, Errors: 0, Skipped: 0, Time elapsed: 15.535 sec - in org.apache.phoenix.end2end.SkipScanQueryIT
Running org.apache.phoenix.end2end.DateTimeIT
Tests run: 6, Failures: 0, Errors: 0, Skipped: 0, Time elapsed: 32.837 sec - in org.apache.phoenix.end2end.UpgradeIT
Running org.apache.phoenix.end2end.ArrayFillFunctionIT
Tests run: 108, Failures: 0, Errors: 0, Skipped: 0, Time elapsed: 103.754 sec - in org.apache.phoenix.end2end.SortMergeJoinIT
Running org.apache.phoenix.end2end.QueryExecWithoutSCNIT
Tests run: 30, Failures: 0, Errors: 0, Skipped: 0, Time elapsed: 22.505 sec - in org.apache.phoenix.end2end.ArrayConcatFunctionIT
Running org.apache.phoenix.end2end.SubqueryIT
Tests run: 1, Failures: 0, Errors: 0, Skipped: 0, Time elapsed: 2.34 sec - in org.apache.phoenix.end2end.QueryExecWithoutSCNIT
Running org.apache.phoenix.trace.PhoenixTracingEndToEndIT
Tests run: 26, Failures: 0, Errors: 0, Skipped: 0, Time elapsed: 10.652 sec - in org.apache.phoenix.end2end.ArrayFillFunctionIT
Running org.apache.phoenix.trace.PhoenixTraceReaderIT
Tests run: 2, Failures: 0, Errors: 0, Skipped: 0, Time elapsed: 1.128 sec - in org.apache.phoenix.trace.PhoenixTraceReaderIT
Running org.apache.phoenix.trace.PhoenixTableMetricsWriterIT
Tests run: 19, Failures: 0, Errors: 0, Skipped: 0, Time elapsed: 17.56 sec - in org.apache.phoenix.end2end.DateTimeIT
Tests run: 2, Failures: 0, Errors: 0, Skipped: 0, Time elapsed: 0.419 sec - in org.apache.phoenix.trace.PhoenixTableMetricsWriterIT
Tests run: 108, Failures: 0, Errors: 0, Skipped: 0, Time elapsed: 115.572 sec - in org.apache.phoenix.end2end.HashJoinIT
Tests run: 21, Failures: 0, Errors: 0, Skipped: 0, Time elapsed: 82.093 sec - in org.apache.phoenix.end2end.SubqueryIT
Tests run: 6, Failures: 0, Errors: 0, Skipped: 0, Time elapsed: 88.467 sec - in org.apache.phoenix.trace.PhoenixTracingEndToEndIT

Results :




Tests run: 1174, Failures: 0, Errors: 0, Skipped: 0

[INFO] 
[INFO] --- maven-failsafe-plugin:2.18:integration-test (NeedTheirOwnClusterTests) @ phoenix-core
---
[INFO] Failsafe report directory: <https://builds.apache.org/job/Phoenix-4.x-HBase-1.0/ws/phoenix-core/target/failsafe-reports>
[INFO] parallel='none', perCoreThreadCount=true, threadCount=0, useUnlimitedThreads=false,
threadCountSuites=0, threadCountClasses=0, threadCountMethods=0, parallelOptimized=true

-------------------------------------------------------
 T E S T S
-------------------------------------------------------
Running org.apache.phoenix.rpc.PhoenixServerRpcIT
Running org.apache.phoenix.rpc.PhoenixClientRpcIT
Running org.apache.phoenix.monitoring.PhoenixMetricsIT
Running org.apache.phoenix.iterate.RoundRobinResultIteratorWithStatsIT
Tests run: 2, Failures: 0, Errors: 0, Skipped: 0, Time elapsed: 7.698 sec - in org.apache.phoenix.rpc.PhoenixClientRpcIT
Tests run: 2, Failures: 0, Errors: 0, Skipped: 0, Time elapsed: 17.686 sec - in org.apache.phoenix.rpc.PhoenixServerRpcIT
Tests run: 1, Failures: 0, Errors: 0, Skipped: 0, Time elapsed: 15.34 sec - in org.apache.phoenix.iterate.RoundRobinResultIteratorWithStatsIT
Running org.apache.phoenix.end2end.ConnectionUtilIT
Running org.apache.phoenix.mapreduce.IndexToolIT
Running org.apache.phoenix.mapreduce.CsvBulkLoadToolIT
Running org.apache.phoenix.end2end.MultiCfQueryExecIT
Tests run: 1, Failures: 0, Errors: 0, Skipped: 0, Time elapsed: 19.46 sec - in org.apache.phoenix.end2end.ConnectionUtilIT
Tests run: 17, Failures: 0, Errors: 0, Skipped: 0, Time elapsed: 45.349 sec - in org.apache.phoenix.monitoring.PhoenixMetricsIT
Tests run: 7, Failures: 0, Errors: 0, Skipped: 0, Time elapsed: 17.306 sec - in org.apache.phoenix.end2end.MultiCfQueryExecIT
Running org.apache.phoenix.end2end.ViewIT
Running org.apache.phoenix.end2end.SaltedViewIT
Tests run: 2, Failures: 0, Errors: 0, Skipped: 0, Time elapsed: 9.478 sec - in org.apache.phoenix.end2end.SaltedViewIT
Running org.apache.phoenix.end2end.StatsCollectorIT
Running org.apache.phoenix.end2end.ParallelIteratorsIT
Tests run: 2, Failures: 0, Errors: 0, Skipped: 0, Time elapsed: 9.832 sec - in org.apache.phoenix.end2end.ParallelIteratorsIT
Running org.apache.phoenix.end2end.QueryTimeoutIT
Tests run: 22, Failures: 0, Errors: 0, Skipped: 0, Time elapsed: 61.785 sec - in org.apache.phoenix.end2end.ViewIT
Tests run: 1, Failures: 0, Errors: 0, Skipped: 0, Time elapsed: 9.883 sec - in org.apache.phoenix.end2end.QueryTimeoutIT
Tests run: 4, Failures: 0, Errors: 0, Skipped: 0, Time elapsed: 58.78 sec - in org.apache.phoenix.end2end.StatsCollectorIT
Running org.apache.phoenix.end2end.QueryWithLimitIT
Running org.apache.phoenix.end2end.ContextClassloaderIT
Tests run: 2, Failures: 0, Errors: 0, Skipped: 0, Time elapsed: 12.934 sec - in org.apache.phoenix.end2end.QueryWithLimitIT
Running org.apache.phoenix.end2end.index.MutableIndexFailureIT
Tests run: 3, Failures: 0, Errors: 0, Skipped: 0, Time elapsed: 6.45 sec - in org.apache.phoenix.end2end.ContextClassloaderIT
Running org.apache.phoenix.end2end.index.ImmutableIndexWithStatsIT
Tests run: 1, Failures: 0, Errors: 0, Skipped: 0, Time elapsed: 7.874 sec - in org.apache.phoenix.end2end.index.ImmutableIndexWithStatsIT
Running org.apache.phoenix.end2end.index.MutableIndexReplicationIT
Running org.apache.phoenix.end2end.UserDefinedFunctionsIT
Tests run: 1, Failures: 0, Errors: 0, Skipped: 0, Time elapsed: 17.641 sec - in org.apache.phoenix.end2end.index.MutableIndexReplicationIT
Running org.apache.phoenix.end2end.AlterTableIT
Tests run: 13, Failures: 0, Errors: 0, Skipped: 0, Time elapsed: 15.946 sec - in org.apache.phoenix.end2end.UserDefinedFunctionsIT
Running org.apache.phoenix.end2end.UnionAllIT
Tests run: 12, Failures: 0, Errors: 0, Skipped: 0, Time elapsed: 20.878 sec - in org.apache.phoenix.end2end.UnionAllIT
Running org.apache.phoenix.end2end.TenantSpecificTablesDDLIT
Tests run: 17, Failures: 0, Errors: 0, Skipped: 0, Time elapsed: 29.04 sec - in org.apache.phoenix.end2end.TenantSpecificTablesDDLIT
Running org.apache.phoenix.end2end.KeyOnlyIT
Tests run: 3, Failures: 0, Errors: 0, Skipped: 0, Time elapsed: 10.073 sec - in org.apache.phoenix.end2end.KeyOnlyIT
Running org.apache.phoenix.end2end.CountDistinctCompressionIT
Tests run: 1, Failures: 0, Errors: 0, Skipped: 0, Time elapsed: 7.498 sec - in org.apache.phoenix.end2end.CountDistinctCompressionIT
Tests run: 6, Failures: 0, Errors: 0, Skipped: 0, Time elapsed: 292.709 sec - in org.apache.phoenix.mapreduce.CsvBulkLoadToolIT
Running org.apache.phoenix.end2end.SpillableGroupByIT
Running org.apache.phoenix.end2end.TenantSpecificTablesDMLIT
Tests run: 1, Failures: 0, Errors: 0, Skipped: 0, Time elapsed: 10.251 sec - in org.apache.phoenix.end2end.SpillableGroupByIT
Running org.apache.phoenix.end2end.StatsCollectorWithSplitsAndMultiCFIT
Tests run: 16, Failures: 0, Errors: 0, Skipped: 0, Time elapsed: 28.455 sec - in org.apache.phoenix.end2end.TenantSpecificTablesDMLIT
Running org.apache.phoenix.hbase.index.FailForUnsupportedHBaseVersionsIT
Tests run: 9, Failures: 0, Errors: 0, Skipped: 0, Time elapsed: 343.328 sec - in org.apache.phoenix.mapreduce.IndexToolIT
Running org.apache.phoenix.hbase.index.covered.EndToEndCoveredColumnsIndexBuilderIT
Tests run: 2, Failures: 0, Errors: 0, Skipped: 0, Time elapsed: 9.6 sec - in org.apache.phoenix.hbase.index.covered.EndToEndCoveredColumnsIndexBuilderIT
Tests run: 2, Failures: 0, Errors: 0, Skipped: 0, Time elapsed: 16.148 sec - in org.apache.phoenix.hbase.index.FailForUnsupportedHBaseVersionsIT
Running org.apache.phoenix.hbase.index.covered.example.FailWithoutRetriesIT
Running org.apache.phoenix.hbase.index.covered.example.EndtoEndIndexingWithCompressionIT
Tests run: 2, Failures: 0, Errors: 0, Skipped: 0, Time elapsed: 28.623 sec - in org.apache.phoenix.end2end.StatsCollectorWithSplitsAndMultiCFIT
Tests run: 1, Failures: 0, Errors: 0, Skipped: 0, Time elapsed: 10.002 sec - in org.apache.phoenix.hbase.index.covered.example.FailWithoutRetriesIT
Running org.apache.phoenix.hbase.index.covered.example.EndToEndCoveredIndexingIT
Running org.apache.phoenix.hbase.index.balancer.IndexLoadBalancerIT
Tests run: 11, Failures: 0, Errors: 0, Skipped: 0, Time elapsed: 49.635 sec - in org.apache.phoenix.hbase.index.covered.example.EndtoEndIndexingWithCompressionIT
Tests run: 11, Failures: 0, Errors: 0, Skipped: 0, Time elapsed: 50.027 sec - in org.apache.phoenix.hbase.index.covered.example.EndToEndCoveredIndexingIT
Running org.apache.hadoop.hbase.regionserver.wal.WALReplayWithIndexWritesAndUncompressedWALInHBase_094_9_IT
Running org.apache.phoenix.execute.PartialCommitIT
Tests run: 1, Failures: 0, Errors: 0, Skipped: 0, Time elapsed: 12.52 sec - in org.apache.hadoop.hbase.regionserver.wal.WALReplayWithIndexWritesAndUncompressedWALInHBase_094_9_IT
Running org.apache.hadoop.hbase.regionserver.wal.WALReplayWithIndexWritesAndCompressedWALIT
Tests run: 6, Failures: 0, Errors: 0, Skipped: 0, Time elapsed: 7.767 sec - in org.apache.phoenix.execute.PartialCommitIT
Tests run: 1, Failures: 0, Errors: 0, Skipped: 0, Time elapsed: 12.54 sec - in org.apache.hadoop.hbase.regionserver.wal.WALReplayWithIndexWritesAndCompressedWALIT
Tests run: 9, Failures: 0, Errors: 0, Skipped: 0, Time elapsed: 92.31 sec - in org.apache.phoenix.hbase.index.balancer.IndexLoadBalancerIT
Tests run: 53, Failures: 0, Errors: 0, Skipped: 0, Time elapsed: 309.186 sec - in org.apache.phoenix.end2end.AlterTableIT
Tests run: 3, Failures: 1, Errors: 1, Skipped: 0, Time elapsed: 370.282 sec <<< FAILURE!
- in org.apache.phoenix.end2end.index.MutableIndexFailureIT
testWriteFailureDisablesIndex(org.apache.phoenix.end2end.index.MutableIndexFailureIT)  Time
elapsed: 313.547 sec  <<< ERROR!
org.junit.runners.model.TestTimedOutException: test timed out after 300000 milliseconds
	at java.lang.Thread.sleep(Native Method)
	at org.apache.phoenix.end2end.index.MutableIndexFailureIT.testWriteFailureDisablesIndex(MutableIndexFailureIT.java:238)
	at org.apache.phoenix.end2end.index.MutableIndexFailureIT.testWriteFailureDisablesIndex(MutableIndexFailureIT.java:141)

testWriteFailureDisablesLocalIndex(org.apache.phoenix.end2end.index.MutableIndexFailureIT)
 Time elapsed: 23.423 sec  <<< FAILURE!
org.junit.ComparisonFailure: expected:<[DISABL]E> but was:<[ACTIV]E>
	at org.junit.Assert.assertEquals(Assert.java:115)
	at org.junit.Assert.assertEquals(Assert.java:144)
	at org.apache.phoenix.end2end.index.MutableIndexFailureIT.testWriteFailureDisablesIndex(MutableIndexFailureIT.java:210)
	at org.apache.phoenix.end2end.index.MutableIndexFailureIT.testWriteFailureDisablesLocalIndex(MutableIndexFailureIT.java:136)


Results :

Failed tests: 
  MutableIndexFailureIT.testWriteFailureDisablesLocalIndex:136->testWriteFailureDisablesIndex:210
expected:<[DISABL]E> but was:<[ACTIV]E>

Tests in error: 
  MutableIndexFailureIT.testWriteFailureDisablesIndex:141->testWriteFailureDisablesIndex:238
ยป TestTimedOut


Tests run: 248, Failures: 1, Errors: 1, Skipped: 0

[INFO] 
[INFO] --- maven-failsafe-plugin:2.18:verify (ClientManagedTimeTests) @ phoenix-core ---
[INFO] Failsafe report directory: <https://builds.apache.org/job/Phoenix-4.x-HBase-1.0/ws/phoenix-core/target/failsafe-reports>
[INFO] ------------------------------------------------------------------------
[INFO] Reactor Summary:
[INFO] 
[INFO] Apache Phoenix .................................... SUCCESS [2.935s]
[INFO] Phoenix Core ...................................... FAILURE [25:03.912s]
[INFO] Phoenix - Flume ................................... SKIPPED
[INFO] Phoenix - Pig ..................................... SKIPPED
[INFO] Phoenix Query Server Client ....................... SKIPPED
[INFO] Phoenix Query Server .............................. SKIPPED
[INFO] Phoenix - Pherf ................................... SKIPPED
[INFO] Phoenix - Spark ................................... SKIPPED
[INFO] Phoenix Assembly .................................. SKIPPED
[INFO] Phoenix - Tracing Web Application ................. SKIPPED
[INFO] ------------------------------------------------------------------------
[INFO] BUILD FAILURE
[INFO] ------------------------------------------------------------------------
[INFO] Total time: 25:07.474s
[INFO] Finished at: Thu Oct 15 20:05:11 UTC 2015
[INFO] Final Memory: 61M/1177M
[INFO] ------------------------------------------------------------------------
[ERROR] Failed to execute goal org.apache.maven.plugins:maven-failsafe-plugin:2.18:verify
(ClientManagedTimeTests) on project phoenix-core: There are test failures.
[ERROR] 
[ERROR] Please refer to <https://builds.apache.org/job/Phoenix-4.x-HBase-1.0/ws/phoenix-core/target/failsafe-reports>
for the individual test results.
[ERROR] -> [Help 1]
[ERROR] 
[ERROR] To see the full stack trace of the errors, re-run Maven with the -e switch.
[ERROR] Re-run Maven using the -X switch to enable full debug logging.
[ERROR] 
[ERROR] For more information about the errors and possible solutions, please read the following
articles:
[ERROR] [Help 1] http://cwiki.apache.org/confluence/display/MAVEN/MojoFailureException
[ERROR] 
[ERROR] After correcting the problems, you can resume the build with the command
[ERROR]   mvn <goals> -rf :phoenix-core
Build step 'Invoke top-level Maven targets' marked build as failure
Archiving artifacts
Compressed 1.27 GB of artifacts by 60.0% relative to #183
Recording test results

Mime
View raw message