phoenix-commits mailing list archives

Site index · List index
Message view « Date » · « Thread »
Top « Date » · « Thread »
From Apache Jenkins Server <jenk...@builds.apache.org>
Subject Build failed in Jenkins: Phoenix | Master #935
Date Thu, 22 Oct 2015 22:57:59 GMT
See <https://builds.apache.org/job/Phoenix-master/935/changes>

Changes:

[cmarcel] PHOENIX-2345 - Pherf - ResultManager does not flush

------------------------------------------
[...truncated 6940 lines...]
Tests run: 1, Failures: 0, Errors: 0, Skipped: 0, Time elapsed: 0.001 sec - in org.apache.phoenix.expression.function.InstrFunctionTest
Running org.apache.phoenix.expression.StringToArrayFunctionTest
Tests run: 20, Failures: 0, Errors: 0, Skipped: 0, Time elapsed: 0.01 sec - in org.apache.phoenix.expression.StringToArrayFunctionTest
Running org.apache.phoenix.expression.NullValueTest
Tests run: 3, Failures: 0, Errors: 0, Skipped: 0, Time elapsed: 0.098 sec - in org.apache.phoenix.expression.NullValueTest
Running org.apache.phoenix.expression.ExpFunctionTest
Tests run: 1, Failures: 0, Errors: 0, Skipped: 0, Time elapsed: 0.005 sec - in org.apache.phoenix.expression.ExpFunctionTest
Running org.apache.phoenix.expression.CbrtFunctionTest
Tests run: 1, Failures: 0, Errors: 0, Skipped: 0, Time elapsed: 0.004 sec - in org.apache.phoenix.expression.CbrtFunctionTest
Running org.apache.phoenix.expression.RegexpSubstrFunctionTest
Tests run: 1, Failures: 0, Errors: 0, Skipped: 0, Time elapsed: 0.109 sec - in org.apache.phoenix.expression.RegexpSubstrFunctionTest
Running org.apache.phoenix.expression.RegexpReplaceFunctionTest
Tests run: 1, Failures: 0, Errors: 0, Skipped: 0, Time elapsed: 0.004 sec - in org.apache.phoenix.expression.RegexpReplaceFunctionTest
Running org.apache.phoenix.expression.ArrayPrependFunctionTest
Tests run: 37, Failures: 0, Errors: 0, Skipped: 0, Time elapsed: 0.23 sec - in org.apache.phoenix.expression.ArrayPrependFunctionTest
Running org.apache.phoenix.expression.DeterminismTest
Tests run: 1, Failures: 0, Errors: 0, Skipped: 0, Time elapsed: 0 sec - in org.apache.phoenix.expression.DeterminismTest
Running org.apache.phoenix.expression.SortOrderExpressionTest
Tests run: 24, Failures: 0, Errors: 0, Skipped: 0, Time elapsed: 0.014 sec - in org.apache.phoenix.expression.SortOrderExpressionTest
Running org.apache.phoenix.expression.ArithmeticOperationTest
Tests run: 6, Failures: 0, Errors: 0, Skipped: 0, Time elapsed: 0.008 sec - in org.apache.phoenix.expression.ArithmeticOperationTest
Running org.apache.phoenix.expression.ArrayToStringFunctionTest
Tests run: 24, Failures: 0, Errors: 0, Skipped: 0, Time elapsed: 0.01 sec - in org.apache.phoenix.expression.ArrayToStringFunctionTest
Running org.apache.phoenix.expression.OctetLengthFunctionTest
Tests run: 1, Failures: 0, Errors: 0, Skipped: 0, Time elapsed: 0.014 sec - in org.apache.phoenix.expression.OctetLengthFunctionTest
Running org.apache.phoenix.expression.GetSetByteBitFunctionTest
Tests run: 2, Failures: 0, Errors: 0, Skipped: 0, Time elapsed: 0.426 sec - in org.apache.phoenix.expression.GetSetByteBitFunctionTest
Running org.apache.phoenix.expression.ArrayFillFunctionTest
Tests run: 14, Failures: 0, Errors: 0, Skipped: 0, Time elapsed: 0.006 sec - in org.apache.phoenix.expression.ArrayFillFunctionTest
Running org.apache.phoenix.expression.ILikeExpressionTest
Tests run: 3, Failures: 0, Errors: 0, Skipped: 0, Time elapsed: 0.007 sec - in org.apache.phoenix.expression.ILikeExpressionTest
Tests run: 5, Failures: 0, Errors: 0, Skipped: 1, Time elapsed: 6.009 sec - in org.apache.phoenix.memory.MemoryManagerTest
Running org.apache.phoenix.util.IndexUtilTest
Tests run: 2, Failures: 0, Errors: 0, Skipped: 0, Time elapsed: 0 sec - in org.apache.phoenix.util.IndexUtilTest
Running org.apache.phoenix.util.LogUtilTest
Tests run: 3, Failures: 0, Errors: 0, Skipped: 0, Time elapsed: 0.053 sec - in org.apache.phoenix.util.LogUtilTest
Running org.apache.phoenix.util.QueryUtilTest
Tests run: 9, Failures: 0, Errors: 0, Skipped: 0, Time elapsed: 0.001 sec - in org.apache.phoenix.util.QueryUtilTest
Running org.apache.phoenix.util.TenantIdByteConversionTest
Tests run: 18, Failures: 0, Errors: 0, Skipped: 0, Time elapsed: 0.004 sec - in org.apache.phoenix.util.TenantIdByteConversionTest
Running org.apache.phoenix.util.PropertiesUtilTest
Tests run: 3, Failures: 0, Errors: 0, Skipped: 0, Time elapsed: 0.029 sec - in org.apache.phoenix.util.PropertiesUtilTest
Running org.apache.phoenix.util.ColumnInfoTest
Tests run: 4, Failures: 0, Errors: 0, Skipped: 0, Time elapsed: 0.001 sec - in org.apache.phoenix.util.ColumnInfoTest
Running org.apache.phoenix.util.csv.CsvUpsertExecutorTest
Tests run: 5, Failures: 0, Errors: 0, Skipped: 0, Time elapsed: 0.281 sec - in org.apache.phoenix.util.csv.CsvUpsertExecutorTest
Running org.apache.phoenix.util.ByteUtilTest
Tests run: 3, Failures: 0, Errors: 0, Skipped: 0, Time elapsed: 0.091 sec - in org.apache.phoenix.util.ByteUtilTest
Running org.apache.phoenix.util.LikeExpressionTest
Tests run: 1, Failures: 0, Errors: 0, Skipped: 0, Time elapsed: 0 sec - in org.apache.phoenix.util.LikeExpressionTest
Running org.apache.phoenix.util.JDBCUtilTest
Tests run: 11, Failures: 0, Errors: 0, Skipped: 0, Time elapsed: 0.002 sec - in org.apache.phoenix.util.JDBCUtilTest
Running org.apache.phoenix.schema.PMetaDataImplTest
Tests run: 4, Failures: 0, Errors: 0, Skipped: 0, Time elapsed: 0.003 sec - in org.apache.phoenix.schema.PMetaDataImplTest
Running org.apache.phoenix.schema.PCharPadTest
Tests run: 9, Failures: 0, Errors: 0, Skipped: 0, Time elapsed: 0.002 sec - in org.apache.phoenix.schema.PCharPadTest
Running org.apache.phoenix.schema.SaltingUtilTest
Tests run: 2, Failures: 0, Errors: 0, Skipped: 0, Time elapsed: 0 sec - in org.apache.phoenix.schema.SaltingUtilTest
Running org.apache.phoenix.schema.RowKeySchemaTest
Tests run: 6, Failures: 0, Errors: 0, Skipped: 0, Time elapsed: 0.083 sec - in org.apache.phoenix.schema.RowKeySchemaTest
Running org.apache.phoenix.schema.types.PVarcharArrayToStringTest
Tests run: 8, Failures: 0, Errors: 0, Skipped: 0, Time elapsed: 0.001 sec - in org.apache.phoenix.schema.types.PVarcharArrayToStringTest
Running org.apache.phoenix.schema.types.PrimitiveLongPhoenixArrayToStringTest
Tests run: 6, Failures: 0, Errors: 0, Skipped: 0, Time elapsed: 0.002 sec - in org.apache.phoenix.schema.types.PrimitiveLongPhoenixArrayToStringTest
Running org.apache.phoenix.schema.types.PrimitiveIntPhoenixArrayToStringTest
Tests run: 6, Failures: 0, Errors: 0, Skipped: 0, Time elapsed: 0.001 sec - in org.apache.phoenix.schema.types.PrimitiveIntPhoenixArrayToStringTest
Running org.apache.phoenix.schema.types.PrimitiveBooleanPhoenixArrayToStringTest
Tests run: 6, Failures: 0, Errors: 0, Skipped: 0, Time elapsed: 0.001 sec - in org.apache.phoenix.schema.types.PrimitiveBooleanPhoenixArrayToStringTest
Running org.apache.phoenix.schema.types.PDateArrayToStringTest
Tests run: 6, Failures: 0, Errors: 0, Skipped: 0, Time elapsed: 0.003 sec - in org.apache.phoenix.schema.types.PDateArrayToStringTest
Running org.apache.phoenix.schema.types.PDataTypeForArraysTest
Tests run: 67, Failures: 0, Errors: 0, Skipped: 0, Time elapsed: 0.025 sec - in org.apache.phoenix.schema.types.PDataTypeForArraysTest
Running org.apache.phoenix.expression.function.ExternalSqlTypeIdFunctionTest
Tests run: 3, Failures: 0, Errors: 0, Skipped: 0, Time elapsed: 0 sec - in org.apache.phoenix.expression.function.ExternalSqlTypeIdFunctionTest
Running org.apache.phoenix.expression.SqrtFunctionTest
Tests run: 1, Failures: 0, Errors: 0, Skipped: 0, Time elapsed: 0.003 sec - in org.apache.phoenix.expression.SqrtFunctionTest
Running org.apache.phoenix.expression.SignFunctionTest
Tests run: 1, Failures: 0, Errors: 0, Skipped: 0, Time elapsed: 0.007 sec - in org.apache.phoenix.expression.SignFunctionTest
Running org.apache.phoenix.expression.RoundFloorCeilExpressionsTest
Tests run: 21, Failures: 0, Errors: 0, Skipped: 0, Time elapsed: 0.407 sec - in org.apache.phoenix.expression.RoundFloorCeilExpressionsTest
Running org.apache.phoenix.expression.RegexpSplitFunctionTest
Tests run: 1, Failures: 0, Errors: 0, Skipped: 0, Time elapsed: 0.09 sec - in org.apache.phoenix.expression.RegexpSplitFunctionTest
Running org.apache.phoenix.expression.PowerFunctionTest
Tests run: 1, Failures: 0, Errors: 0, Skipped: 0, Time elapsed: 0.009 sec - in org.apache.phoenix.expression.PowerFunctionTest
Running org.apache.phoenix.expression.ColumnExpressionTest
Tests run: 4, Failures: 0, Errors: 0, Skipped: 0, Time elapsed: 0.001 sec - in org.apache.phoenix.expression.ColumnExpressionTest
Running org.apache.phoenix.expression.ArrayConcatFunctionTest
Tests run: 35, Failures: 0, Errors: 0, Skipped: 0, Time elapsed: 0.385 sec - in org.apache.phoenix.expression.ArrayConcatFunctionTest
Running org.apache.phoenix.expression.ArrayAppendFunctionTest
Tests run: 25, Failures: 0, Errors: 0, Skipped: 0, Time elapsed: 0.036 sec - in org.apache.phoenix.expression.ArrayAppendFunctionTest
Running org.apache.phoenix.expression.util.regex.PatternPerformanceTest
Tests run: 1, Failures: 0, Errors: 0, Skipped: 0, Time elapsed: 0 sec - in org.apache.phoenix.expression.util.regex.PatternPerformanceTest
Running org.apache.phoenix.expression.LnLogFunctionTest
Tests run: 1, Failures: 0, Errors: 0, Skipped: 0, Time elapsed: 0.009 sec - in org.apache.phoenix.expression.LnLogFunctionTest
Running org.apache.phoenix.expression.LikeExpressionTest
Tests run: 4, Failures: 0, Errors: 0, Skipped: 0, Time elapsed: 0.006 sec - in org.apache.phoenix.expression.LikeExpressionTest
Running org.apache.phoenix.expression.CoerceExpressionTest
Tests run: 5, Failures: 0, Errors: 0, Skipped: 0, Time elapsed: 0.001 sec - in org.apache.phoenix.expression.CoerceExpressionTest
Running org.apache.phoenix.expression.AbsFunctionTest
Tests run: 1, Failures: 0, Errors: 0, Skipped: 0, Time elapsed: 0.007 sec - in org.apache.phoenix.expression.AbsFunctionTest

Results :




Tests run: 1281, Failures: 0, Errors: 0, Skipped: 3

[INFO] 
[INFO] --- maven-source-plugin:2.2.1:jar-no-fork (attach-sources) @ phoenix-core ---
[INFO] Building jar: /x1/jenkins/jenkins-slave/workspace/Phoenix-master/phoenix-core/target/phoenix-core-4.6.0-HBase-1.1-sources.jar
[INFO] 
[INFO] --- maven-jar-plugin:2.4:test-jar (default) @ phoenix-core ---
[INFO] Building jar: /x1/jenkins/jenkins-slave/workspace/Phoenix-master/phoenix-core/target/phoenix-core-4.6.0-HBase-1.1-tests.jar
[INFO] 
[INFO] --- maven-jar-plugin:2.4:jar (default-jar) @ phoenix-core ---
[INFO] Building jar: /x1/jenkins/jenkins-slave/workspace/Phoenix-master/phoenix-core/target/phoenix-core-4.6.0-HBase-1.1.jar
[INFO] 
[INFO] --- maven-site-plugin:3.2:attach-descriptor (attach-descriptor) @ phoenix-core ---
[INFO] 
[INFO] --- maven-assembly-plugin:2.5.2:single (core) @ phoenix-core ---
[INFO] Reading assembly descriptor: src/build/phoenix-core.xml
[WARNING] Artifact: org.apache.phoenix:phoenix-core:jar:4.6.0-HBase-1.1 references the same
file as the assembly destination file. Moving it to a temporary location for inclusion.
[INFO] Building jar: /x1/jenkins/jenkins-slave/workspace/Phoenix-master/phoenix-core/target/phoenix-core-4.6.0-HBase-1.1.jar
[INFO] 
[INFO] --- maven-failsafe-plugin:2.18:integration-test (ClientManagedTimeTests) @ phoenix-core
---
[INFO] Failsafe report directory: /x1/jenkins/jenkins-slave/workspace/Phoenix-master/phoenix-core/target/failsafe-reports
[INFO] parallel='none', perCoreThreadCount=true, threadCount=0, useUnlimitedThreads=false,
threadCountSuites=0, threadCountClasses=0, threadCountMethods=0, parallelOptimized=true

-------------------------------------------------------
 T E S T S
-------------------------------------------------------
Running org.apache.phoenix.end2end.SequenceBulkAllocationIT
Running org.apache.phoenix.end2end.CompareDecimalToLongIT
Running org.apache.phoenix.end2end.ScanQueryIT
Running org.apache.phoenix.end2end.CastAndCoerceIT
Running org.apache.phoenix.end2end.CustomEntityDataIT
Tests run: 3, Failures: 0, Errors: 0, Skipped: 0, Time elapsed: 14.927 sec - in org.apache.phoenix.end2end.CustomEntityDataIT
Tests run: 8, Failures: 0, Errors: 0, Skipped: 0, Time elapsed: 18.111 sec - in org.apache.phoenix.end2end.CompareDecimalToLongIT
Running org.apache.phoenix.end2end.DistinctCountIT
Running org.apache.phoenix.end2end.UpsertValuesIT
Tests run: 10, Failures: 0, Errors: 0, Skipped: 0, Time elapsed: 40.244 sec - in org.apache.phoenix.end2end.DistinctCountIT
Running org.apache.phoenix.end2end.OrderByIT
Tests run: 56, Failures: 0, Errors: 0, Skipped: 0, Time elapsed: 63.096 sec - in org.apache.phoenix.end2end.SequenceBulkAllocationIT
Running org.apache.phoenix.end2end.QueryDatabaseMetaDataIT
Tests run: 49, Failures: 0, Errors: 0, Skipped: 0, Time elapsed: 101.598 sec - in org.apache.phoenix.end2end.CastAndCoerceIT
Running org.apache.phoenix.end2end.NativeHBaseTypesIT
Tests run: 7, Failures: 0, Errors: 0, Skipped: 0, Time elapsed: 55.071 sec - in org.apache.phoenix.end2end.OrderByIT
Running org.apache.phoenix.end2end.SequenceIT
Tests run: 7, Failures: 0, Errors: 0, Skipped: 0, Time elapsed: 8.612 sec - in org.apache.phoenix.end2end.NativeHBaseTypesIT
Running org.apache.phoenix.end2end.AggregateQueryIT
Tests run: 119, Failures: 0, Errors: 0, Skipped: 0, Time elapsed: 168.957 sec - in org.apache.phoenix.end2end.ScanQueryIT
Running org.apache.phoenix.end2end.ReadIsolationLevelIT
Tests run: 2, Failures: 0, Errors: 0, Skipped: 0, Time elapsed: 7.747 sec - in org.apache.phoenix.end2end.ReadIsolationLevelIT
Running org.apache.phoenix.end2end.InMemoryOrderByIT
Tests run: 23, Failures: 0, Errors: 0, Skipped: 0, Time elapsed: 174.062 sec - in org.apache.phoenix.end2end.UpsertValuesIT
Running org.apache.phoenix.end2end.ExtendedQueryExecIT
Tests run: 53, Failures: 0, Errors: 0, Skipped: 0, Time elapsed: 82.968 sec - in org.apache.phoenix.end2end.SequenceIT
Running org.apache.phoenix.end2end.UnnestArrayIT
Tests run: 1, Failures: 0, Errors: 0, Skipped: 1, Time elapsed: 0.001 sec - in org.apache.phoenix.end2end.UnnestArrayIT
Running org.apache.phoenix.end2end.TruncateFunctionIT
Tests run: 4, Failures: 0, Errors: 0, Skipped: 0, Time elapsed: 12.583 sec - in org.apache.phoenix.end2end.ExtendedQueryExecIT
Tests run: 1, Failures: 0, Errors: 0, Skipped: 0, Time elapsed: 10.105 sec - in org.apache.phoenix.end2end.TruncateFunctionIT
Running org.apache.phoenix.end2end.DynamicColumnIT
Running org.apache.phoenix.end2end.PercentileIT
Tests run: 5, Failures: 0, Errors: 0, Skipped: 0, Time elapsed: 7.165 sec - in org.apache.phoenix.end2end.DynamicColumnIT
Running org.apache.phoenix.end2end.FunkyNamesIT
Tests run: 42, Failures: 0, Errors: 0, Skipped: 0, Time elapsed: 103.855 sec - in org.apache.phoenix.end2end.AggregateQueryIT
Running org.apache.phoenix.end2end.NotQueryIT
Tests run: 17, Failures: 0, Errors: 0, Skipped: 0, Time elapsed: 169.056 sec - in org.apache.phoenix.end2end.QueryDatabaseMetaDataIT
Tests run: 3, Failures: 0, Errors: 0, Skipped: 0, Time elapsed: 13.483 sec - in org.apache.phoenix.end2end.FunkyNamesIT
Running org.apache.phoenix.end2end.ToNumberFunctionIT
Running org.apache.phoenix.end2end.DynamicUpsertIT
Tests run: 7, Failures: 0, Errors: 0, Skipped: 0, Time elapsed: 61.049 sec - in org.apache.phoenix.end2end.InMemoryOrderByIT
Running org.apache.phoenix.end2end.PointInTimeQueryIT
Tests run: 7, Failures: 0, Errors: 0, Skipped: 0, Time elapsed: 7.661 sec - in org.apache.phoenix.end2end.DynamicUpsertIT
Tests run: 17, Failures: 0, Errors: 0, Skipped: 0, Time elapsed: 34.492 sec - in org.apache.phoenix.end2end.PercentileIT
Running org.apache.phoenix.end2end.DerivedTableIT
Running org.apache.phoenix.end2end.ColumnProjectionOptimizationIT
Tests run: 18, Failures: 0, Errors: 0, Skipped: 0, Time elapsed: 28.273 sec - in org.apache.phoenix.end2end.ToNumberFunctionIT
Running org.apache.phoenix.end2end.TopNIT
Tests run: 4, Failures: 0, Errors: 0, Skipped: 0, Time elapsed: 10.535 sec - in org.apache.phoenix.end2end.TopNIT
Running org.apache.phoenix.end2end.salted.SaltedTableIT
Tests run: 16, Failures: 0, Errors: 0, Skipped: 0, Time elapsed: 36.016 sec - in org.apache.phoenix.end2end.DerivedTableIT
Running org.apache.phoenix.end2end.CaseStatementIT
Tests run: 8, Failures: 0, Errors: 0, Skipped: 0, Time elapsed: 18.909 sec - in org.apache.phoenix.end2end.salted.SaltedTableIT
Running org.apache.phoenix.end2end.ToCharFunctionIT
Tests run: 3, Failures: 0, Errors: 0, Skipped: 0, Time elapsed: 48.043 sec - in org.apache.phoenix.end2end.ColumnProjectionOptimizationIT
Running org.apache.phoenix.end2end.QueryIT
Tests run: 14, Failures: 0, Errors: 0, Skipped: 0, Time elapsed: 65.754 sec - in org.apache.phoenix.end2end.PointInTimeQueryIT
Running org.apache.phoenix.end2end.UpsertSelectIT
Tests run: 10, Failures: 0, Errors: 0, Skipped: 0, Time elapsed: 20.071 sec - in org.apache.phoenix.end2end.ToCharFunctionIT
Running org.apache.phoenix.end2end.VariableLengthPKIT
Tests run: 77, Failures: 0, Errors: 0, Skipped: 0, Time elapsed: 137.902 sec - in org.apache.phoenix.end2end.NotQueryIT
Running org.apache.phoenix.end2end.CreateTableIT
Tests run: 63, Failures: 0, Errors: 0, Skipped: 0, Time elapsed: 141.629 sec - in org.apache.phoenix.end2end.CaseStatementIT
Running org.apache.phoenix.end2end.RowValueConstructorIT
Tests run: 50, Failures: 0, Errors: 0, Skipped: 0, Time elapsed: 152.977 sec - in org.apache.phoenix.end2end.VariableLengthPKIT
Running org.apache.phoenix.end2end.ArrayIT
Tests run: 13, Failures: 0, Errors: 0, Skipped: 0, Time elapsed: 138.117 sec - in org.apache.phoenix.end2end.CreateTableIT
Running org.apache.phoenix.end2end.GroupByCaseIT
Tests run: 3, Failures: 0, Errors: 0, Skipped: 0, Time elapsed: 14.264 sec - in org.apache.phoenix.end2end.GroupByCaseIT
Running org.apache.phoenix.end2end.SpooledOrderByIT
Tests run: 126, Failures: 0, Errors: 0, Skipped: 0, Time elapsed: 245.852 sec - in org.apache.phoenix.end2end.QueryIT
Running org.apache.phoenix.end2end.ClientTimeArithmeticQueryIT
Tests run: 7, Failures: 0, Errors: 0, Skipped: 0, Time elapsed: 74.317 sec - in org.apache.phoenix.end2end.SpooledOrderByIT
Running org.apache.phoenix.end2end.GroupByIT
Tests run: 18, Failures: 0, Errors: 0, Skipped: 0, Time elapsed: 287.666 sec - in org.apache.phoenix.end2end.UpsertSelectIT
Running org.apache.phoenix.end2end.ProductMetricsIT
Tests run: 77, Failures: 0, Errors: 0, Skipped: 0, Time elapsed: 211.067 sec - in org.apache.phoenix.end2end.ArrayIT
Tests run: 61, Failures: 0, Errors: 0, Skipped: 0, Time elapsed: 89.506 sec - in org.apache.phoenix.end2end.ProductMetricsIT
Tests run: 45, Failures: 0, Errors: 0, Skipped: 0, Time elapsed: 261.185 sec - in org.apache.phoenix.end2end.RowValueConstructorIT
Tests run: 105, Failures: 0, Errors: 0, Skipped: 0, Time elapsed: 152.96 sec - in org.apache.phoenix.end2end.GroupByIT
Tests run: 210, Failures: 0, Errors: 0, Skipped: 0, Time elapsed: 356.157 sec - in org.apache.phoenix.end2end.ClientTimeArithmeticQueryIT
[INFO] ------------------------------------------------------------------------
[INFO] Reactor Summary:
[INFO] 
[INFO] Apache Phoenix .................................... SUCCESS [6.458s]
[INFO] Phoenix Core ...................................... FAILURE [16:51.956s]
[INFO] Phoenix - Flume ................................... SKIPPED
[INFO] Phoenix - Pig ..................................... SKIPPED
[INFO] Phoenix Query Server Client ....................... SKIPPED
[INFO] Phoenix Query Server .............................. SKIPPED
[INFO] Phoenix - Pherf ................................... SKIPPED
[INFO] Phoenix - Spark ................................... SKIPPED
[INFO] Phoenix Assembly .................................. SKIPPED
[INFO] Phoenix - Tracing Web Application ................. SKIPPED
[INFO] ------------------------------------------------------------------------
[INFO] BUILD FAILURE
[INFO] ------------------------------------------------------------------------
[INFO] Total time: 16:59.077s
[INFO] Finished at: Thu Oct 22 22:56:18 UTC 2015
[INFO] Final Memory: 67M/1205M
[INFO] ------------------------------------------------------------------------
[ERROR] Failed to execute goal org.apache.maven.plugins:maven-failsafe-plugin:2.18:integration-test
(ClientManagedTimeTests) on project phoenix-core: Execution ClientManagedTimeTests of goal
org.apache.maven.plugins:maven-failsafe-plugin:2.18:integration-test failed. NullPointerException
-> [Help 1]
[ERROR] 
[ERROR] To see the full stack trace of the errors, re-run Maven with the -e switch.
[ERROR] Re-run Maven using the -X switch to enable full debug logging.
[ERROR] 
[ERROR] For more information about the errors and possible solutions, please read the following
articles:
[ERROR] [Help 1] http://cwiki.apache.org/confluence/display/MAVEN/PluginExecutionException
[ERROR] 
[ERROR] After correcting the problems, you can resume the build with the command
[ERROR]   mvn <goals> -rf :phoenix-core
Build step 'Invoke top-level Maven targets' marked build as failure
Archiving artifacts
Compressed 510.46 MB of artifacts by 48.2% relative to #934
Updating PHOENIX-2345
Recording test results

Mime
View raw message