phoenix-commits mailing list archives

Site index · List index
Message view « Date » · « Thread »
Top « Date » · « Thread »
From Apache Jenkins Server <jenk...@builds.apache.org>
Subject Build failed in Jenkins: Phoenix-4.x-HBase-1.0 #182
Date Thu, 08 Oct 2015 17:44:36 GMT
See <https://builds.apache.org/job/Phoenix-4.x-HBase-1.0/182/changes>

Changes:

[jfernando] PHOENIX-2310 Fix to address issue in Phoenix / Pig integration that was

------------------------------------------
[...truncated 6757 lines...]
Tests run: 2, Failures: 0, Errors: 0, Skipped: 0, Time elapsed: 3.197 sec - in org.apache.phoenix.end2end.RTrimFunctionIT
Running org.apache.phoenix.end2end.PhoenixRuntimeIT
Tests run: 45, Failures: 0, Errors: 0, Skipped: 0, Time elapsed: 60.386 sec - in org.apache.phoenix.end2end.SortOrderIT
Running org.apache.phoenix.end2end.RegexpSubstrFunctionIT
Tests run: 2, Failures: 0, Errors: 0, Skipped: 0, Time elapsed: 3.291 sec - in org.apache.phoenix.end2end.RegexpSubstrFunctionIT
Running org.apache.phoenix.end2end.ServerExceptionIT
Tests run: 1, Failures: 0, Errors: 0, Skipped: 0, Time elapsed: 2.711 sec - in org.apache.phoenix.end2end.ServerExceptionIT
Running org.apache.phoenix.end2end.ExpFunctionEnd2EndIT
Tests run: 3, Failures: 0, Errors: 0, Skipped: 0, Time elapsed: 17.598 sec - in org.apache.phoenix.end2end.StoreNullsIT
Running org.apache.phoenix.end2end.ArrayAppendFunctionIT
Tests run: 2, Failures: 0, Errors: 0, Skipped: 0, Time elapsed: 15.727 sec - in org.apache.phoenix.end2end.PhoenixRuntimeIT
Running org.apache.phoenix.end2end.AutoCommitIT
Tests run: 3, Failures: 0, Errors: 0, Skipped: 0, Time elapsed: 9.339 sec - in org.apache.phoenix.end2end.ExpFunctionEnd2EndIT
Running org.apache.phoenix.end2end.SortMergeJoinIT
Tests run: 1, Failures: 0, Errors: 0, Skipped: 0, Time elapsed: 2.684 sec - in org.apache.phoenix.end2end.AutoCommitIT
Running org.apache.phoenix.end2end.StddevIT
Tests run: 4, Failures: 0, Errors: 0, Skipped: 0, Time elapsed: 5.027 sec - in org.apache.phoenix.end2end.StddevIT
Running org.apache.phoenix.end2end.IsNullIT
Tests run: 34, Failures: 0, Errors: 0, Skipped: 0, Time elapsed: 12.542 sec - in org.apache.phoenix.end2end.ArrayAppendFunctionIT
Running org.apache.phoenix.end2end.SignFunctionEnd2EndIT
Tests run: 3, Failures: 0, Errors: 0, Skipped: 0, Time elapsed: 4.669 sec - in org.apache.phoenix.end2end.IsNullIT
Running org.apache.phoenix.end2end.LastValueFunctionIT
Tests run: 2, Failures: 0, Errors: 0, Skipped: 0, Time elapsed: 4.629 sec - in org.apache.phoenix.end2end.SignFunctionEnd2EndIT
Running org.apache.phoenix.end2end.HashJoinLocalIndexIT
Tests run: 11, Failures: 0, Errors: 0, Skipped: 0, Time elapsed: 10.43 sec - in org.apache.phoenix.end2end.LastValueFunctionIT
Running org.apache.phoenix.end2end.RoundFloorCeilFunctionsEnd2EndIT
Tests run: 1, Failures: 0, Errors: 0, Skipped: 0, Time elapsed: 14.788 sec - in org.apache.phoenix.end2end.HashJoinLocalIndexIT
Running org.apache.phoenix.end2end.LpadFunctionIT
Tests run: 12, Failures: 0, Errors: 0, Skipped: 0, Time elapsed: 11.455 sec - in org.apache.phoenix.end2end.LpadFunctionIT
Running org.apache.phoenix.iterate.RoundRobinResultIteratorIT
Tests run: 31, Failures: 0, Errors: 0, Skipped: 0, Time elapsed: 21.748 sec - in org.apache.phoenix.end2end.RoundFloorCeilFunctionsEnd2EndIT
Running org.apache.phoenix.iterate.PhoenixQueryTimeoutIT
Tests run: 2, Failures: 0, Errors: 0, Skipped: 0, Time elapsed: 3.23 sec - in org.apache.phoenix.iterate.PhoenixQueryTimeoutIT
Tests run: 9, Failures: 0, Errors: 0, Skipped: 0, Time elapsed: 50.316 sec - in org.apache.phoenix.iterate.RoundRobinResultIteratorIT
Tests run: 15, Failures: 0, Errors: 0, Skipped: 0, Time elapsed: 160.512 sec - in org.apache.phoenix.end2end.AlterTableWithViewsIT
Tests run: 108, Failures: 0, Errors: 0, Skipped: 0, Time elapsed: 301.427 sec - in org.apache.phoenix.end2end.HashJoinIT
Tests run: 108, Failures: 0, Errors: 0, Skipped: 0, Time elapsed: 290.566 sec - in org.apache.phoenix.end2end.SortMergeJoinIT

Results :




Tests run: 1170, Failures: 0, Errors: 0, Skipped: 0

[INFO] 
[INFO] --- maven-failsafe-plugin:2.18:integration-test (NeedTheirOwnClusterTests) @ phoenix-core
---
[INFO] Failsafe report directory: <https://builds.apache.org/job/Phoenix-4.x-HBase-1.0/ws/phoenix-core/target/failsafe-reports>
[INFO] parallel='none', perCoreThreadCount=true, threadCount=0, useUnlimitedThreads=false,
threadCountSuites=0, threadCountClasses=0, threadCountMethods=0, parallelOptimized=true

-------------------------------------------------------
 T E S T S
-------------------------------------------------------
Running org.apache.phoenix.hbase.index.covered.example.EndToEndCoveredIndexingIT
Running org.apache.phoenix.hbase.index.balancer.IndexLoadBalancerIT
Running org.apache.phoenix.rpc.PhoenixClientRpcIT
Running org.apache.phoenix.rpc.PhoenixServerRpcIT
Running org.apache.phoenix.monitoring.PhoenixMetricsIT
Tests run: 2, Failures: 0, Errors: 0, Skipped: 0, Time elapsed: 7.362 sec - in org.apache.phoenix.rpc.PhoenixClientRpcIT
Running org.apache.phoenix.hbase.index.covered.example.FailWithoutRetriesIT
Tests run: 2, Failures: 0, Errors: 0, Skipped: 0, Time elapsed: 17.564 sec - in org.apache.phoenix.rpc.PhoenixServerRpcIT
Tests run: 1, Failures: 0, Errors: 0, Skipped: 0, Time elapsed: 9.135 sec - in org.apache.phoenix.hbase.index.covered.example.FailWithoutRetriesIT
Running org.apache.phoenix.hbase.index.covered.example.EndtoEndIndexingWithCompressionIT
Running org.apache.phoenix.hbase.index.covered.EndToEndCoveredColumnsIndexBuilderIT
Tests run: 2, Failures: 0, Errors: 0, Skipped: 0, Time elapsed: 9.22 sec - in org.apache.phoenix.hbase.index.covered.EndToEndCoveredColumnsIndexBuilderIT
Running org.apache.phoenix.hbase.index.FailForUnsupportedHBaseVersionsIT
Tests run: 11, Failures: 0, Errors: 0, Skipped: 0, Time elapsed: 58.763 sec - in org.apache.phoenix.hbase.index.covered.example.EndToEndCoveredIndexingIT
Tests run: 17, Failures: 0, Errors: 0, Skipped: 0, Time elapsed: 46.816 sec - in org.apache.phoenix.monitoring.PhoenixMetricsIT
Running org.apache.phoenix.end2end.ConnectionUtilIT
Tests run: 2, Failures: 0, Errors: 0, Skipped: 0, Time elapsed: 16.231 sec - in org.apache.phoenix.hbase.index.FailForUnsupportedHBaseVersionsIT
Running org.apache.phoenix.end2end.SpillableGroupByIT
Running org.apache.phoenix.end2end.KeyOnlyIT
Tests run: 1, Failures: 0, Errors: 0, Skipped: 0, Time elapsed: 19.047 sec - in org.apache.phoenix.end2end.ConnectionUtilIT
Tests run: 1, Failures: 0, Errors: 0, Skipped: 0, Time elapsed: 10.838 sec - in org.apache.phoenix.end2end.SpillableGroupByIT
Tests run: 3, Failures: 0, Errors: 0, Skipped: 0, Time elapsed: 11.066 sec - in org.apache.phoenix.end2end.KeyOnlyIT
Tests run: 11, Failures: 0, Errors: 0, Skipped: 0, Time elapsed: 59.267 sec - in org.apache.phoenix.hbase.index.covered.example.EndtoEndIndexingWithCompressionIT
Running org.apache.phoenix.end2end.index.MutableIndexFailureIT
Running org.apache.phoenix.end2end.TenantSpecificTablesDDLIT
Tests run: 9, Failures: 0, Errors: 0, Skipped: 0, Time elapsed: 102.182 sec - in org.apache.phoenix.hbase.index.balancer.IndexLoadBalancerIT
Running org.apache.phoenix.end2end.ParallelIteratorsIT
Running org.apache.phoenix.end2end.index.MutableIndexReplicationIT
Running org.apache.phoenix.end2end.index.ImmutableIndexWithStatsIT
Tests run: 2, Failures: 0, Errors: 0, Skipped: 0, Time elapsed: 17.708 sec - in org.apache.phoenix.end2end.ParallelIteratorsIT
Tests run: 17, Failures: 0, Errors: 0, Skipped: 0, Time elapsed: 31.853 sec - in org.apache.phoenix.end2end.TenantSpecificTablesDDLIT
Tests run: 1, Failures: 0, Errors: 0, Skipped: 0, Time elapsed: 9.005 sec - in org.apache.phoenix.end2end.index.ImmutableIndexWithStatsIT
Tests run: 1, Failures: 0, Errors: 0, Skipped: 0, Time elapsed: 17.609 sec - in org.apache.phoenix.end2end.index.MutableIndexReplicationIT
Running org.apache.phoenix.end2end.ContextClassloaderIT
Running org.apache.phoenix.end2end.QueryWithLimitIT
Running org.apache.phoenix.end2end.AlterTableIT
Running org.apache.phoenix.end2end.ViewIT
Tests run: 3, Failures: 0, Errors: 0, Skipped: 0, Time elapsed: 7.019 sec - in org.apache.phoenix.end2end.ContextClassloaderIT
Tests run: 2, Failures: 0, Errors: 0, Skipped: 0, Time elapsed: 12.885 sec - in org.apache.phoenix.end2end.QueryWithLimitIT
Running org.apache.phoenix.end2end.StatsCollectorIT
Running org.apache.phoenix.end2end.StatsCollectorWithSplitsAndMultiCFIT
Tests run: 22, Failures: 0, Errors: 0, Skipped: 0, Time elapsed: 47.507 sec - in org.apache.phoenix.end2end.ViewIT
Tests run: 2, Failures: 0, Errors: 0, Skipped: 0, Time elapsed: 32.459 sec - in org.apache.phoenix.end2end.StatsCollectorWithSplitsAndMultiCFIT
Running org.apache.phoenix.end2end.CountDistinctCompressionIT
Running org.apache.phoenix.end2end.UserDefinedFunctionsIT
Tests run: 1, Failures: 0, Errors: 0, Skipped: 0, Time elapsed: 7.563 sec - in org.apache.phoenix.end2end.CountDistinctCompressionIT
Tests run: 4, Failures: 0, Errors: 0, Skipped: 0, Time elapsed: 58.136 sec - in org.apache.phoenix.end2end.StatsCollectorIT
Tests run: 13, Failures: 0, Errors: 0, Skipped: 0, Time elapsed: 14.771 sec - in org.apache.phoenix.end2end.UserDefinedFunctionsIT
Tests run: 3, Failures: 0, Errors: 0, Skipped: 0, Time elapsed: 141.182 sec - in org.apache.phoenix.end2end.index.MutableIndexFailureIT
Running org.apache.phoenix.end2end.TenantSpecificTablesDMLIT
Running org.apache.phoenix.end2end.QueryTimeoutIT
Running org.apache.phoenix.end2end.SaltedViewIT
Running org.apache.phoenix.end2end.UnionAllIT
Tests run: 1, Failures: 0, Errors: 0, Skipped: 0, Time elapsed: 13.128 sec - in org.apache.phoenix.end2end.QueryTimeoutIT
Tests run: 2, Failures: 0, Errors: 0, Skipped: 0, Time elapsed: 16.855 sec - in org.apache.phoenix.end2end.SaltedViewIT
Tests run: 16, Failures: 0, Errors: 0, Skipped: 0, Time elapsed: 29.063 sec - in org.apache.phoenix.end2end.TenantSpecificTablesDMLIT
Running org.apache.phoenix.end2end.MultiCfQueryExecIT
Tests run: 11, Failures: 0, Errors: 0, Skipped: 0, Time elapsed: 22.085 sec - in org.apache.phoenix.end2end.UnionAllIT
Running org.apache.phoenix.execute.PartialCommitIT
Running org.apache.phoenix.iterate.RoundRobinResultIteratorWithStatsIT
Tests run: 6, Failures: 0, Errors: 0, Skipped: 0, Time elapsed: 6.757 sec - in org.apache.phoenix.execute.PartialCommitIT
Tests run: 7, Failures: 0, Errors: 0, Skipped: 0, Time elapsed: 20.519 sec - in org.apache.phoenix.end2end.MultiCfQueryExecIT
Running org.apache.hadoop.hbase.regionserver.wal.WALReplayWithIndexWritesAndCompressedWALIT
Tests run: 1, Failures: 0, Errors: 0, Skipped: 0, Time elapsed: 9.069 sec - in org.apache.phoenix.iterate.RoundRobinResultIteratorWithStatsIT
Running org.apache.hadoop.hbase.regionserver.wal.WALReplayWithIndexWritesAndUncompressedWALInHBase_094_9_IT
Tests run: 1, Failures: 0, Errors: 0, Skipped: 0, Time elapsed: 12.662 sec - in org.apache.hadoop.hbase.regionserver.wal.WALReplayWithIndexWritesAndCompressedWALIT
Tests run: 1, Failures: 0, Errors: 0, Skipped: 0, Time elapsed: 12.609 sec - in org.apache.hadoop.hbase.regionserver.wal.WALReplayWithIndexWritesAndUncompressedWALInHBase_094_9_IT
Running org.apache.phoenix.mapreduce.IndexToolIT
Tests run: 9, Failures: 0, Errors: 9, Skipped: 0, Time elapsed: 2.636 sec <<< FAILURE!
- in org.apache.phoenix.mapreduce.IndexToolIT
testMutableGlobalIndex(org.apache.phoenix.mapreduce.IndexToolIT)  Time elapsed: 0.009 sec
 <<< ERROR!
java.sql.SQLException: No suitable driver found for jdbc:phoenix:localhost:59383
	at java.sql.DriverManager.getConnection(DriverManager.java:596)
	at java.sql.DriverManager.getConnection(DriverManager.java:187)
	at org.apache.phoenix.mapreduce.IndexToolIT.testSecondaryIndex(IndexToolIT.java:122)
	at org.apache.phoenix.mapreduce.IndexToolIT.testSecondaryIndex(IndexToolIT.java:114)
	at org.apache.phoenix.mapreduce.IndexToolIT.testMutableGlobalIndex(IndexToolIT.java:85)

testMutableGlobalIndexDirectApi(org.apache.phoenix.mapreduce.IndexToolIT)  Time elapsed: 0
sec  <<< ERROR!
java.sql.SQLException: No suitable driver found for jdbc:phoenix:localhost:59383
	at java.sql.DriverManager.getConnection(DriverManager.java:596)
	at java.sql.DriverManager.getConnection(DriverManager.java:187)
	at org.apache.phoenix.mapreduce.IndexToolIT.testSecondaryIndex(IndexToolIT.java:122)
	at org.apache.phoenix.mapreduce.IndexToolIT.testMutableGlobalIndexDirectApi(IndexToolIT.java:105)

testImmutableLocalIndexDirectApi(org.apache.phoenix.mapreduce.IndexToolIT)  Time elapsed:
0 sec  <<< ERROR!
java.sql.SQLException: No suitable driver found for jdbc:phoenix:localhost:59383
	at java.sql.DriverManager.getConnection(DriverManager.java:596)
	at java.sql.DriverManager.getConnection(DriverManager.java:187)
	at org.apache.phoenix.mapreduce.IndexToolIT.testSecondaryIndex(IndexToolIT.java:122)
	at org.apache.phoenix.mapreduce.IndexToolIT.testImmutableLocalIndexDirectApi(IndexToolIT.java:100)

testMutableLocalIndex(org.apache.phoenix.mapreduce.IndexToolIT)  Time elapsed: 0 sec  <<<
ERROR!
java.sql.SQLException: No suitable driver found for jdbc:phoenix:localhost:59383
	at java.sql.DriverManager.getConnection(DriverManager.java:596)
	at java.sql.DriverManager.getConnection(DriverManager.java:187)
	at org.apache.phoenix.mapreduce.IndexToolIT.testSecondaryIndex(IndexToolIT.java:122)
	at org.apache.phoenix.mapreduce.IndexToolIT.testSecondaryIndex(IndexToolIT.java:114)
	at org.apache.phoenix.mapreduce.IndexToolIT.testMutableLocalIndex(IndexToolIT.java:90)

testImmutableGlobalIndex(org.apache.phoenix.mapreduce.IndexToolIT)  Time elapsed: 0 sec  <<<
ERROR!
java.sql.SQLException: No suitable driver found for jdbc:phoenix:localhost:59383
	at java.sql.DriverManager.getConnection(DriverManager.java:596)
	at java.sql.DriverManager.getConnection(DriverManager.java:187)
	at org.apache.phoenix.mapreduce.IndexToolIT.testSecondaryIndex(IndexToolIT.java:122)
	at org.apache.phoenix.mapreduce.IndexToolIT.testSecondaryIndex(IndexToolIT.java:114)
	at org.apache.phoenix.mapreduce.IndexToolIT.testImmutableGlobalIndex(IndexToolIT.java:75)

testImmutableGlobalIndexDirectApi(org.apache.phoenix.mapreduce.IndexToolIT)  Time elapsed:
0 sec  <<< ERROR!
java.sql.SQLException: No suitable driver found for jdbc:phoenix:localhost:59383
	at java.sql.DriverManager.getConnection(DriverManager.java:596)
	at java.sql.DriverManager.getConnection(DriverManager.java:187)
	at org.apache.phoenix.mapreduce.IndexToolIT.testSecondaryIndex(IndexToolIT.java:122)
	at org.apache.phoenix.mapreduce.IndexToolIT.testImmutableGlobalIndexDirectApi(IndexToolIT.java:95)

testImmutableLocalIndex(org.apache.phoenix.mapreduce.IndexToolIT)  Time elapsed: 0.001 sec
 <<< ERROR!
java.sql.SQLException: No suitable driver found for jdbc:phoenix:localhost:59383
	at java.sql.DriverManager.getConnection(DriverManager.java:596)
	at java.sql.DriverManager.getConnection(DriverManager.java:187)
	at org.apache.phoenix.mapreduce.IndexToolIT.testSecondaryIndex(IndexToolIT.java:122)
	at org.apache.phoenix.mapreduce.IndexToolIT.testSecondaryIndex(IndexToolIT.java:114)
	at org.apache.phoenix.mapreduce.IndexToolIT.testImmutableLocalIndex(IndexToolIT.java:80)

testMutableLocalIndexDirectApi(org.apache.phoenix.mapreduce.IndexToolIT)  Time elapsed: 0
sec  <<< ERROR!
java.sql.SQLException: No suitable driver found for jdbc:phoenix:localhost:59383
	at java.sql.DriverManager.getConnection(DriverManager.java:596)
	at java.sql.DriverManager.getConnection(DriverManager.java:187)
	at org.apache.phoenix.mapreduce.IndexToolIT.testSecondaryIndex(IndexToolIT.java:122)
	at org.apache.phoenix.mapreduce.IndexToolIT.testMutableLocalIndexDirectApi(IndexToolIT.java:110)

testMutalbleIndexWithUpdates(org.apache.phoenix.mapreduce.IndexToolIT)  Time elapsed: 0 sec
 <<< ERROR!
java.sql.SQLException: No suitable driver found for jdbc:phoenix:localhost:59383
	at java.sql.DriverManager.getConnection(DriverManager.java:596)
	at java.sql.DriverManager.getConnection(DriverManager.java:187)
	at org.apache.phoenix.mapreduce.IndexToolIT.testMutalbleIndexWithUpdates(IndexToolIT.java:209)

Running org.apache.phoenix.mapreduce.CsvBulkLoadToolIT
Tests run: 53, Failures: 0, Errors: 0, Skipped: 0, Time elapsed: 307.84 sec - in org.apache.phoenix.end2end.AlterTableIT
Tests run: 6, Failures: 0, Errors: 0, Skipped: 0, Time elapsed: 304.192 sec - in org.apache.phoenix.mapreduce.CsvBulkLoadToolIT

Results :


Tests in error: 
  IndexToolIT.testImmutableGlobalIndex:75->testSecondaryIndex:114->testSecondaryIndex:122
» SQL
  IndexToolIT.testImmutableGlobalIndexDirectApi:95->testSecondaryIndex:122 » SQL
  IndexToolIT.testImmutableLocalIndex:80->testSecondaryIndex:114->testSecondaryIndex:122
» SQL
  IndexToolIT.testImmutableLocalIndexDirectApi:100->testSecondaryIndex:122 » SQL
  IndexToolIT.testMutableGlobalIndex:85->testSecondaryIndex:114->testSecondaryIndex:122
» SQL
  IndexToolIT.testMutableGlobalIndexDirectApi:105->testSecondaryIndex:122 » SQL ...
  IndexToolIT.testMutableLocalIndex:90->testSecondaryIndex:114->testSecondaryIndex:122
» SQL
  IndexToolIT.testMutableLocalIndexDirectApi:110->testSecondaryIndex:122 » SQL N...
  IndexToolIT.testMutalbleIndexWithUpdates:209 » SQL No suitable driver found fo...


Tests run: 247, Failures: 0, Errors: 9, Skipped: 0

[INFO] 
[INFO] --- maven-failsafe-plugin:2.18:verify (ClientManagedTimeTests) @ phoenix-core ---
[INFO] Failsafe report directory: <https://builds.apache.org/job/Phoenix-4.x-HBase-1.0/ws/phoenix-core/target/failsafe-reports>
[INFO] ------------------------------------------------------------------------
[INFO] Reactor Summary:
[INFO] 
[INFO] Apache Phoenix .................................... SUCCESS [4.190s]
[INFO] Phoenix Core ...................................... FAILURE [30:15.979s]
[INFO] Phoenix - Flume ................................... SKIPPED
[INFO] Phoenix - Pig ..................................... SKIPPED
[INFO] Phoenix Query Server Client ....................... SKIPPED
[INFO] Phoenix Query Server .............................. SKIPPED
[INFO] Phoenix - Pherf ................................... SKIPPED
[INFO] Phoenix - Spark ................................... SKIPPED
[INFO] Phoenix Assembly .................................. SKIPPED
[INFO] Phoenix - Tracing Web Application ................. SKIPPED
[INFO] ------------------------------------------------------------------------
[INFO] BUILD FAILURE
[INFO] ------------------------------------------------------------------------
[INFO] Total time: 30:20.764s
[INFO] Finished at: Thu Oct 08 17:41:19 UTC 2015
[INFO] Final Memory: 61M/1123M
[INFO] ------------------------------------------------------------------------
[ERROR] Failed to execute goal org.apache.maven.plugins:maven-failsafe-plugin:2.18:verify
(ClientManagedTimeTests) on project phoenix-core: There are test failures.
[ERROR] 
[ERROR] Please refer to <https://builds.apache.org/job/Phoenix-4.x-HBase-1.0/ws/phoenix-core/target/failsafe-reports>
for the individual test results.
[ERROR] -> [Help 1]
[ERROR] 
[ERROR] To see the full stack trace of the errors, re-run Maven with the -e switch.
[ERROR] Re-run Maven using the -X switch to enable full debug logging.
[ERROR] 
[ERROR] For more information about the errors and possible solutions, please read the following
articles:
[ERROR] [Help 1] http://cwiki.apache.org/confluence/display/MAVEN/MojoFailureException
[ERROR] 
[ERROR] After correcting the problems, you can resume the build with the command
[ERROR]   mvn <goals> -rf :phoenix-core
Build step 'Invoke top-level Maven targets' marked build as failure
Archiving artifacts
Compressed 1.00 GB of artifacts by 48.5% relative to #181
Recording test results

Mime
View raw message