phoenix-commits mailing list archives

Site index · List index
Message view « Date » · « Thread »
Top « Date » · « Thread »
From Apache Jenkins Server <jenk...@builds.apache.org>
Subject Build failed in Jenkins: Phoenix | Master #918
Date Thu, 15 Oct 2015 20:49:36 GMT
See <https://builds.apache.org/job/Phoenix-master/918/changes>

Changes:

[jtaylor] PHOENIX-2319 SELECT failed on secondary index when table's columns are

------------------------------------------
[...truncated 7317 lines...]
Running org.apache.phoenix.end2end.HashJoinLocalIndexIT
Tests run: 36, Failures: 0, Errors: 0, Skipped: 0, Time elapsed: 58.233 sec - in org.apache.phoenix.end2end.ArrayToStringFunctionIT
Running org.apache.phoenix.end2end.InstrFunctionIT
Tests run: 8, Failures: 0, Errors: 0, Skipped: 0, Time elapsed: 12.356 sec - in org.apache.phoenix.end2end.InstrFunctionIT
Tests run: 6, Failures: 0, Errors: 0, Skipped: 0, Time elapsed: 163.671 sec - in org.apache.phoenix.end2end.UpgradeIT
Running org.apache.phoenix.end2end.StringToArrayFunctionIT
Running org.apache.phoenix.end2end.SkipScanAfterManualSplitIT
Tests run: 1, Failures: 0, Errors: 0, Skipped: 0, Time elapsed: 85.036 sec - in org.apache.phoenix.end2end.HashJoinLocalIndexIT
Running org.apache.phoenix.end2end.QueryMoreIT
Tests run: 22, Failures: 0, Errors: 0, Skipped: 0, Time elapsed: 50.2 sec - in org.apache.phoenix.end2end.StringToArrayFunctionIT
Running org.apache.phoenix.end2end.MinMaxAggregateFunctionIT
Tests run: 1, Failures: 0, Errors: 0, Skipped: 0, Time elapsed: 15.528 sec - in org.apache.phoenix.end2end.MinMaxAggregateFunctionIT
Running org.apache.phoenix.end2end.LnLogFunctionEnd2EndIT
Tests run: 3, Failures: 0, Errors: 0, Skipped: 0, Time elapsed: 78.158 sec - in org.apache.phoenix.end2end.SkipScanAfterManualSplitIT
Running org.apache.phoenix.end2end.PhoenixRuntimeIT
Tests run: 1, Failures: 0, Errors: 0, Skipped: 0, Time elapsed: 22.836 sec - in org.apache.phoenix.end2end.LnLogFunctionEnd2EndIT
Running org.apache.phoenix.end2end.ArraysWithNullsIT
Tests run: 5, Failures: 0, Errors: 0, Skipped: 0, Time elapsed: 64.797 sec - in org.apache.phoenix.end2end.QueryMoreIT
Running org.apache.phoenix.end2end.DateTimeIT
Tests run: 2, Failures: 0, Errors: 0, Skipped: 0, Time elapsed: 64.858 sec - in org.apache.phoenix.end2end.PhoenixRuntimeIT
Running org.apache.phoenix.rpc.UpdateCacheIT
Tests run: 19, Failures: 0, Errors: 0, Skipped: 0, Time elapsed: 32.125 sec - in org.apache.phoenix.end2end.DateTimeIT
Running org.apache.phoenix.iterate.RoundRobinResultIteratorIT
Tests run: 1, Failures: 0, Errors: 0, Skipped: 0, Time elapsed: 12.116 sec - in org.apache.phoenix.rpc.UpdateCacheIT
Running org.apache.phoenix.iterate.PhoenixQueryTimeoutIT
Tests run: 2, Failures: 0, Errors: 0, Skipped: 0, Time elapsed: 10.634 sec - in org.apache.phoenix.iterate.PhoenixQueryTimeoutIT
Running org.apache.phoenix.trace.PhoenixTracingEndToEndIT
Tests run: 16, Failures: 0, Errors: 0, Skipped: 0, Time elapsed: 167.578 sec - in org.apache.phoenix.end2end.ArraysWithNullsIT
Running org.apache.phoenix.trace.PhoenixTableMetricsWriterIT
Tests run: 2, Failures: 0, Errors: 0, Skipped: 0, Time elapsed: 3.057 sec - in org.apache.phoenix.trace.PhoenixTableMetricsWriterIT
Running org.apache.phoenix.trace.PhoenixTraceReaderIT
Tests run: 2, Failures: 0, Errors: 0, Skipped: 0, Time elapsed: 1.174 sec - in org.apache.phoenix.trace.PhoenixTraceReaderIT
Tests run: 6, Failures: 0, Errors: 0, Skipped: 0, Time elapsed: 100.25 sec - in org.apache.phoenix.trace.PhoenixTracingEndToEndIT
Tests run: 15, Failures: 0, Errors: 0, Skipped: 0, Time elapsed: 318.794 sec - in org.apache.phoenix.end2end.TenantIdTypeIT
Tests run: 9, Failures: 0, Errors: 0, Skipped: 0, Time elapsed: 158.647 sec - in org.apache.phoenix.iterate.RoundRobinResultIteratorIT
Tests run: 108, Failures: 0, Errors: 0, Skipped: 0, Time elapsed: 700.924 sec - in org.apache.phoenix.end2end.SpooledSortMergeJoinIT

Results :




Tests run: 1174, Failures: 0, Errors: 0, Skipped: 0

[INFO] 
[INFO] --- maven-failsafe-plugin:2.18:integration-test (NeedTheirOwnClusterTests) @ phoenix-core
---
[INFO] Failsafe report directory: /x1/jenkins/jenkins-slave/workspace/Phoenix-master/phoenix-core/target/failsafe-reports
[INFO] parallel='none', perCoreThreadCount=true, threadCount=0, useUnlimitedThreads=false,
threadCountSuites=0, threadCountClasses=0, threadCountMethods=0, parallelOptimized=true

-------------------------------------------------------
 T E S T S
-------------------------------------------------------
Running org.apache.hadoop.hbase.regionserver.wal.WALReplayWithIndexWritesAndCompressedWALIT
Running org.apache.hadoop.hbase.regionserver.wal.WALReplayWithIndexWritesAndUncompressedWALInHBase_094_9_IT
Running org.apache.phoenix.monitoring.PhoenixMetricsIT
Tests run: 1, Failures: 0, Errors: 0, Skipped: 0, Time elapsed: 40.617 sec - in org.apache.hadoop.hbase.regionserver.wal.WALReplayWithIndexWritesAndCompressedWALIT
Running org.apache.phoenix.end2end.TenantSpecificTablesDDLIT
Tests run: 1, Failures: 0, Errors: 0, Skipped: 0, Time elapsed: 44.32 sec - in org.apache.hadoop.hbase.regionserver.wal.WALReplayWithIndexWritesAndUncompressedWALInHBase_094_9_IT
Running org.apache.phoenix.execute.PartialCommitIT
Tests run: 6, Failures: 0, Errors: 0, Skipped: 0, Time elapsed: 3.158 sec - in org.apache.phoenix.execute.PartialCommitIT
Running org.apache.phoenix.end2end.CountDistinctCompressionIT
Tests run: 1, Failures: 0, Errors: 0, Skipped: 0, Time elapsed: 10.991 sec - in org.apache.phoenix.end2end.CountDistinctCompressionIT
Running org.apache.phoenix.end2end.index.MutableIndexFailureIT
Running org.apache.phoenix.end2end.ContextClassloaderIT
Tests run: 3, Failures: 0, Errors: 0, Skipped: 0, Time elapsed: 13.282 sec - in org.apache.phoenix.end2end.ContextClassloaderIT
Running org.apache.phoenix.end2end.index.ImmutableIndexWithStatsIT
Tests run: 17, Failures: 0, Errors: 0, Skipped: 0, Time elapsed: 81.135 sec - in org.apache.phoenix.end2end.TenantSpecificTablesDDLIT
Tests run: 1, Failures: 0, Errors: 0, Skipped: 0, Time elapsed: 21.703 sec - in org.apache.phoenix.end2end.index.ImmutableIndexWithStatsIT
Tests run: 17, Failures: 0, Errors: 0, Skipped: 0, Time elapsed: 115.713 sec - in org.apache.phoenix.monitoring.PhoenixMetricsIT
Running org.apache.phoenix.end2end.index.MutableIndexReplicationIT
Running org.apache.phoenix.end2end.TenantSpecificTablesDMLIT
Running org.apache.phoenix.end2end.StatsCollectorIT
Tests run: 1, Failures: 0, Errors: 0, Skipped: 0, Time elapsed: 42.446 sec - in org.apache.phoenix.end2end.index.MutableIndexReplicationIT
Running org.apache.phoenix.end2end.SaltedViewIT
Tests run: 16, Failures: 0, Errors: 0, Skipped: 0, Time elapsed: 84.47 sec - in org.apache.phoenix.end2end.TenantSpecificTablesDMLIT
Tests run: 4, Failures: 0, Errors: 0, Skipped: 0, Time elapsed: 76.057 sec - in org.apache.phoenix.end2end.StatsCollectorIT
Tests run: 2, Failures: 0, Errors: 0, Skipped: 0, Time elapsed: 33.682 sec - in org.apache.phoenix.end2end.SaltedViewIT
Running org.apache.phoenix.end2end.KeyOnlyIT
Tests run: 3, Failures: 0, Errors: 0, Skipped: 0, Time elapsed: 222.762 sec - in org.apache.phoenix.end2end.index.MutableIndexFailureIT
Running org.apache.phoenix.end2end.ParallelIteratorsIT
Running org.apache.phoenix.end2end.StatsCollectorWithSplitsAndMultiCFIT
Tests run: 3, Failures: 0, Errors: 0, Skipped: 0, Time elapsed: 23.143 sec - in org.apache.phoenix.end2end.KeyOnlyIT
Running org.apache.phoenix.end2end.QueryWithLimitIT
Running org.apache.phoenix.end2end.ConnectionUtilIT
Tests run: 2, Failures: 0, Errors: 0, Skipped: 0, Time elapsed: 40.847 sec - in org.apache.phoenix.end2end.ParallelIteratorsIT
Tests run: 2, Failures: 0, Errors: 0, Skipped: 0, Time elapsed: 42.966 sec - in org.apache.phoenix.end2end.StatsCollectorWithSplitsAndMultiCFIT
Tests run: 2, Failures: 0, Errors: 0, Skipped: 0, Time elapsed: 22.862 sec - in org.apache.phoenix.end2end.QueryWithLimitIT
Tests run: 1, Failures: 0, Errors: 0, Skipped: 0, Time elapsed: 29.587 sec - in org.apache.phoenix.end2end.ConnectionUtilIT
Running org.apache.phoenix.end2end.MultiCfQueryExecIT
Running org.apache.phoenix.end2end.ViewIT
Running org.apache.phoenix.end2end.QueryTimeoutIT
Running org.apache.phoenix.end2end.UserDefinedFunctionsIT
Tests run: 7, Failures: 0, Errors: 0, Skipped: 0, Time elapsed: 22.723 sec - in org.apache.phoenix.end2end.MultiCfQueryExecIT
Tests run: 1, Failures: 0, Errors: 0, Skipped: 0, Time elapsed: 21.582 sec - in org.apache.phoenix.end2end.QueryTimeoutIT
Running org.apache.phoenix.end2end.UnionAllIT
Running org.apache.phoenix.end2end.SpillableGroupByIT
Tests run: 1, Failures: 0, Errors: 0, Skipped: 0, Time elapsed: 8.544 sec - in org.apache.phoenix.end2end.SpillableGroupByIT
Tests run: 13, Failures: 0, Errors: 0, Skipped: 0, Time elapsed: 60.816 sec - in org.apache.phoenix.end2end.UserDefinedFunctionsIT
Tests run: 12, Failures: 0, Errors: 0, Skipped: 0, Time elapsed: 51.128 sec - in org.apache.phoenix.end2end.UnionAllIT
Tests run: 22, Failures: 0, Errors: 0, Skipped: 0, Time elapsed: 97.608 sec - in org.apache.phoenix.end2end.ViewIT
Running org.apache.phoenix.mapreduce.IndexToolIT
Running org.apache.phoenix.mapreduce.CsvBulkLoadToolIT
Tests run: 9, Failures: 0, Errors: 9, Skipped: 0, Time elapsed: 10.845 sec <<< FAILURE!
- in org.apache.phoenix.mapreduce.IndexToolIT
testMutableGlobalIndex(org.apache.phoenix.mapreduce.IndexToolIT)  Time elapsed: 0.034 sec
 <<< ERROR!
java.sql.SQLException: No suitable driver found for jdbc:phoenix:localhost:54739
	at java.sql.DriverManager.getConnection(DriverManager.java:596)
	at java.sql.DriverManager.getConnection(DriverManager.java:187)
	at org.apache.phoenix.mapreduce.IndexToolIT.testSecondaryIndex(IndexToolIT.java:122)
	at org.apache.phoenix.mapreduce.IndexToolIT.testSecondaryIndex(IndexToolIT.java:114)
	at org.apache.phoenix.mapreduce.IndexToolIT.testMutableGlobalIndex(IndexToolIT.java:85)

testMutableGlobalIndexDirectApi(org.apache.phoenix.mapreduce.IndexToolIT)  Time elapsed: 0
sec  <<< ERROR!
java.sql.SQLException: No suitable driver found for jdbc:phoenix:localhost:54739
	at java.sql.DriverManager.getConnection(DriverManager.java:596)
	at java.sql.DriverManager.getConnection(DriverManager.java:187)
	at org.apache.phoenix.mapreduce.IndexToolIT.testSecondaryIndex(IndexToolIT.java:122)
	at org.apache.phoenix.mapreduce.IndexToolIT.testMutableGlobalIndexDirectApi(IndexToolIT.java:105)

testImmutableLocalIndexDirectApi(org.apache.phoenix.mapreduce.IndexToolIT)  Time elapsed:
0 sec  <<< ERROR!
java.sql.SQLException: No suitable driver found for jdbc:phoenix:localhost:54739
	at java.sql.DriverManager.getConnection(DriverManager.java:596)
	at java.sql.DriverManager.getConnection(DriverManager.java:187)
	at org.apache.phoenix.mapreduce.IndexToolIT.testSecondaryIndex(IndexToolIT.java:122)
	at org.apache.phoenix.mapreduce.IndexToolIT.testImmutableLocalIndexDirectApi(IndexToolIT.java:100)

testMutableLocalIndex(org.apache.phoenix.mapreduce.IndexToolIT)  Time elapsed: 0 sec  <<<
ERROR!
java.sql.SQLException: No suitable driver found for jdbc:phoenix:localhost:54739
	at java.sql.DriverManager.getConnection(DriverManager.java:596)
	at java.sql.DriverManager.getConnection(DriverManager.java:187)
	at org.apache.phoenix.mapreduce.IndexToolIT.testSecondaryIndex(IndexToolIT.java:122)
	at org.apache.phoenix.mapreduce.IndexToolIT.testSecondaryIndex(IndexToolIT.java:114)
	at org.apache.phoenix.mapreduce.IndexToolIT.testMutableLocalIndex(IndexToolIT.java:90)

testImmutableGlobalIndex(org.apache.phoenix.mapreduce.IndexToolIT)  Time elapsed: 0.001 sec
 <<< ERROR!
java.sql.SQLException: No suitable driver found for jdbc:phoenix:localhost:54739
	at java.sql.DriverManager.getConnection(DriverManager.java:596)
	at java.sql.DriverManager.getConnection(DriverManager.java:187)
	at org.apache.phoenix.mapreduce.IndexToolIT.testSecondaryIndex(IndexToolIT.java:122)
	at org.apache.phoenix.mapreduce.IndexToolIT.testSecondaryIndex(IndexToolIT.java:114)
	at org.apache.phoenix.mapreduce.IndexToolIT.testImmutableGlobalIndex(IndexToolIT.java:75)

testImmutableGlobalIndexDirectApi(org.apache.phoenix.mapreduce.IndexToolIT)  Time elapsed:
0 sec  <<< ERROR!
java.sql.SQLException: No suitable driver found for jdbc:phoenix:localhost:54739
	at java.sql.DriverManager.getConnection(DriverManager.java:596)
	at java.sql.DriverManager.getConnection(DriverManager.java:187)
	at org.apache.phoenix.mapreduce.IndexToolIT.testSecondaryIndex(IndexToolIT.java:122)
	at org.apache.phoenix.mapreduce.IndexToolIT.testImmutableGlobalIndexDirectApi(IndexToolIT.java:95)

testImmutableLocalIndex(org.apache.phoenix.mapreduce.IndexToolIT)  Time elapsed: 0 sec  <<<
ERROR!
java.sql.SQLException: No suitable driver found for jdbc:phoenix:localhost:54739
	at java.sql.DriverManager.getConnection(DriverManager.java:596)
	at java.sql.DriverManager.getConnection(DriverManager.java:187)
	at org.apache.phoenix.mapreduce.IndexToolIT.testSecondaryIndex(IndexToolIT.java:122)
	at org.apache.phoenix.mapreduce.IndexToolIT.testSecondaryIndex(IndexToolIT.java:114)
	at org.apache.phoenix.mapreduce.IndexToolIT.testImmutableLocalIndex(IndexToolIT.java:80)

testMutableLocalIndexDirectApi(org.apache.phoenix.mapreduce.IndexToolIT)  Time elapsed: 0.001
sec  <<< ERROR!
java.sql.SQLException: No suitable driver found for jdbc:phoenix:localhost:54739
	at java.sql.DriverManager.getConnection(DriverManager.java:596)
	at java.sql.DriverManager.getConnection(DriverManager.java:187)
	at org.apache.phoenix.mapreduce.IndexToolIT.testSecondaryIndex(IndexToolIT.java:122)
	at org.apache.phoenix.mapreduce.IndexToolIT.testMutableLocalIndexDirectApi(IndexToolIT.java:110)

testMutalbleIndexWithUpdates(org.apache.phoenix.mapreduce.IndexToolIT)  Time elapsed: 0 sec
 <<< ERROR!
java.sql.SQLException: No suitable driver found for jdbc:phoenix:localhost:54739
	at java.sql.DriverManager.getConnection(DriverManager.java:596)
	at java.sql.DriverManager.getConnection(DriverManager.java:187)
	at org.apache.phoenix.mapreduce.IndexToolIT.testMutalbleIndexWithUpdates(IndexToolIT.java:209)

Running org.apache.phoenix.rpc.PhoenixServerRpcIT
Running org.apache.phoenix.rpc.PhoenixClientRpcIT
Tests run: 2, Failures: 0, Errors: 0, Skipped: 0, Time elapsed: 20.288 sec - in org.apache.phoenix.rpc.PhoenixClientRpcIT
Tests run: 2, Failures: 0, Errors: 0, Skipped: 0, Time elapsed: 20.406 sec - in org.apache.phoenix.rpc.PhoenixServerRpcIT
Running org.apache.phoenix.iterate.RoundRobinResultIteratorWithStatsIT
Running org.apache.phoenix.hbase.index.balancer.IndexLoadBalancerIT
Running org.apache.phoenix.hbase.index.covered.EndToEndCoveredColumnsIndexBuilderIT
Tests run: 1, Failures: 0, Errors: 0, Skipped: 0, Time elapsed: 14.472 sec - in org.apache.phoenix.iterate.RoundRobinResultIteratorWithStatsIT
Running org.apache.phoenix.hbase.index.covered.example.EndToEndCoveredIndexingIT
Tests run: 2, Failures: 0, Errors: 0, Skipped: 0, Time elapsed: 28.201 sec - in org.apache.phoenix.hbase.index.covered.EndToEndCoveredColumnsIndexBuilderIT
Running org.apache.phoenix.hbase.index.covered.example.EndtoEndIndexingWithCompressionIT
Tests run: 11, Failures: 0, Errors: 0, Skipped: 0, Time elapsed: 238.078 sec - in org.apache.phoenix.hbase.index.covered.example.EndToEndCoveredIndexingIT
Running org.apache.phoenix.hbase.index.covered.example.FailWithoutRetriesIT
Tests run: 1, Failures: 0, Errors: 0, Skipped: 0, Time elapsed: 8.392 sec - in org.apache.phoenix.hbase.index.covered.example.FailWithoutRetriesIT
Running org.apache.phoenix.hbase.index.FailForUnsupportedHBaseVersionsIT
Tests run: 11, Failures: 0, Errors: 0, Skipped: 0, Time elapsed: 247.365 sec - in org.apache.phoenix.hbase.index.covered.example.EndtoEndIndexingWithCompressionIT
Tests run: 2, Failures: 0, Errors: 0, Skipped: 0, Time elapsed: 20.66 sec - in org.apache.phoenix.hbase.index.FailForUnsupportedHBaseVersionsIT
Tests run: 6, Failures: 0, Errors: 0, Skipped: 0, Time elapsed: 365.718 sec - in org.apache.phoenix.mapreduce.CsvBulkLoadToolIT
Tests run: 9, Failures: 0, Errors: 0, Skipped: 0, Time elapsed: 336.031 sec - in org.apache.phoenix.hbase.index.balancer.IndexLoadBalancerIT
Running org.apache.phoenix.end2end.AlterTableIT
Tests run: 53, Failures: 0, Errors: 0, Skipped: 0, Time elapsed: 476.325 sec - in org.apache.phoenix.end2end.AlterTableIT

Results :


Tests in error: 
  IndexToolIT.testImmutableGlobalIndex:75->testSecondaryIndex:114->testSecondaryIndex:122
? SQL
  IndexToolIT.testImmutableGlobalIndexDirectApi:95->testSecondaryIndex:122 ? SQL
  IndexToolIT.testImmutableLocalIndex:80->testSecondaryIndex:114->testSecondaryIndex:122
? SQL
  IndexToolIT.testImmutableLocalIndexDirectApi:100->testSecondaryIndex:122 ? SQL
  IndexToolIT.testMutableGlobalIndex:85->testSecondaryIndex:114->testSecondaryIndex:122
? SQL
  IndexToolIT.testMutableGlobalIndexDirectApi:105->testSecondaryIndex:122 ? SQL ...
  IndexToolIT.testMutableLocalIndex:90->testSecondaryIndex:114->testSecondaryIndex:122
? SQL
  IndexToolIT.testMutableLocalIndexDirectApi:110->testSecondaryIndex:122 ? SQL N...
  IndexToolIT.testMutalbleIndexWithUpdates:209 ? SQL No suitable driver found fo...


Tests run: 248, Failures: 0, Errors: 9, Skipped: 0

[INFO] 
[INFO] --- maven-failsafe-plugin:2.18:verify (ClientManagedTimeTests) @ phoenix-core ---
[INFO] Failsafe report directory: /x1/jenkins/jenkins-slave/workspace/Phoenix-master/phoenix-core/target/failsafe-reports
[INFO] ------------------------------------------------------------------------
[INFO] Reactor Summary:
[INFO] 
[INFO] Apache Phoenix .................................... SUCCESS [5.464s]
[INFO] Phoenix Core ...................................... FAILURE [1:19:30.875s]
[INFO] Phoenix - Flume ................................... SKIPPED
[INFO] Phoenix - Pig ..................................... SKIPPED
[INFO] Phoenix Query Server Client ....................... SKIPPED
[INFO] Phoenix Query Server .............................. SKIPPED
[INFO] Phoenix - Pherf ................................... SKIPPED
[INFO] Phoenix - Spark ................................... SKIPPED
[INFO] Phoenix Assembly .................................. SKIPPED
[INFO] Phoenix - Tracing Web Application ................. SKIPPED
[INFO] ------------------------------------------------------------------------
[INFO] BUILD FAILURE
[INFO] ------------------------------------------------------------------------
[INFO] Total time: 1:19:36.957s
[INFO] Finished at: Thu Oct 15 20:46:43 UTC 2015
[INFO] Final Memory: 49M/1251M
[INFO] ------------------------------------------------------------------------
[ERROR] Failed to execute goal org.apache.maven.plugins:maven-failsafe-plugin:2.18:verify
(ClientManagedTimeTests) on project phoenix-core: There are test failures.
[ERROR] 
[ERROR] Please refer to /x1/jenkins/jenkins-slave/workspace/Phoenix-master/phoenix-core/target/failsafe-reports
for the individual test results.
[ERROR] -> [Help 1]
[ERROR] 
[ERROR] To see the full stack trace of the errors, re-run Maven with the -e switch.
[ERROR] Re-run Maven using the -X switch to enable full debug logging.
[ERROR] 
[ERROR] For more information about the errors and possible solutions, please read the following
articles:
[ERROR] [Help 1] http://cwiki.apache.org/confluence/display/MAVEN/MojoFailureException
[ERROR] 
[ERROR] After correcting the problems, you can resume the build with the command
[ERROR]   mvn <goals> -rf :phoenix-core
Build step 'Invoke top-level Maven targets' marked build as failure
Archiving artifacts
Compressed 1.03 GB of artifacts by 48.9% relative to #915
Updating PHOENIX-2319
Recording test results

Mime
View raw message