phoenix-commits mailing list archives

Site index · List index
Message view « Date » · « Thread »
Top « Date » · « Thread »
From Apache Jenkins Server <jenk...@builds.apache.org>
Subject Build failed in Jenkins: Phoenix | Master #938
Date Mon, 26 Oct 2015 22:20:39 GMT
See <https://builds.apache.org/job/Phoenix-master/938/changes>

Changes:

[jtaylor] PHOENIX-2316 Add region server name as attribute on parallel Scan

------------------------------------------
[...truncated 7315 lines...]
Running org.apache.phoenix.end2end.FirstValueFunctionIT
Tests run: 7, Failures: 0, Errors: 0, Skipped: 0, Time elapsed: 7.048 sec - in org.apache.phoenix.end2end.FirstValueFunctionIT
Running org.apache.phoenix.end2end.DisableLocalIndexIT
Tests run: 62, Failures: 0, Errors: 0, Skipped: 0, Time elapsed: 303.925 sec - in org.apache.phoenix.end2end.index.IndexExpressionIT
Running org.apache.phoenix.end2end.HashJoinLocalIndexIT
Tests run: 1, Failures: 0, Errors: 0, Skipped: 0, Time elapsed: 12.701 sec - in org.apache.phoenix.end2end.DisableLocalIndexIT
Running org.apache.phoenix.end2end.UpsertBigValuesIT
Tests run: 4, Failures: 0, Errors: 0, Skipped: 0, Time elapsed: 27.086 sec - in org.apache.phoenix.end2end.UpsertBigValuesIT
Running org.apache.phoenix.end2end.MD5FunctionIT
Tests run: 16, Failures: 0, Errors: 0, Skipped: 0, Time elapsed: 227.81 sec - in org.apache.phoenix.end2end.index.LocalMutableIndexIT
Running org.apache.phoenix.end2end.LpadFunctionIT
Tests run: 1, Failures: 0, Errors: 0, Skipped: 0, Time elapsed: 46.738 sec - in org.apache.phoenix.end2end.HashJoinLocalIndexIT
Running org.apache.phoenix.end2end.SignFunctionEnd2EndIT
Tests run: 3, Failures: 0, Errors: 0, Skipped: 0, Time elapsed: 12.865 sec - in org.apache.phoenix.end2end.MD5FunctionIT
Running org.apache.phoenix.end2end.SortOrderIT
Tests run: 2, Failures: 0, Errors: 0, Skipped: 0, Time elapsed: 14.91 sec - in org.apache.phoenix.end2end.SignFunctionEnd2EndIT
Running org.apache.phoenix.end2end.ArrayToStringFunctionIT
Tests run: 6, Failures: 0, Errors: 0, Skipped: 0, Time elapsed: 101.512 sec - in org.apache.phoenix.end2end.UpgradeIT
Running org.apache.phoenix.end2end.QueryExecWithoutSCNIT
Tests run: 12, Failures: 0, Errors: 0, Skipped: 0, Time elapsed: 39.598 sec - in org.apache.phoenix.end2end.LpadFunctionIT
Running org.apache.phoenix.end2end.RegexpReplaceFunctionIT
Tests run: 1, Failures: 0, Errors: 0, Skipped: 0, Time elapsed: 6.335 sec - in org.apache.phoenix.end2end.QueryExecWithoutSCNIT
Running org.apache.phoenix.end2end.DynamicFamilyIT
Tests run: 2, Failures: 0, Errors: 0, Skipped: 0, Time elapsed: 7.745 sec - in org.apache.phoenix.end2end.RegexpReplaceFunctionIT
Running org.apache.phoenix.end2end.RoundFloorCeilFunctionsEnd2EndIT
Tests run: 36, Failures: 0, Errors: 0, Skipped: 0, Time elapsed: 29.68 sec - in org.apache.phoenix.end2end.ArrayToStringFunctionIT
Running org.apache.phoenix.end2end.DeleteIT
Tests run: 4, Failures: 0, Errors: 0, Skipped: 0, Time elapsed: 14.216 sec - in org.apache.phoenix.end2end.DynamicFamilyIT
Running org.apache.phoenix.end2end.InListIT
Tests run: 31, Failures: 0, Errors: 0, Skipped: 0, Time elapsed: 35.818 sec - in org.apache.phoenix.end2end.RoundFloorCeilFunctionsEnd2EndIT
Tests run: 15, Failures: 0, Errors: 0, Skipped: 0, Time elapsed: 207.216 sec - in org.apache.phoenix.end2end.TenantIdTypeIT
Running org.apache.phoenix.end2end.EvaluationOfORIT
Running org.apache.phoenix.end2end.ReverseScanIT
Tests run: 2, Failures: 0, Errors: 0, Skipped: 0, Time elapsed: 7.063 sec - in org.apache.phoenix.end2end.EvaluationOfORIT
Running org.apache.phoenix.end2end.RTrimFunctionIT
Tests run: 2, Failures: 0, Errors: 0, Skipped: 0, Time elapsed: 8.137 sec - in org.apache.phoenix.end2end.RTrimFunctionIT
Running org.apache.phoenix.end2end.NthValueFunctionIT
Tests run: 3, Failures: 0, Errors: 0, Skipped: 0, Time elapsed: 15.777 sec - in org.apache.phoenix.end2end.ReverseScanIT
Running org.apache.phoenix.end2end.ReadOnlyIT
Tests run: 45, Failures: 0, Errors: 0, Skipped: 0, Time elapsed: 102.165 sec - in org.apache.phoenix.end2end.SortOrderIT
Running org.apache.phoenix.end2end.ArrayPrependFunctionIT
Tests run: 1, Failures: 0, Errors: 0, Skipped: 0, Time elapsed: 13.651 sec - in org.apache.phoenix.end2end.ReadOnlyIT
Running org.apache.phoenix.end2end.ExecuteStatementsIT
Tests run: 22, Failures: 0, Errors: 0, Skipped: 0, Time elapsed: 66.611 sec - in org.apache.phoenix.end2end.DeleteIT
Running org.apache.phoenix.iterate.RoundRobinResultIteratorIT
Tests run: 11, Failures: 0, Errors: 0, Skipped: 0, Time elapsed: 22.519 sec - in org.apache.phoenix.end2end.NthValueFunctionIT
Running org.apache.phoenix.iterate.PhoenixQueryTimeoutIT
Tests run: 2, Failures: 0, Errors: 0, Skipped: 0, Time elapsed: 8.294 sec - in org.apache.phoenix.iterate.PhoenixQueryTimeoutIT
Tests run: 34, Failures: 0, Errors: 0, Skipped: 0, Time elapsed: 35.943 sec - in org.apache.phoenix.end2end.ArrayPrependFunctionIT
Tests run: 2, Failures: 0, Errors: 0, Skipped: 0, Time elapsed: 39.442 sec - in org.apache.phoenix.end2end.ExecuteStatementsIT
Tests run: 28, Failures: 0, Errors: 0, Skipped: 0, Time elapsed: 128.275 sec - in org.apache.phoenix.end2end.InListIT
Tests run: 9, Failures: 0, Errors: 0, Skipped: 0, Time elapsed: 101.293 sec - in org.apache.phoenix.iterate.RoundRobinResultIteratorIT

Results :




Tests run: 1176, Failures: 0, Errors: 0, Skipped: 0

[INFO] 
[INFO] --- maven-failsafe-plugin:2.18:integration-test (NeedTheirOwnClusterTests) @ phoenix-core
---
[INFO] Failsafe report directory: <https://builds.apache.org/job/Phoenix-master/ws/phoenix-core/target/failsafe-reports>
[INFO] parallel='none', perCoreThreadCount=true, threadCount=0, useUnlimitedThreads=false,
threadCountSuites=0, threadCountClasses=0, threadCountMethods=0, parallelOptimized=true

-------------------------------------------------------
 T E S T S
-------------------------------------------------------
Running org.apache.phoenix.rpc.PhoenixServerRpcIT
Running org.apache.phoenix.rpc.PhoenixClientRpcIT
Running org.apache.phoenix.mapreduce.IndexToolIT
Running org.apache.phoenix.execute.PartialCommitIT
Tests run: 2, Failures: 0, Errors: 0, Skipped: 0, Time elapsed: 12.358 sec - in org.apache.phoenix.rpc.PhoenixClientRpcIT
Tests run: 6, Failures: 0, Errors: 0, Skipped: 0, Time elapsed: 4.365 sec - in org.apache.phoenix.execute.PartialCommitIT
Running org.apache.phoenix.mapreduce.CsvBulkLoadToolIT
Tests run: 2, Failures: 0, Errors: 0, Skipped: 0, Time elapsed: 22.39 sec - in org.apache.phoenix.rpc.PhoenixServerRpcIT
Running org.apache.phoenix.end2end.ConnectionUtilIT
Running org.apache.phoenix.end2end.MultiCfQueryExecIT
Tests run: 7, Failures: 0, Errors: 0, Skipped: 0, Time elapsed: 24.008 sec - in org.apache.phoenix.end2end.MultiCfQueryExecIT
Tests run: 1, Failures: 0, Errors: 0, Skipped: 0, Time elapsed: 28.172 sec - in org.apache.phoenix.end2end.ConnectionUtilIT
Running org.apache.phoenix.end2end.StatsCollectorIT
Running org.apache.phoenix.end2end.AlterTableIT
Tests run: 4, Failures: 0, Errors: 0, Skipped: 0, Time elapsed: 64.045 sec - in org.apache.phoenix.end2end.StatsCollectorIT
Running org.apache.phoenix.end2end.SaltedViewIT
Tests run: 2, Failures: 0, Errors: 0, Skipped: 0, Time elapsed: 25.31 sec - in org.apache.phoenix.end2end.SaltedViewIT
Running org.apache.phoenix.end2end.index.ImmutableIndexWithStatsIT
Tests run: 5, Failures: 0, Errors: 0, Skipped: 0, Time elapsed: 193.445 sec - in org.apache.phoenix.mapreduce.CsvBulkLoadToolIT
Tests run: 1, Failures: 0, Errors: 0, Skipped: 0, Time elapsed: 12.978 sec - in org.apache.phoenix.end2end.index.ImmutableIndexWithStatsIT
Running org.apache.phoenix.end2end.index.MutableIndexFailureIT
Running org.apache.phoenix.end2end.index.MutableIndexReplicationIT
Tests run: 3, Failures: 0, Errors: 0, Skipped: 2, Time elapsed: 45.503 sec - in org.apache.phoenix.end2end.index.MutableIndexFailureIT
Tests run: 1, Failures: 0, Errors: 0, Skipped: 0, Time elapsed: 35.964 sec - in org.apache.phoenix.end2end.index.MutableIndexReplicationIT
Running org.apache.phoenix.end2end.SpillableGroupByIT
Running org.apache.phoenix.end2end.CountDistinctCompressionIT
Tests run: 1, Failures: 0, Errors: 0, Skipped: 0, Time elapsed: 14.608 sec - in org.apache.phoenix.end2end.SpillableGroupByIT
Tests run: 1, Failures: 0, Errors: 0, Skipped: 0, Time elapsed: 12.083 sec - in org.apache.phoenix.end2end.CountDistinctCompressionIT
Running org.apache.phoenix.end2end.KeyOnlyIT
Tests run: 3, Failures: 0, Errors: 0, Skipped: 0, Time elapsed: 15.377 sec - in org.apache.phoenix.end2end.KeyOnlyIT
Running org.apache.phoenix.end2end.TenantSpecificTablesDDLIT
Running org.apache.phoenix.end2end.TenantSpecificTablesDMLIT
Tests run: 17, Failures: 0, Errors: 0, Skipped: 0, Time elapsed: 62.527 sec - in org.apache.phoenix.end2end.TenantSpecificTablesDDLIT
Tests run: 16, Failures: 0, Errors: 0, Skipped: 0, Time elapsed: 54.589 sec - in org.apache.phoenix.end2end.TenantSpecificTablesDMLIT
Tests run: 9, Failures: 0, Errors: 0, Skipped: 0, Time elapsed: 410.25 sec - in org.apache.phoenix.mapreduce.IndexToolIT
Running org.apache.phoenix.end2end.ContextClassloaderIT
Running org.apache.phoenix.end2end.QueryTimeoutIT
Tests run: 3, Failures: 0, Errors: 0, Skipped: 0, Time elapsed: 11.518 sec - in org.apache.phoenix.end2end.ContextClassloaderIT
Running org.apache.phoenix.end2end.UserDefinedFunctionsIT
Tests run: 1, Failures: 0, Errors: 0, Skipped: 0, Time elapsed: 14.962 sec - in org.apache.phoenix.end2end.QueryTimeoutIT
Running org.apache.phoenix.end2end.QueryWithLimitIT
Running org.apache.phoenix.end2end.StatsCollectorWithSplitsAndMultiCFIT
Tests run: 2, Failures: 0, Errors: 0, Skipped: 0, Time elapsed: 24.215 sec - in org.apache.phoenix.end2end.QueryWithLimitIT
Tests run: 13, Failures: 0, Errors: 0, Skipped: 0, Time elapsed: 49.764 sec - in org.apache.phoenix.end2end.UserDefinedFunctionsIT
Tests run: 2, Failures: 0, Errors: 0, Skipped: 0, Time elapsed: 34.686 sec - in org.apache.phoenix.end2end.StatsCollectorWithSplitsAndMultiCFIT
Running org.apache.phoenix.end2end.UnionAllIT
Running org.apache.phoenix.end2end.ParallelIteratorsIT
Running org.apache.phoenix.iterate.RoundRobinResultIteratorWithStatsIT
Tests run: 1, Failures: 0, Errors: 0, Skipped: 0, Time elapsed: 14.936 sec - in org.apache.phoenix.iterate.RoundRobinResultIteratorWithStatsIT
Running org.apache.phoenix.hbase.index.covered.EndToEndCoveredColumnsIndexBuilderIT
Tests run: 53, Failures: 0, Errors: 3, Skipped: 0, Time elapsed: 464.003 sec <<<
FAILURE! - in org.apache.phoenix.end2end.AlterTableIT
testDropIndexedColumn(org.apache.phoenix.end2end.AlterTableIT)  Time elapsed: 8.86 sec  <<<
ERROR!
java.sql.SQLException: ERROR 2009 (INT11): Unknown error code 0
	at org.apache.phoenix.exception.SQLExceptionCode$Factory$1.newException(SQLExceptionCode.java:396)
	at org.apache.phoenix.exception.SQLExceptionInfo.buildException(SQLExceptionInfo.java:145)
	at org.apache.phoenix.exception.SQLExceptionCode.fromErrorCode(SQLExceptionCode.java:424)
	at org.apache.phoenix.util.ServerUtil.parseRemoteException(ServerUtil.java:127)
	at org.apache.phoenix.util.ServerUtil.parseServerExceptionOrNull(ServerUtil.java:115)
	at org.apache.phoenix.util.ServerUtil.parseServerException(ServerUtil.java:104)
	at org.apache.phoenix.query.ConnectionQueryServicesImpl.metaDataCoprocessorExec(ConnectionQueryServicesImpl.java:1053)
	at org.apache.phoenix.query.ConnectionQueryServicesImpl.metaDataCoprocessorExec(ConnectionQueryServicesImpl.java:1016)
	at org.apache.phoenix.query.ConnectionQueryServicesImpl.dropColumn(ConnectionQueryServicesImpl.java:1819)
	at org.apache.phoenix.schema.MetaDataClient.dropColumn(MetaDataClient.java:2880)
	at org.apache.phoenix.jdbc.PhoenixStatement$ExecutableDropColumnStatement$1.execute(PhoenixStatement.java:1147)
	at org.apache.phoenix.jdbc.PhoenixStatement$2.call(PhoenixStatement.java:322)
	at org.apache.phoenix.jdbc.PhoenixStatement$2.call(PhoenixStatement.java:314)
	at org.apache.phoenix.call.CallRunner.run(CallRunner.java:53)
	at org.apache.phoenix.jdbc.PhoenixStatement.executeMutation(PhoenixStatement.java:312)
	at org.apache.phoenix.jdbc.PhoenixStatement.execute(PhoenixStatement.java:1435)
	at org.apache.phoenix.end2end.AlterTableIT.testDropIndexedColumn(AlterTableIT.java:285)

testDropCoveredColumn(org.apache.phoenix.end2end.AlterTableIT)  Time elapsed: 8.988 sec  <<<
ERROR!
java.sql.SQLException: ERROR 2009 (INT11): Unknown error code 0
	at org.apache.phoenix.exception.SQLExceptionCode$Factory$1.newException(SQLExceptionCode.java:396)
	at org.apache.phoenix.exception.SQLExceptionInfo.buildException(SQLExceptionInfo.java:145)
	at org.apache.phoenix.exception.SQLExceptionCode.fromErrorCode(SQLExceptionCode.java:424)
	at org.apache.phoenix.util.ServerUtil.parseRemoteException(ServerUtil.java:127)
	at org.apache.phoenix.util.ServerUtil.parseServerExceptionOrNull(ServerUtil.java:115)
	at org.apache.phoenix.util.ServerUtil.parseServerException(ServerUtil.java:104)
	at org.apache.phoenix.query.ConnectionQueryServicesImpl.metaDataCoprocessorExec(ConnectionQueryServicesImpl.java:1053)
	at org.apache.phoenix.query.ConnectionQueryServicesImpl.metaDataCoprocessorExec(ConnectionQueryServicesImpl.java:1016)
	at org.apache.phoenix.query.ConnectionQueryServicesImpl.dropColumn(ConnectionQueryServicesImpl.java:1819)
	at org.apache.phoenix.schema.MetaDataClient.dropColumn(MetaDataClient.java:2880)
	at org.apache.phoenix.jdbc.PhoenixStatement$ExecutableDropColumnStatement$1.execute(PhoenixStatement.java:1147)
	at org.apache.phoenix.jdbc.PhoenixStatement$2.call(PhoenixStatement.java:322)
	at org.apache.phoenix.jdbc.PhoenixStatement$2.call(PhoenixStatement.java:314)
	at org.apache.phoenix.call.CallRunner.run(CallRunner.java:53)
	at org.apache.phoenix.jdbc.PhoenixStatement.executeMutation(PhoenixStatement.java:312)
	at org.apache.phoenix.jdbc.PhoenixStatement.execute(PhoenixStatement.java:1435)
	at org.apache.phoenix.end2end.AlterTableIT.testDropCoveredColumn(AlterTableIT.java:350)

testDropColumnsWithImutability(org.apache.phoenix.end2end.AlterTableIT)  Time elapsed: 14.813
sec  <<< ERROR!
java.sql.SQLException: ERROR 2009 (INT11): Unknown error code 0
	at org.apache.phoenix.exception.SQLExceptionCode$Factory$1.newException(SQLExceptionCode.java:396)
	at org.apache.phoenix.exception.SQLExceptionInfo.buildException(SQLExceptionInfo.java:145)
	at org.apache.phoenix.exception.SQLExceptionCode.fromErrorCode(SQLExceptionCode.java:424)
	at org.apache.phoenix.util.ServerUtil.parseRemoteException(ServerUtil.java:127)
	at org.apache.phoenix.util.ServerUtil.parseServerExceptionOrNull(ServerUtil.java:115)
	at org.apache.phoenix.util.ServerUtil.parseServerException(ServerUtil.java:104)
	at org.apache.phoenix.query.ConnectionQueryServicesImpl.metaDataCoprocessorExec(ConnectionQueryServicesImpl.java:1053)
	at org.apache.phoenix.query.ConnectionQueryServicesImpl.metaDataCoprocessorExec(ConnectionQueryServicesImpl.java:1016)
	at org.apache.phoenix.query.ConnectionQueryServicesImpl.dropColumn(ConnectionQueryServicesImpl.java:1819)
	at org.apache.phoenix.schema.MetaDataClient.dropColumn(MetaDataClient.java:2880)
	at org.apache.phoenix.jdbc.PhoenixStatement$ExecutableDropColumnStatement$1.execute(PhoenixStatement.java:1147)
	at org.apache.phoenix.jdbc.PhoenixStatement$2.call(PhoenixStatement.java:322)
	at org.apache.phoenix.jdbc.PhoenixStatement$2.call(PhoenixStatement.java:314)
	at org.apache.phoenix.call.CallRunner.run(CallRunner.java:53)
	at org.apache.phoenix.jdbc.PhoenixStatement.executeMutation(PhoenixStatement.java:312)
	at org.apache.phoenix.jdbc.PhoenixStatement.execute(PhoenixStatement.java:1435)
	at org.apache.phoenix.end2end.AlterTableIT.testDropColumnsWithImutability(AlterTableIT.java:874)

Tests run: 12, Failures: 0, Errors: 0, Skipped: 0, Time elapsed: 42.678 sec - in org.apache.phoenix.end2end.UnionAllIT
Running org.apache.phoenix.hbase.index.covered.example.EndtoEndIndexingWithCompressionIT
Tests run: 3, Failures: 0, Errors: 0, Skipped: 0, Time elapsed: 41.732 sec - in org.apache.phoenix.end2end.ParallelIteratorsIT
Running org.apache.phoenix.hbase.index.covered.example.EndToEndCoveredIndexingIT
Tests run: 2, Failures: 0, Errors: 0, Skipped: 0, Time elapsed: 18.366 sec - in org.apache.phoenix.hbase.index.covered.EndToEndCoveredColumnsIndexBuilderIT
Running org.apache.phoenix.hbase.index.balancer.IndexLoadBalancerIT
Running org.apache.phoenix.hbase.index.covered.example.FailWithoutRetriesIT
Tests run: 1, Failures: 0, Errors: 0, Skipped: 0, Time elapsed: 8.522 sec - in org.apache.phoenix.hbase.index.covered.example.FailWithoutRetriesIT
Running org.apache.phoenix.hbase.index.FailForUnsupportedHBaseVersionsIT
Tests run: 2, Failures: 0, Errors: 0, Skipped: 0, Time elapsed: 17.997 sec - in org.apache.phoenix.hbase.index.FailForUnsupportedHBaseVersionsIT
Running org.apache.phoenix.monitoring.PhoenixMetricsIT
Tests run: 11, Failures: 0, Errors: 0, Skipped: 0, Time elapsed: 148.577 sec - in org.apache.phoenix.hbase.index.covered.example.EndToEndCoveredIndexingIT
Running org.apache.hadoop.hbase.regionserver.wal.WALReplayWithIndexWritesAndCompressedWALIT
Tests run: 11, Failures: 0, Errors: 0, Skipped: 0, Time elapsed: 158.73 sec - in org.apache.phoenix.hbase.index.covered.example.EndtoEndIndexingWithCompressionIT
Running org.apache.hadoop.hbase.regionserver.wal.WALReplayWithIndexWritesAndUncompressedWALInHBase_094_9_IT
Tests run: 17, Failures: 0, Errors: 0, Skipped: 0, Time elapsed: 93.677 sec - in org.apache.phoenix.monitoring.PhoenixMetricsIT
Tests run: 1, Failures: 0, Errors: 0, Skipped: 0, Time elapsed: 27.359 sec - in org.apache.hadoop.hbase.regionserver.wal.WALReplayWithIndexWritesAndCompressedWALIT
Tests run: 1, Failures: 0, Errors: 0, Skipped: 0, Time elapsed: 23.9 sec - in org.apache.hadoop.hbase.regionserver.wal.WALReplayWithIndexWritesAndUncompressedWALInHBase_094_9_IT
Tests run: 9, Failures: 0, Errors: 0, Skipped: 0, Time elapsed: 233.127 sec - in org.apache.phoenix.hbase.index.balancer.IndexLoadBalancerIT
Running org.apache.phoenix.end2end.ViewIT
Tests run: 22, Failures: 0, Errors: 0, Skipped: 0, Time elapsed: 71.885 sec - in org.apache.phoenix.end2end.ViewIT

Results :




Tests run: 180, Failures: 0, Errors: 0, Skipped: 2

[INFO] 
[INFO] --- maven-failsafe-plugin:2.18:verify (ClientManagedTimeTests) @ phoenix-core ---
[INFO] Failsafe report directory: <https://builds.apache.org/job/Phoenix-master/ws/phoenix-core/target/failsafe-reports>
[INFO] ------------------------------------------------------------------------
[INFO] Reactor Summary:
[INFO] 
[INFO] Apache Phoenix .................................... SUCCESS [2.672s]
[INFO] Phoenix Core ...................................... FAILURE [55:06.277s]
[INFO] Phoenix - Flume ................................... SKIPPED
[INFO] Phoenix - Pig ..................................... SKIPPED
[INFO] Phoenix Query Server Client ....................... SKIPPED
[INFO] Phoenix Query Server .............................. SKIPPED
[INFO] Phoenix - Pherf ................................... SKIPPED
[INFO] Phoenix - Spark ................................... SKIPPED
[INFO] Phoenix Assembly .................................. SKIPPED
[INFO] Phoenix - Tracing Web Application ................. SKIPPED
[INFO] ------------------------------------------------------------------------
[INFO] BUILD FAILURE
[INFO] ------------------------------------------------------------------------
[INFO] Total time: 55:09.486s
[INFO] Finished at: Mon Oct 26 22:17:50 UTC 2015
[INFO] Final Memory: 49M/1211M
[INFO] ------------------------------------------------------------------------
[ERROR] Failed to execute goal org.apache.maven.plugins:maven-failsafe-plugin:2.18:verify
(ClientManagedTimeTests) on project phoenix-core: There are test failures.
[ERROR] 
[ERROR] Please refer to <https://builds.apache.org/job/Phoenix-master/ws/phoenix-core/target/failsafe-reports>
for the individual test results.
[ERROR] -> [Help 1]
[ERROR] 
[ERROR] To see the full stack trace of the errors, re-run Maven with the -e switch.
[ERROR] Re-run Maven using the -X switch to enable full debug logging.
[ERROR] 
[ERROR] For more information about the errors and possible solutions, please read the following
articles:
[ERROR] [Help 1] http://cwiki.apache.org/confluence/display/MAVEN/MojoFailureException
[ERROR] 
[ERROR] After correcting the problems, you can resume the build with the command
[ERROR]   mvn <goals> -rf :phoenix-core
Build step 'Invoke top-level Maven targets' marked build as failure
Archiving artifacts
Compressed 1.22 GB of artifacts by 51.4% relative to #937
Updating PHOENIX-2316
Recording test results

Mime
View raw message