phoenix-commits mailing list archives

Site index · List index
Message view « Date » · « Thread »
Top « Date » · « Thread »
From Apache Jenkins Server <jenk...@builds.apache.org>
Subject Build failed in Jenkins: Phoenix | Master #909
Date Tue, 06 Oct 2015 01:58:55 GMT
See <https://builds.apache.org/job/Phoenix-master/909/changes>

Changes:

[jamestaylor] PHOENIX-2256 Test failure in PMetaDataImplTest (James Heather)

------------------------------------------
[...truncated 124316 lines...]
#
Aborted
#
# A fatal error has been detected by the Java Runtime Environment:
#
#  SIGSEGV (0xb) at pc=0x65e6a654, pid=15771, tid=1579977536
#
# JRE version: 7.0_25-b15
# Java VM: Java HotSpot(TM) Server VM (23.25-b01 mixed mode linux-x86 )
# Problematic frame:
# C  [libnet.so+0x14654]  _fini+0x1d0c
#
# Failed to write core dump. Core dumps have been disabled. To enable core dumping, try "ulimit
-c unlimited" before starting Java again
#
# An error report file with more information is saved as:
# <https://builds.apache.org/job/Phoenix-master/ws/phoenix-pherf/hs_err_pid15771.log>
#
# If you would like to submit a bug report, please visit:
#   http://bugreport.sun.com/bugreport/crash.jsp
# The crash happened outside the Java Virtual Machine in native code.
# See problematic frame for where to report the bug.
#
Aborted
#
# A fatal error has been detected by the Java Runtime Environment:
#
#  SIGSEGV (0xb) at pc=0x66138654, pid=15761, tid=1579871040
#
# JRE version: 7.0_25-b15
# Java VM: Java HotSpot(TM) Server VM (23.25-b01 mixed mode linux-x86 )
# Problematic frame:
# C  [libnet.so+0x14654]  _fini+0x1d0c
#
# Failed to write core dump. Core dumps have been disabled. To enable core dumping, try "ulimit
-c unlimited" before starting Java again
#
# An error report file with more information is saved as:
# <https://builds.apache.org/job/Phoenix-master/ws/phoenix-pherf/hs_err_pid15761.log>
#
# If you would like to submit a bug report, please visit:
#   http://bugreport.sun.com/bugreport/crash.jsp
# The crash happened outside the Java Virtual Machine in native code.
# See problematic frame for where to report the bug.
#
Aborted

Results :




Tests run: 0, Failures: 0, Errors: 0, Skipped: 0

[INFO] 
[INFO] --- maven-failsafe-plugin:2.18:integration-test (NeedTheirOwnClusterTests) @ phoenix-pherf
---
[INFO] Failsafe report directory: <https://builds.apache.org/job/Phoenix-master/ws/phoenix-pherf/target/failsafe-reports>
[INFO] parallel='none', perCoreThreadCount=true, threadCount=0, useUnlimitedThreads=false,
threadCountSuites=0, threadCountClasses=0, threadCountMethods=0, parallelOptimized=true

-------------------------------------------------------
 T E S T S
-------------------------------------------------------

Results :




Tests run: 0, Failures: 0, Errors: 0, Skipped: 0

[INFO] 
[INFO] --- maven-failsafe-plugin:2.18:verify (ClientManagedTimeTests) @ phoenix-pherf ---
[INFO] Failsafe report directory: <https://builds.apache.org/job/Phoenix-master/ws/phoenix-pherf/target/failsafe-reports>
[INFO] 
[INFO] --- maven-failsafe-plugin:2.18:verify (HBaseManagedTimeTests) @ phoenix-pherf ---
[INFO] Failsafe report directory: <https://builds.apache.org/job/Phoenix-master/ws/phoenix-pherf/target/failsafe-reports>
[INFO] 
[INFO] --- maven-failsafe-plugin:2.18:verify (NeedTheirOwnClusterTests) @ phoenix-pherf ---
[INFO] Failsafe report directory: <https://builds.apache.org/job/Phoenix-master/ws/phoenix-pherf/target/failsafe-reports>
[INFO] 
[INFO] --- maven-install-plugin:2.5.1:install (default-install) @ phoenix-pherf ---
[INFO] Installing <https://builds.apache.org/job/Phoenix-master/909/artifact/phoenix-pherf/target/phoenix-pherf-4.6.0-HBase-1.1-SNAPSHOT.jar>
to /home/jenkins/.m2/repository/org/apache/phoenix/phoenix-pherf/4.6.0-HBase-1.1-SNAPSHOT/phoenix-pherf-4.6.0-HBase-1.1-SNAPSHOT.jar
[INFO] Installing <https://builds.apache.org/job/Phoenix-master/ws/phoenix-pherf/pom.xml>
to /home/jenkins/.m2/repository/org/apache/phoenix/phoenix-pherf/4.6.0-HBase-1.1-SNAPSHOT/phoenix-pherf-4.6.0-HBase-1.1-SNAPSHOT.pom
[INFO] Installing <https://builds.apache.org/job/Phoenix-master/909/artifact/phoenix-pherf/target/phoenix-pherf-4.6.0-HBase-1.1-SNAPSHOT-sources.jar>
to /home/jenkins/.m2/repository/org/apache/phoenix/phoenix-pherf/4.6.0-HBase-1.1-SNAPSHOT/phoenix-pherf-4.6.0-HBase-1.1-SNAPSHOT-sources.jar
[INFO] Installing <https://builds.apache.org/job/Phoenix-master/909/artifact/phoenix-pherf/target/phoenix-pherf-4.6.0-HBase-1.1-SNAPSHOT-tests.jar>
to /home/jenkins/.m2/repository/org/apache/phoenix/phoenix-pherf/4.6.0-HBase-1.1-SNAPSHOT/phoenix-pherf-4.6.0-HBase-1.1-SNAPSHOT-tests.jar
[INFO] Installing <https://builds.apache.org/job/Phoenix-master/909/artifact/phoenix-pherf/target/phoenix-pherf-4.6.0-HBase-1.1-SNAPSHOT-jar-with-dependencies.jar>
to /home/jenkins/.m2/repository/org/apache/phoenix/phoenix-pherf/4.6.0-HBase-1.1-SNAPSHOT/phoenix-pherf-4.6.0-HBase-1.1-SNAPSHOT-jar-with-dependencies.jar
[INFO] Installing <https://builds.apache.org/job/Phoenix-master/909/artifact/phoenix-pherf/target/phoenix-pherf-4.6.0-HBase-1.1-SNAPSHOT-minimal.jar>
to /home/jenkins/.m2/repository/org/apache/phoenix/phoenix-pherf/4.6.0-HBase-1.1-SNAPSHOT/phoenix-pherf-4.6.0-HBase-1.1-SNAPSHOT-minimal.jar
[INFO] Installing <https://builds.apache.org/job/Phoenix-master/ws/phoenix-pherf/target/phoenix-pherf-4.6.0-HBase-1.1-SNAPSHOT-standalone.zip>
to /home/jenkins/.m2/repository/org/apache/phoenix/phoenix-pherf/4.6.0-HBase-1.1-SNAPSHOT/phoenix-pherf-4.6.0-HBase-1.1-SNAPSHOT-standalone.zip
[INFO] Installing <https://builds.apache.org/job/Phoenix-master/ws/phoenix-pherf/target/phoenix-pherf-4.6.0-HBase-1.1-SNAPSHOT-cluster.zip>
to /home/jenkins/.m2/repository/org/apache/phoenix/phoenix-pherf/4.6.0-HBase-1.1-SNAPSHOT/phoenix-pherf-4.6.0-HBase-1.1-SNAPSHOT-cluster.zip
[INFO]                                                                         
[INFO] ------------------------------------------------------------------------
[INFO] Building Phoenix - Spark 4.6.0-HBase-1.1-SNAPSHOT
[INFO] ------------------------------------------------------------------------
[INFO] 
[INFO] --- maven-clean-plugin:2.5:clean (default-clean) @ phoenix-spark ---
[INFO] Deleting <https://builds.apache.org/job/Phoenix-master/ws/phoenix-spark/target>
[INFO] 
[INFO] --- maven-checkstyle-plugin:2.13:check (validate) @ phoenix-spark ---
[INFO] Starting audit...
Audit done.

[INFO] 
[INFO] --- maven-remote-resources-plugin:1.5:process (default) @ phoenix-spark ---
[INFO] 
[INFO] --- maven-resources-plugin:2.6:resources (default-resources) @ phoenix-spark ---
[INFO] Using 'UTF-8' encoding to copy filtered resources.
[INFO] skip non existing resourceDirectory <https://builds.apache.org/job/Phoenix-master/ws/phoenix-spark/src/main/resources>
[INFO] Copying 3 resources
[INFO] 
[INFO] --- scala-maven-plugin:3.2.0:add-source (scala-compile-first) @ phoenix-spark ---
[INFO] Add Source directory: <https://builds.apache.org/job/Phoenix-master/ws/phoenix-spark/src/main/scala>
[INFO] 
[INFO] --- scala-maven-plugin:3.2.0:compile (scala-compile-first) @ phoenix-spark ---
[WARNING]  Expected all dependencies to require Scala version: 2.10.4
[WARNING]  org.apache.phoenix:phoenix-spark:4.6.0-HBase-1.1-SNAPSHOT requires scala version:
2.10.4
[WARNING]  com.twitter:chill_2.10:0.5.0 requires scala version: 2.10.4
[WARNING]  com.typesafe.akka:akka-remote_2.10:2.3.11 requires scala version: 2.10.4
[WARNING]  com.typesafe.akka:akka-actor_2.10:2.3.11 requires scala version: 2.10.4
[WARNING]  com.typesafe.akka:akka-slf4j_2.10:2.3.11 requires scala version: 2.10.4
[WARNING]  org.apache.spark:spark-core_2.10:1.5.0 requires scala version: 2.10.4
[WARNING]  org.json4s:json4s-jackson_2.10:3.2.10 requires scala version: 2.10.0
[WARNING] Multiple versions of scala libraries detected!
[INFO] <https://builds.apache.org/job/Phoenix-master/ws/phoenix-spark/src/main/scala>:-1:
info: compiling
[INFO] Compiling 10 source files to <https://builds.apache.org/job/Phoenix-master/ws/phoenix-spark/target/classes>
at 1444096679775
[WARNING] warning: Class org.joda.convert.FromString not found - continuing with a stub.
[WARNING] warning: Class org.joda.convert.ToString not found - continuing with a stub.
[WARNING] warning: Class org.joda.convert.ToString not found - continuing with a stub.
[WARNING] warning: Class org.joda.convert.FromString not found - continuing with a stub.
[WARNING] warning: Class org.joda.convert.ToString not found - continuing with a stub.
[WARNING] warning: Class org.joda.convert.FromString not found - continuing with a stub.
[WARNING] warning: Class org.joda.convert.FromString not found - continuing with a stub.
[WARNING] warning: there were 5 feature warning(s); re-run with -feature for details
[WARNING] 8 warnings found
[INFO] prepare-compile in 0 s
[INFO] compile in 11 s
[INFO] 
[INFO] --- maven-compiler-plugin:3.0:compile (default-compile) @ phoenix-spark ---
[INFO] Changes detected - recompiling the module!
[INFO] 
[INFO] --- maven-resources-plugin:2.6:testResources (default-testResources) @ phoenix-spark
---
[INFO] Using 'UTF-8' encoding to copy filtered resources.
[INFO] Copying 2 resources
[INFO] Copying 3 resources
[INFO] 
[INFO] --- scala-maven-plugin:3.2.0:testCompile (scala-test-compile) @ phoenix-spark ---
[WARNING]  Expected all dependencies to require Scala version: 2.10.4
[WARNING]  org.apache.phoenix:phoenix-spark:4.6.0-HBase-1.1-SNAPSHOT requires scala version:
2.10.4
[WARNING]  com.twitter:chill_2.10:0.5.0 requires scala version: 2.10.4
[WARNING]  com.typesafe.akka:akka-remote_2.10:2.3.11 requires scala version: 2.10.4
[WARNING]  com.typesafe.akka:akka-actor_2.10:2.3.11 requires scala version: 2.10.4
[WARNING]  com.typesafe.akka:akka-slf4j_2.10:2.3.11 requires scala version: 2.10.4
[WARNING]  org.apache.spark:spark-core_2.10:1.5.0 requires scala version: 2.10.4
[WARNING]  org.json4s:json4s-jackson_2.10:3.2.10 requires scala version: 2.10.0
[WARNING] Multiple versions of scala libraries detected!
[INFO] <https://builds.apache.org/job/Phoenix-master/ws/phoenix-spark/src/it/scala>:-1:
info: compiling
[INFO] Compiling 1 source files to <https://builds.apache.org/job/Phoenix-master/ws/phoenix-spark/target/test-classes>
at 1444096691815
[WARNING] warning: Class org.joda.convert.FromString not found - continuing with a stub.
[WARNING] warning: Class org.joda.convert.ToString not found - continuing with a stub.
[WARNING] warning: Class org.joda.convert.ToString not found - continuing with a stub.
[WARNING] warning: Class org.joda.convert.FromString not found - continuing with a stub.
[WARNING] warning: Class org.joda.convert.ToString not found - continuing with a stub.
[WARNING] warning: Class org.joda.convert.FromString not found - continuing with a stub.
[WARNING] warning: Class org.joda.convert.FromString not found - continuing with a stub.
[WARNING] warning: Class org.apache.hadoop.mapred.MiniMRCluster not found - continuing with
a stub.
[WARNING] warning: there were 6 deprecation warning(s); re-run with -deprecation for details
[WARNING] 9 warnings found
[INFO] prepare-compile in 0 s
[INFO] compile in 10 s
[INFO] 
[INFO] --- maven-compiler-plugin:3.0:testCompile (default-testCompile) @ phoenix-spark ---
[INFO] Changes detected - recompiling the module!
[INFO] 
[INFO] --- maven-surefire-plugin:2.18:test (default-test) @ phoenix-spark ---
[INFO] 
[INFO] --- scalatest-maven-plugin:1.0:test (test) @ phoenix-spark ---
[INFO] Tests are skipped.
[INFO] 
[INFO] --- maven-source-plugin:2.2.1:jar-no-fork (attach-sources) @ phoenix-spark ---
[INFO] Building jar: <https://builds.apache.org/job/Phoenix-master/909/artifact/phoenix-spark/target/phoenix-spark-4.6.0-HBase-1.1-SNAPSHOT-sources.jar>
[INFO] 
[INFO] --- maven-jar-plugin:2.4:test-jar (default) @ phoenix-spark ---
[INFO] Building jar: <https://builds.apache.org/job/Phoenix-master/909/artifact/phoenix-spark/target/phoenix-spark-4.6.0-HBase-1.1-SNAPSHOT-tests.jar>
[INFO] 
[INFO] --- maven-jar-plugin:2.4:jar (default-jar) @ phoenix-spark ---
[INFO] Building jar: <https://builds.apache.org/job/Phoenix-master/909/artifact/phoenix-spark/target/phoenix-spark-4.6.0-HBase-1.1-SNAPSHOT.jar>
[INFO] 
[INFO] --- maven-site-plugin:3.2:attach-descriptor (attach-descriptor) @ phoenix-spark ---
[INFO] 
[INFO] --- scalatest-maven-plugin:1.0:test (integration-test) @ phoenix-spark ---
WARNING: -c has been deprecated and will be reused for a different (but still very cool) purpose
in ScalaTest 2.0. Please change all uses of -c to -P.
Discovery starting.
Discovery completed in 301 milliseconds.
Run starting. Expected test count is: 19
PhoenixSparkIT:
Formatting using clusterid: testClusterID
#
# A fatal error has been detected by the Java Runtime Environment:
#
#  SIGSEGV (0xb) at pc=0x4c17006b, pid=16923, tid=1163639616
#
# JRE version: 7.0_25-b15
# Java VM: Java HotSpot(TM) Server VM (23.25-b01 mixed mode linux-x86 )
# Problematic frame:
# C  [libnet.so+0x606b]  Java_java_net_Inet4AddressImpl_isReachable0+0x7b
#
# Failed to write core dump. Core dumps have been disabled. To enable core dumping, try "ulimit
-c unlimited" before starting Java again
#
# An error report file with more information is saved as:
# <https://builds.apache.org/job/Phoenix-master/ws/phoenix-spark/hs_err_pid16923.log>
#
# If you would like to submit a bug report, please visit:
#   http://bugreport.sun.com/bugreport/crash.jsp
# The crash happened outside the Java Virtual Machine in native code.
# See problematic frame for where to report the bug.
#
Aborted
[INFO] ------------------------------------------------------------------------
[INFO] Reactor Summary:
[INFO] 
[INFO] Apache Phoenix .................................... SUCCESS [3.641s]
[INFO] Phoenix Core ...................................... SUCCESS [2:14.705s]
[INFO] Phoenix - Flume ................................... SUCCESS [10.142s]
[INFO] Phoenix - Pig ..................................... SUCCESS [13.423s]
[INFO] Phoenix Query Server Client ....................... SUCCESS [1.463s]
[INFO] Phoenix Query Server .............................. SUCCESS [26.396s]
[INFO] Phoenix - Pherf ................................... SUCCESS [49.594s]
[INFO] Phoenix - Spark ................................... FAILURE [36.364s]
[INFO] Phoenix Assembly .................................. SKIPPED
[INFO] Phoenix - Tracing Web Application ................. SKIPPED
[INFO] ------------------------------------------------------------------------
[INFO] BUILD FAILURE
[INFO] ------------------------------------------------------------------------
[INFO] Total time: 4:36.337s
[INFO] Finished at: Tue Oct 06 01:58:29 UTC 2015
[INFO] Final Memory: 90M/1037M
[INFO] ------------------------------------------------------------------------
[ERROR] Failed to execute goal org.scalatest:scalatest-maven-plugin:1.0:test (integration-test)
on project phoenix-spark: There are test failures -> [Help 1]
[ERROR] 
[ERROR] To see the full stack trace of the errors, re-run Maven with the -e switch.
[ERROR] Re-run Maven using the -X switch to enable full debug logging.
[ERROR] 
[ERROR] For more information about the errors and possible solutions, please read the following
articles:
[ERROR] [Help 1] http://cwiki.apache.org/confluence/display/MAVEN/MojoFailureException
[ERROR] 
[ERROR] After correcting the problems, you can resume the build with the command
[ERROR]   mvn <goals> -rf :phoenix-spark
Build step 'Invoke top-level Maven targets' marked build as failure
Archiving artifacts
Compressed 244.96 MB of artifacts by 80.8% relative to #905
Updating PHOENIX-2256
Recording test results

Mime
View raw message