phoenix-commits mailing list archives

Site index · List index
Message view « Date » · « Thread »
Top « Date » · « Thread »
From Apache Jenkins Server <jenk...@builds.apache.org>
Subject Build failed in Jenkins: Phoenix | Master #888
Date Wed, 02 Sep 2015 09:27:06 GMT
See <https://builds.apache.org/job/Phoenix-master/888/changes>

Changes:

[ramkrishna] PHOENIX-2160 - Projection of specific array index does not work (Dumindu

------------------------------------------
[...truncated 118643 lines...]
[ERROR] LiteralExpression.java[227] (sizes) LineLength: Line is longer than 100 characters
(found 152).
[ERROR] LiteralExpression.java[246] (misc) Regexp: Line matches the illegal pattern 'Trailing
whitespace'.
[ERROR] LiteralExpression.java[269] (blocks) NeedBraces: 'if' construct must use '{}'s.
[ERROR] LiteralExpression.java[270] (blocks) NeedBraces: 'if' construct must use '{}'s.
[ERROR] LiteralExpression.java[271] (blocks) NeedBraces: 'if' construct must use '{}'s.
[ERROR] LiteralExpression.java[272:54] (whitespace) WhitespaceAfter: 'cast' is not followed
by whitespace.
[ERROR] LiteralExpression.java[274] (blocks) NeedBraces: 'if' construct must use '{}'s.
[ERROR] LiteralExpression.java[275] (blocks) NeedBraces: 'if' construct must use '{}'s.
[ERROR] LiteralExpression.java[282:60] (whitespace) WhitespaceAround: '-' is not preceded
with whitespace.
[ERROR] LiteralExpression.java[282:61] (whitespace) WhitespaceAround: '-' is not followed
by whitespace.
[ERROR] LiteralExpression.java[286:36] (whitespace) WhitespaceAround: '<=' is not preceded
with whitespace.
[ERROR] LiteralExpression.java[286:38] (whitespace) WhitespaceAround: '<=' is not followed
by whitespace.
[ERROR] LiteralExpression.java[288] (sizes) LineLength: Line is longer than 100 characters
(found 112).
[ERROR] LiteralExpression.java[288] (misc) Regexp: Line matches the illegal pattern 'Trailing
whitespace'.
[ERROR] LiteralExpression.java[288] (indentation) Indentation: if child at indentation level
16 not at correct indentation, 12
[ERROR] LiteralExpression.java[289] (indentation) Indentation: if child at indentation level
16 not at correct indentation, 12
[ERROR] LiteralExpression.java[289:85] (coding) EmptyStatement: Empty statement.
[ERROR] LiteralExpression.java[290:9] (blocks) RightCurly: '}' should be on the same line.
[ERROR] LiteralExpression.java[292] (indentation) Indentation: else child at indentation level
16 not at correct indentation, 12
[ERROR] LiteralExpression.java[292:66] (whitespace) WhitespaceAround: '>>' is not preceded
with whitespace.
[ERROR] LiteralExpression.java[292:68] (whitespace) WhitespaceAround: '>>' is not followed
by whitespace.
[ERROR] LiteralExpression.java[292:70] (whitespace) WhitespaceAround: '-' is not preceded
with whitespace.
[ERROR] LiteralExpression.java[292:71] (whitespace) WhitespaceAround: '-' is not followed
by whitespace.
[ERROR] LiteralExpression.java[293] (indentation) Indentation: else child at indentation level
16 not at correct indentation, 12
[ERROR] LiteralExpression.java[294] (sizes) LineLength: Line is longer than 100 characters
(found 113).
[ERROR] LiteralExpression.java[294] (indentation) Indentation: else child at indentation level
16 not at correct indentation, 12
[ERROR] LiteralExpression.java[295] (indentation) Indentation: else child at indentation level
16 not at correct indentation, 12
[ERROR] LiteralExpression.java[296] (misc) Regexp: Line matches the illegal pattern 'Trailing
whitespace'.
[ERROR] LiteralExpression.java[312] (sizes) LineLength: Line is longer than 100 characters
(found 114).
[ERROR] LiteralExpression.java[312:83] (whitespace) WhitespaceAround: '==' is not preceded
with whitespace.
[ERROR] LiteralExpression.java[312:85] (whitespace) WhitespaceAround: '==' is not followed
by whitespace.
[ERROR] LiteralExpression.java[314] (sizes) LineLength: Line is longer than 100 characters
(found 122).
[ERROR] LiteralExpression.java[314] (misc) Regexp: Line matches the illegal pattern 'Trailing
whitespace'.
[ERROR] LiteralExpression.java[316] (sizes) LineLength: Line is longer than 100 characters
(found 103).
[ERROR] LiteralExpression.java[316:67] (whitespace) WhitespaceAround: '+' is not preceded
with whitespace.
[ERROR] LiteralExpression.java[316:68] (whitespace) WhitespaceAround: '+' is not followed
by whitespace.
[ERROR] LiteralExpression.java[316:70] (whitespace) WhitespaceAround: '<<' is not preceded
with whitespace.
[ERROR] LiteralExpression.java[316:72] (whitespace) WhitespaceAround: '<<' is not followed
by whitespace.
[ERROR] LiteralExpression.java[342] (misc) Regexp: Line matches the illegal pattern 'Trailing
whitespace'.
[ERROR] LiteralExpression.java[360] (misc) Regexp: Line matches the illegal pattern 'Trailing
whitespace'.
[ERROR] LiteralExpression.java[365] (misc) Regexp: Line matches the illegal pattern 'Trailing
whitespace'.
[ERROR] DateSubtractExpression.java[2] (header) Header: Line does not match expected header
line of ' * Licensed to the Apache Software Foundation (ASF) under one or more'.
[ERROR] DateSubtractExpression.java[34] (javadoc) JavadocType: Missing a Javadoc comment.
[ERROR] DateSubtractExpression.java[35] (misc) Regexp: Line matches the illegal pattern 'Trailing
whitespace'.
[ERROR] DateSubtractExpression.java[45:25] (whitespace) WhitespaceAround: '=' is not preceded
with whitespace.
[ERROR] DateSubtractExpression.java[45:26] (whitespace) WhitespaceAround: '=' is not followed
by whitespace.
[ERROR] DateSubtractExpression.java[46] (misc) Regexp: Line matches the illegal pattern 'Trailing
whitespace'.
[ERROR] DateSubtractExpression.java[47:12] (whitespace) WhitespaceAround: 'for' is not followed
by whitespace.
[ERROR] DateSubtractExpression.java[47:18] (whitespace) WhitespaceAround: '=' is not preceded
with whitespace.
[ERROR] DateSubtractExpression.java[47:19] (whitespace) WhitespaceAround: '=' is not followed
by whitespace.
[ERROR] DateSubtractExpression.java[47:21] (whitespace) WhitespaceAfter: ';' is not followed
by whitespace.
[ERROR] DateSubtractExpression.java[47:22] (whitespace) WhitespaceAround: '<' is not preceded
with whitespace.
[ERROR] DateSubtractExpression.java[47:23] (whitespace) WhitespaceAround: '<' is not followed
by whitespace.
[ERROR] DateSubtractExpression.java[47:39] (whitespace) WhitespaceAfter: ';' is not followed
by whitespace.
[ERROR] DateSubtractExpression.java[60] (sizes) LineLength: Line is longer than 100 characters
(found 108).
[ERROR] DateSubtractExpression.java[60:31] (whitespace) WhitespaceAfter: 'cast' is not followed
by whitespace.
[ERROR] DateSubtractExpression.java[70:25] (whitespace) WhitespaceAround: '=' is not preceded
with whitespace.
[ERROR] DateSubtractExpression.java[70:26] (whitespace) WhitespaceAround: '=' is not followed
by whitespace.
[ERROR] CaseExpression.java[2] (header) Header: Line does not match expected header line of
' * Licensed to the Apache Software Foundation (ASF) under one or more'.
[ERROR] CaseExpression.java[40] (misc) Regexp: Line matches the illegal pattern 'Trailing
whitespace'.
[ERROR] CaseExpression.java[43] (misc) Regexp: Line matches the illegal pattern 'Trailing
whitespace'.
[ERROR] CaseExpression.java[48] (misc) Regexp: Line matches the illegal pattern 'Trailing
whitespace'.
[ERROR] CaseExpression.java[52] (misc) Regexp: Line matches the illegal pattern 'Trailing
whitespace'.
[ERROR] CaseExpression.java[55] (misc) Regexp: Line matches the illegal pattern 'Trailing
whitespace'.
[ERROR] CaseExpression.java[68] (misc) Regexp: Line matches the illegal pattern 'Trailing
whitespace'.
[ERROR] CaseExpression.java[69] (sizes) LineLength: Line is longer than 100 characters (found
102).
[ERROR] CaseExpression.java[72:47] (whitespace) WhitespaceAround: '+=' is not preceded with
whitespace.
[ERROR] CaseExpression.java[72:49] (whitespace) WhitespaceAround: '+=' is not followed by
whitespace.
[ERROR] CaseExpression.java[86] (sizes) LineLength: Line is longer than 100 characters (found
127).
[ERROR] CaseExpression.java[92] (sizes) LineLength: Line is longer than 100 characters (found
102).
[ERROR] CaseExpression.java[96:47] (whitespace) WhitespaceAround: '+=' is not preceded with
whitespace.
[ERROR] CaseExpression.java[96:49] (whitespace) WhitespaceAround: '+=' is not followed by
whitespace.
[ERROR] CaseExpression.java[119] (misc) Regexp: Line matches the illegal pattern 'Trailing
whitespace'.
[ERROR] CaseExpression.java[123] (misc) Regexp: Line matches the illegal pattern 'Trailing
whitespace'.
[ERROR] CaseExpression.java[127] (misc) Regexp: Line matches the illegal pattern 'Trailing
whitespace'.
[ERROR] CaseExpression.java[135:44] (whitespace) WhitespaceAround: '-' is not preceded with
whitespace.
[ERROR] CaseExpression.java[135:45] (whitespace) WhitespaceAround: '-' is not followed by
whitespace.
[ERROR] CaseExpression.java[148] (misc) Regexp: Line matches the illegal pattern 'Trailing
whitespace'.
[ERROR] CaseExpression.java[154] (misc) Regexp: Line matches the illegal pattern 'Trailing
whitespace'.
[ERROR] CaseExpression.java[160] (misc) Regexp: Line matches the illegal pattern 'Trailing
whitespace'.
[ERROR] CaseExpression.java[167:74] (whitespace) WhitespaceAround: '+=' is not preceded with
whitespace.
[ERROR] CaseExpression.java[167:76] (whitespace) WhitespaceAround: '+=' is not followed by
whitespace.
[ERROR] CaseExpression.java[169:18] (whitespace) WhitespaceAround: '+' is not preceded with
whitespace.
[ERROR] CaseExpression.java[169:19] (whitespace) WhitespaceAround: '+' is not followed by
whitespace.
[ERROR] CaseExpression.java[172] (sizes) LineLength: Line is longer than 100 characters (found
113).
[ERROR] CaseExpression.java[174:47] (whitespace) WhitespaceAround: '+' is not preceded with
whitespace.
[ERROR] CaseExpression.java[174:48] (whitespace) WhitespaceAround: '+' is not followed by
whitespace.
[ERROR] CaseExpression.java[183:30] (whitespace) WhitespaceAround: '+=' is not preceded with
whitespace.
[ERROR] CaseExpression.java[183:32] (whitespace) WhitespaceAround: '+=' is not followed by
whitespace.
[ERROR] CaseExpression.java[185] (misc) Regexp: Line matches the illegal pattern 'C-style
comment'.
[ERROR] CaseExpression.java[199] (misc) Regexp: Line matches the illegal pattern 'Trailing
whitespace'.
[ERROR] CaseExpression.java[220] (misc) Regexp: Line matches the illegal pattern 'Trailing
whitespace'.
[ERROR] CaseExpression.java[230] (misc) Regexp: Line matches the illegal pattern 'Trailing
whitespace'.
[ERROR] CaseExpression.java[234:51] (whitespace) WhitespaceAround: '+=' is not preceded with
whitespace.
[ERROR] CaseExpression.java[234:53] (whitespace) WhitespaceAround: '+=' is not followed by
whitespace.
[ERROR] CaseExpression.java[236:38] (whitespace) WhitespaceAround: '+' is not preceded with
whitespace.
[ERROR] CaseExpression.java[236:39] (whitespace) WhitespaceAround: '+' is not followed by
whitespace.
[ERROR] CaseExpression.java[241:63] (whitespace) WhitespaceAround: '-' is not preceded with
whitespace.
[ERROR] CaseExpression.java[241:64] (whitespace) WhitespaceAround: '-' is not followed by
whitespace.
[ERROR] CaseExpression.java[246] (misc) Regexp: Line matches the illegal pattern 'Trailing
whitespace'.
[ERROR] BaseSingleExpression.java[2] (header) Header: Line does not match expected header
line of ' * Licensed to the Apache Software Foundation (ASF) under one or more'.
[ERROR] BaseSingleExpression.java[32] (misc) Regexp: Line matches the illegal pattern 'Trailing
whitespace'.
[ERROR] BaseSingleExpression.java[35] (misc) Regexp: Line matches the illegal pattern 'Trailing
whitespace'.
[ERROR] BaseSingleExpression.java[41] (misc) Regexp: Line matches the illegal pattern 'Trailing
whitespace'.
[ERROR] BaseSingleExpression.java[57] (misc) Regexp: Line matches the illegal pattern 'Trailing
whitespace'.
[ERROR] BaseSingleExpression.java[60] (sizes) LineLength: Line is longer than 100 characters
(found 101).
[ERROR] BaseSingleExpression.java[91] (blocks) NeedBraces: 'if' construct must use '{}'s.
[ERROR] BaseSingleExpression.java[92] (blocks) NeedBraces: 'if' construct must use '{}'s.
[ERROR] BaseSingleExpression.java[93] (blocks) NeedBraces: 'if' construct must use '{}'s.
[ERROR] BaseSingleExpression.java[94:60] (whitespace) WhitespaceAfter: 'cast' is not followed
by whitespace.
[ERROR] BaseSingleExpression.java[95] (blocks) NeedBraces: 'if' construct must use '{}'s.
[ERROR] BaseSingleExpression.java[107] (misc) Regexp: Line matches the illegal pattern 'Trailing
whitespace'.
[ERROR] BaseSingleExpression.java[111] (misc) Regexp: Line matches the illegal pattern 'Trailing
whitespace'.
[WARNING] checkstyle:check violations detected but failOnViolation set to false
[INFO] 
[INFO] --- build-helper-maven-plugin:1.9.1:add-test-source (add-test-source) @ phoenix-core
---
[INFO] Test Source directory: /x1/jenkins/jenkins-slave/workspace/Phoenix-master/phoenix-core/src/it/java
added.
[INFO] 
[INFO] --- build-helper-maven-plugin:1.9.1:add-test-resource (add-test-resource) @ phoenix-core
---
[INFO] 
[INFO] --- build-helper-maven-plugin:1.9.1:add-source (add-source) @ phoenix-core ---
[INFO] Source directory: /x1/jenkins/jenkins-slave/workspace/Phoenix-master/phoenix-core/target/generated-sources/antlr3
added.
[INFO] Source directory: /x1/jenkins/jenkins-slave/workspace/Phoenix-master/phoenix-core/src/main/antlr3
added.
[INFO] 
[INFO] --- antlr3-maven-plugin:3.5:antlr (default) @ phoenix-core ---
[INFO] ANTLR: Processing source directory /x1/jenkins/jenkins-slave/workspace/Phoenix-master/phoenix-core/src/main/antlr3
ANTLR Parser Generator  Version 3.5
Output file /x1/jenkins/jenkins-slave/workspace/Phoenix-master/phoenix-core/target/generated-sources/antlr3/org/apache/phoenix/parse/PhoenixSQLParser.java
does not exist: must build /x1/jenkins/jenkins-slave/workspace/Phoenix-master/phoenix-core/src/main/antlr3/PhoenixSQL.g
PhoenixSQL.g
[INFO] 
[INFO] --- maven-dependency-plugin:2.1:build-classpath (create-phoenix-generated-classpath)
@ phoenix-core ---
[INFO] Wrote classpath file '/x1/jenkins/jenkins-slave/workspace/Phoenix-master/phoenix-core/target/cached_classpath.txt'.
[INFO] 
[INFO] --- maven-remote-resources-plugin:1.5:process (default) @ phoenix-core ---
[INFO] 
[INFO] --- maven-resources-plugin:2.6:resources (default-resources) @ phoenix-core ---
[INFO] Using 'UTF-8' encoding to copy filtered resources.
[INFO] Copying 1 resource to META-INF/services
[INFO] Copying 3 resources
[INFO] 
[INFO] --- maven-compiler-plugin:3.0:compile (default-compile) @ phoenix-core ---
[INFO] Changes detected - recompiling the module!
[INFO] Compiling 876 source files to /x1/jenkins/jenkins-slave/workspace/Phoenix-master/phoenix-core/target/classes
[INFO] -------------------------------------------------------------
[WARNING] COMPILATION WARNING : 
[INFO] -------------------------------------------------------------
[WARNING] /x1/jenkins/jenkins-slave/workspace/Phoenix-master/phoenix-core/src/main/java/org/apache/phoenix/execute/DescVarLengthFastByteComparisons.java:[25,16]
sun.misc.Unsafe is internal proprietary API and may be removed in a future release
[WARNING] /x1/jenkins/jenkins-slave/workspace/Phoenix-master/phoenix-core/src/main/java/org/apache/phoenix/execute/DescVarLengthFastByteComparisons.java:[116,26]
sun.misc.Unsafe is internal proprietary API and may be removed in a future release
[WARNING] /x1/jenkins/jenkins-slave/workspace/Phoenix-master/phoenix-core/src/main/java/org/apache/phoenix/execute/DescVarLengthFastByteComparisons.java:[122,30]
sun.misc.Unsafe is internal proprietary API and may be removed in a future release
[WARNING] /x1/jenkins/jenkins-slave/workspace/Phoenix-master/phoenix-core/src/main/java/org/apache/phoenix/execute/DescVarLengthFastByteComparisons.java:[126,39]
sun.misc.Unsafe is internal proprietary API and may be removed in a future release
[WARNING] /x1/jenkins/jenkins-slave/workspace/Phoenix-master/phoenix-core/src/main/java/org/apache/phoenix/hbase/index/table/CachingHTableFactory.java:
Some input files use or override a deprecated API.
[WARNING] /x1/jenkins/jenkins-slave/workspace/Phoenix-master/phoenix-core/src/main/java/org/apache/phoenix/hbase/index/table/CachingHTableFactory.java:
Recompile with -Xlint:deprecation for details.
[WARNING] /x1/jenkins/jenkins-slave/workspace/Phoenix-master/phoenix-core/src/main/java/org/apache/phoenix/expression/function/SingleAggregateFunction.java:
Some input files use unchecked or unsafe operations.
[WARNING] /x1/jenkins/jenkins-slave/workspace/Phoenix-master/phoenix-core/src/main/java/org/apache/phoenix/expression/function/SingleAggregateFunction.java:
Recompile with -Xlint:unchecked for details.
[INFO] 8 warnings 
[INFO] -------------------------------------------------------------
[INFO] -------------------------------------------------------------
[ERROR] COMPILATION ERROR : 
[INFO] -------------------------------------------------------------
[ERROR] /x1/jenkins/jenkins-slave/workspace/Phoenix-master/phoenix-core/src/main/java/org/apache/phoenix/compile/RowProjector.java:[27,45]
cannot find symbol
  symbol:   class CloneNonDeterministicExpressionVisitor
  location: package org.apache.phoenix.expression.visitor
[ERROR] /x1/jenkins/jenkins-slave/workspace/Phoenix-master/phoenix-core/src/main/java/org/apache/phoenix/compile/ProjectionCompiler.java:[52,45]
cannot find symbol
  symbol:   class ProjectedColumnExpressionVisitor
  location: package org.apache.phoenix.expression.visitor
[ERROR] /x1/jenkins/jenkins-slave/workspace/Phoenix-master/phoenix-core/src/main/java/org/apache/phoenix/compile/ProjectionCompiler.java:[53,45]
cannot find symbol
  symbol:   class ReplaceArrayFunctionExpressionVisitor
  location: package org.apache.phoenix.expression.visitor
[ERROR] /x1/jenkins/jenkins-slave/workspace/Phoenix-master/phoenix-core/src/main/java/org/apache/phoenix/compile/RowProjector.java:[121,17]
cannot find symbol
  symbol:   class CloneNonDeterministicExpressionVisitor
  location: class org.apache.phoenix.compile.RowProjector
[ERROR] /x1/jenkins/jenkins-slave/workspace/Phoenix-master/phoenix-core/src/main/java/org/apache/phoenix/compile/RowProjector.java:[121,70]
cannot find symbol
  symbol:   class CloneNonDeterministicExpressionVisitor
  location: class org.apache.phoenix.compile.RowProjector
[ERROR] /x1/jenkins/jenkins-slave/workspace/Phoenix-master/phoenix-core/src/main/java/org/apache/phoenix/compile/ProjectionCompiler.java:[451,13]
cannot find symbol
  symbol:   class ReplaceArrayFunctionExpressionVisitor
  location: class org.apache.phoenix.compile.ProjectionCompiler
[ERROR] /x1/jenkins/jenkins-slave/workspace/Phoenix-master/phoenix-core/src/main/java/org/apache/phoenix/compile/ProjectionCompiler.java:[451,65]
cannot find symbol
  symbol:   class ReplaceArrayFunctionExpressionVisitor
  location: class org.apache.phoenix.compile.ProjectionCompiler
[ERROR] /x1/jenkins/jenkins-slave/workspace/Phoenix-master/phoenix-core/src/main/java/org/apache/phoenix/compile/ProjectionCompiler.java:[692,45]
cannot find symbol
  symbol:   class ProjectedColumnExpressionVisitor
  location: class org.apache.phoenix.compile.ProjectionCompiler.SelectClauseVisitor
[INFO] 8 errors 
[INFO] -------------------------------------------------------------
[INFO] ------------------------------------------------------------------------
[INFO] Reactor Summary:
[INFO] 
[INFO] Apache Phoenix .................................... SUCCESS [7.795s]
[INFO] Phoenix Core ...................................... FAILURE [1:11.801s]
[INFO] Phoenix - Flume ................................... SKIPPED
[INFO] Phoenix - Pig ..................................... SKIPPED
[INFO] Phoenix Query Server Client ....................... SKIPPED
[INFO] Phoenix Query Server .............................. SKIPPED
[INFO] Phoenix - Pherf ................................... SKIPPED
[INFO] Phoenix - Spark ................................... SKIPPED
[INFO] Phoenix Assembly .................................. SKIPPED
[INFO] ------------------------------------------------------------------------
[INFO] BUILD FAILURE
[INFO] ------------------------------------------------------------------------
[INFO] Total time: 1:20.124s
[INFO] Finished at: Wed Sep 02 09:27:11 UTC 2015
[INFO] Final Memory: 57M/1161M
[INFO] ------------------------------------------------------------------------
[ERROR] Failed to execute goal org.apache.maven.plugins:maven-compiler-plugin:3.0:compile
(default-compile) on project phoenix-core: Compilation failure: Compilation failure:
[ERROR] /x1/jenkins/jenkins-slave/workspace/Phoenix-master/phoenix-core/src/main/java/org/apache/phoenix/compile/RowProjector.java:[27,45]
cannot find symbol
[ERROR] symbol:   class CloneNonDeterministicExpressionVisitor
[ERROR] location: package org.apache.phoenix.expression.visitor
[ERROR] /x1/jenkins/jenkins-slave/workspace/Phoenix-master/phoenix-core/src/main/java/org/apache/phoenix/compile/ProjectionCompiler.java:[52,45]
cannot find symbol
[ERROR] symbol:   class ProjectedColumnExpressionVisitor
[ERROR] location: package org.apache.phoenix.expression.visitor
[ERROR] /x1/jenkins/jenkins-slave/workspace/Phoenix-master/phoenix-core/src/main/java/org/apache/phoenix/compile/ProjectionCompiler.java:[53,45]
cannot find symbol
[ERROR] symbol:   class ReplaceArrayFunctionExpressionVisitor
[ERROR] location: package org.apache.phoenix.expression.visitor
[ERROR] /x1/jenkins/jenkins-slave/workspace/Phoenix-master/phoenix-core/src/main/java/org/apache/phoenix/compile/RowProjector.java:[121,17]
cannot find symbol
[ERROR] symbol:   class CloneNonDeterministicExpressionVisitor
[ERROR] location: class org.apache.phoenix.compile.RowProjector
[ERROR] /x1/jenkins/jenkins-slave/workspace/Phoenix-master/phoenix-core/src/main/java/org/apache/phoenix/compile/RowProjector.java:[121,70]
cannot find symbol
[ERROR] symbol:   class CloneNonDeterministicExpressionVisitor
[ERROR] location: class org.apache.phoenix.compile.RowProjector
[ERROR] /x1/jenkins/jenkins-slave/workspace/Phoenix-master/phoenix-core/src/main/java/org/apache/phoenix/compile/ProjectionCompiler.java:[451,13]
cannot find symbol
[ERROR] symbol:   class ReplaceArrayFunctionExpressionVisitor
[ERROR] location: class org.apache.phoenix.compile.ProjectionCompiler
[ERROR] /x1/jenkins/jenkins-slave/workspace/Phoenix-master/phoenix-core/src/main/java/org/apache/phoenix/compile/ProjectionCompiler.java:[451,65]
cannot find symbol
[ERROR] symbol:   class ReplaceArrayFunctionExpressionVisitor
[ERROR] location: class org.apache.phoenix.compile.ProjectionCompiler
[ERROR] /x1/jenkins/jenkins-slave/workspace/Phoenix-master/phoenix-core/src/main/java/org/apache/phoenix/compile/ProjectionCompiler.java:[692,45]
cannot find symbol
[ERROR] symbol:   class ProjectedColumnExpressionVisitor
[ERROR] location: class org.apache.phoenix.compile.ProjectionCompiler.SelectClauseVisitor
[ERROR] -> [Help 1]
[ERROR] 
[ERROR] To see the full stack trace of the errors, re-run Maven with the -e switch.
[ERROR] Re-run Maven using the -X switch to enable full debug logging.
[ERROR] 
[ERROR] For more information about the errors and possible solutions, please read the following
articles:
[ERROR] [Help 1] http://cwiki.apache.org/confluence/display/MAVEN/MojoFailureException
[ERROR] 
[ERROR] After correcting the problems, you can resume the build with the command
[ERROR]   mvn <goals> -rf :phoenix-core
Build step 'Invoke top-level Maven targets' marked build as failure
Archiving artifacts
Sending artifact delta relative to Phoenix | Master #887
Archived 129 artifacts
Archive block size is 32768
Received 6227 blocks and 47490625 bytes
Compression is 81.1%
Took 1 min 7 sec
Updating PHOENIX-2160
Recording test results

Mime
View raw message