phoenix-commits mailing list archives

Site index · List index
Message view « Date » · « Thread »
Top « Date » · « Thread »
From Apache Jenkins Server <jenk...@builds.apache.org>
Subject Build failed in Jenkins: Phoenix-4.x-HBase-1.0 #162
Date Thu, 10 Sep 2015 20:30:39 GMT
See <https://builds.apache.org/job/Phoenix-4.x-HBase-1.0/162/changes>

Changes:

[ndimiduk] PHOENIX-2186 Creating backend services for the Phoenix Tracing Web App (Nishani)

[ndimiduk] PHOENIX-2187 Creating the front-end application for Phoenix Tracing Web App (Nishani)

[mujtaba] PHOENIX-2240 Duplicate keys generated by performance.py

[mujtaba] PHOENIX-2247 Fix rat violations in Pherf

------------------------------------------
[...truncated 117240 lines...]
#  SIGSEGV (0xb) at pc=0x6603252c, pid=2940, tid=1584241472
#
# JRE version: 7.0_25-b15
# Java VM: Java HotSpot(TM) Server VM (23.25-b01 mixed mode linux-x86 )
# Problematic frame:
# C  [libnet.so+0x352c]  _init+0x620
#
# Failed to write core dump. Core dumps have been disabled. To enable core dumping, try "ulimit
-c unlimited" before starting Java again
#
# An error report file with more information is saved as:
# <https://builds.apache.org/job/Phoenix-4.x-HBase-1.0/ws/phoenix-pherf/hs_err_pid2940.log>
#
# A fatal error has been detected by the Java Runtime Environment:
#
#  SIGSEGV (0xb) at pc=0x6604552c, pid=2933, tid=1582873408
#
# JRE version: 7.0_25-b15
# Java VM: Java HotSpot(TM) Server VM (23.25-b01 mixed mode linux-x86 )
# Problematic frame:
*** Error in `/home/jenkins/tools/java/jdk1.7.0_25-32/jre/bin/java': malloc(): memory corruption:
0x6db13578 ***
#
# If you would like to submit a bug report, please visit:
#   http://bugreport.sun.com/bugreport/crash.jsp
# The crash happened outside the Java Virtual Machine in native code.
# See problematic frame for where to report the bug.
#
Aborted
# C  [libnet.so+0x352c]
Aborted
#
# A fatal error has been detected by the Java Runtime Environment:
#
#  SIGSEGV (0xb) at pc=0x65e6d52c, pid=2930, tid=1580575552
#
# JRE version: 7.0_25-b15
# Java VM: Java HotSpot(TM) Server VM (23.25-b01 mixed mode linux-x86 )
# Problematic frame:
# C  [libnet.so+0x352c]  _init+0x620
#
# Failed to write core dump. Core dumps have been disabled. To enable core dumping, try "ulimit
-c unlimited" before starting Java again
#
# An error report file with more information is saved as:
# <https://builds.apache.org/job/Phoenix-4.x-HBase-1.0/ws/phoenix-pherf/hs_err_pid2930.log>
*** Error in `/home/jenkins/tools/java/jdk1.7.0_25-32/jre/bin/java': free(): invalid next
size (fast): 0x6db16330 ***
Aborted

Results :




Tests run: 0, Failures: 0, Errors: 0, Skipped: 0

[INFO] 
[INFO] --- maven-failsafe-plugin:2.18:integration-test (NeedTheirOwnClusterTests) @ phoenix-pherf
---
[INFO] Failsafe report directory: <https://builds.apache.org/job/Phoenix-4.x-HBase-1.0/ws/phoenix-pherf/target/failsafe-reports>
[INFO] parallel='none', perCoreThreadCount=true, threadCount=0, useUnlimitedThreads=false,
threadCountSuites=0, threadCountClasses=0, threadCountMethods=0, parallelOptimized=true

-------------------------------------------------------
 T E S T S
-------------------------------------------------------

Results :




Tests run: 0, Failures: 0, Errors: 0, Skipped: 0

[INFO] 
[INFO] --- maven-failsafe-plugin:2.18:verify (ClientManagedTimeTests) @ phoenix-pherf ---
[INFO] Failsafe report directory: <https://builds.apache.org/job/Phoenix-4.x-HBase-1.0/ws/phoenix-pherf/target/failsafe-reports>
[INFO] 
[INFO] --- maven-failsafe-plugin:2.18:verify (HBaseManagedTimeTests) @ phoenix-pherf ---
[INFO] Failsafe report directory: <https://builds.apache.org/job/Phoenix-4.x-HBase-1.0/ws/phoenix-pherf/target/failsafe-reports>
[INFO] 
[INFO] --- maven-failsafe-plugin:2.18:verify (NeedTheirOwnClusterTests) @ phoenix-pherf ---
[INFO] Failsafe report directory: <https://builds.apache.org/job/Phoenix-4.x-HBase-1.0/ws/phoenix-pherf/target/failsafe-reports>
[INFO] 
[INFO] --- maven-install-plugin:2.5.1:install (default-install) @ phoenix-pherf ---
[INFO] Installing <https://builds.apache.org/job/Phoenix-4.x-HBase-1.0/162/artifact/phoenix-pherf/target/phoenix-pherf-4.6.0-HBase-1.0-SNAPSHOT.jar>
to /home/jenkins/.m2/repository/org/apache/phoenix/phoenix-pherf/4.6.0-HBase-1.0-SNAPSHOT/phoenix-pherf-4.6.0-HBase-1.0-SNAPSHOT.jar
[INFO] Installing <https://builds.apache.org/job/Phoenix-4.x-HBase-1.0/ws/phoenix-pherf/pom.xml>
to /home/jenkins/.m2/repository/org/apache/phoenix/phoenix-pherf/4.6.0-HBase-1.0-SNAPSHOT/phoenix-pherf-4.6.0-HBase-1.0-SNAPSHOT.pom
[INFO] Installing <https://builds.apache.org/job/Phoenix-4.x-HBase-1.0/162/artifact/phoenix-pherf/target/phoenix-pherf-4.6.0-HBase-1.0-SNAPSHOT-sources.jar>
to /home/jenkins/.m2/repository/org/apache/phoenix/phoenix-pherf/4.6.0-HBase-1.0-SNAPSHOT/phoenix-pherf-4.6.0-HBase-1.0-SNAPSHOT-sources.jar
[INFO] Installing <https://builds.apache.org/job/Phoenix-4.x-HBase-1.0/162/artifact/phoenix-pherf/target/phoenix-pherf-4.6.0-HBase-1.0-SNAPSHOT-tests.jar>
to /home/jenkins/.m2/repository/org/apache/phoenix/phoenix-pherf/4.6.0-HBase-1.0-SNAPSHOT/phoenix-pherf-4.6.0-HBase-1.0-SNAPSHOT-tests.jar
[INFO] Installing <https://builds.apache.org/job/Phoenix-4.x-HBase-1.0/162/artifact/phoenix-pherf/target/phoenix-pherf-4.6.0-HBase-1.0-SNAPSHOT-jar-with-dependencies.jar>
to /home/jenkins/.m2/repository/org/apache/phoenix/phoenix-pherf/4.6.0-HBase-1.0-SNAPSHOT/phoenix-pherf-4.6.0-HBase-1.0-SNAPSHOT-jar-with-dependencies.jar
[INFO] Installing <https://builds.apache.org/job/Phoenix-4.x-HBase-1.0/162/artifact/phoenix-pherf/target/phoenix-pherf-4.6.0-HBase-1.0-SNAPSHOT-minimal.jar>
to /home/jenkins/.m2/repository/org/apache/phoenix/phoenix-pherf/4.6.0-HBase-1.0-SNAPSHOT/phoenix-pherf-4.6.0-HBase-1.0-SNAPSHOT-minimal.jar
[INFO] Installing <https://builds.apache.org/job/Phoenix-4.x-HBase-1.0/ws/phoenix-pherf/target/phoenix-pherf-4.6.0-HBase-1.0-SNAPSHOT-standalone.zip>
to /home/jenkins/.m2/repository/org/apache/phoenix/phoenix-pherf/4.6.0-HBase-1.0-SNAPSHOT/phoenix-pherf-4.6.0-HBase-1.0-SNAPSHOT-standalone.zip
[INFO] Installing <https://builds.apache.org/job/Phoenix-4.x-HBase-1.0/ws/phoenix-pherf/target/phoenix-pherf-4.6.0-HBase-1.0-SNAPSHOT-cluster.zip>
to /home/jenkins/.m2/repository/org/apache/phoenix/phoenix-pherf/4.6.0-HBase-1.0-SNAPSHOT/phoenix-pherf-4.6.0-HBase-1.0-SNAPSHOT-cluster.zip
[INFO]                                                                         
[INFO] ------------------------------------------------------------------------
[INFO] Building Phoenix - Spark 4.6.0-HBase-1.0-SNAPSHOT
[INFO] ------------------------------------------------------------------------
[INFO] 
[INFO] --- maven-clean-plugin:2.5:clean (default-clean) @ phoenix-spark ---
[INFO] Deleting <https://builds.apache.org/job/Phoenix-4.x-HBase-1.0/ws/phoenix-spark/target>
[INFO] 
[INFO] --- maven-checkstyle-plugin:2.13:check (validate) @ phoenix-spark ---
[INFO] Starting audit...
Audit done.

[INFO] 
[INFO] --- maven-remote-resources-plugin:1.5:process (default) @ phoenix-spark ---
[INFO] 
[INFO] --- maven-resources-plugin:2.6:resources (default-resources) @ phoenix-spark ---
[INFO] Using 'UTF-8' encoding to copy filtered resources.
[INFO] skip non existing resourceDirectory <https://builds.apache.org/job/Phoenix-4.x-HBase-1.0/ws/phoenix-spark/src/main/resources>
[INFO] Copying 3 resources
[INFO] 
[INFO] --- scala-maven-plugin:3.2.0:add-source (scala-compile-first) @ phoenix-spark ---
[INFO] Add Source directory: <https://builds.apache.org/job/Phoenix-4.x-HBase-1.0/ws/phoenix-spark/src/main/scala>
[INFO] 
[INFO] --- scala-maven-plugin:3.2.0:compile (scala-compile-first) @ phoenix-spark ---
[WARNING]  Expected all dependencies to require Scala version: 2.10.4
[WARNING]  org.apache.phoenix:phoenix-spark:4.6.0-HBase-1.0-SNAPSHOT requires scala version:
2.10.4
[WARNING]  com.twitter:chill_2.10:0.5.0 requires scala version: 2.10.4
[WARNING]  org.spark-project.akka:akka-remote_2.10:2.3.4-spark requires scala version: 2.10.4
[WARNING]  org.spark-project.akka:akka-actor_2.10:2.3.4-spark requires scala version: 2.10.4
[WARNING]  org.spark-project.akka:akka-slf4j_2.10:2.3.4-spark requires scala version: 2.10.4
[WARNING]  org.apache.spark:spark-core_2.10:1.4.0 requires scala version: 2.10.4
[WARNING]  org.json4s:json4s-jackson_2.10:3.2.10 requires scala version: 2.10.0
[WARNING] Multiple versions of scala libraries detected!
[INFO] <https://builds.apache.org/job/Phoenix-4.x-HBase-1.0/ws/phoenix-spark/src/main/scala>:-1:
info: compiling
[INFO] Compiling 10 source files to <https://builds.apache.org/job/Phoenix-4.x-HBase-1.0/ws/phoenix-spark/target/classes>
at 1441916777031
[WARNING] warning: Class org.joda.convert.FromString not found - continuing with a stub.
[WARNING] warning: Class org.joda.convert.ToString not found - continuing with a stub.
[WARNING] warning: Class org.joda.convert.ToString not found - continuing with a stub.
[WARNING] warning: Class org.joda.convert.FromString not found - continuing with a stub.
[WARNING] warning: Class org.joda.convert.ToString not found - continuing with a stub.
[WARNING] warning: Class org.joda.convert.FromString not found - continuing with a stub.
[WARNING] warning: Class org.joda.convert.FromString not found - continuing with a stub.
[WARNING] warning: there were 5 feature warning(s); re-run with -feature for details
[WARNING] 8 warnings found
[INFO] prepare-compile in 0 s
[INFO] compile in 9 s
[INFO] 
[INFO] --- maven-compiler-plugin:3.0:compile (default-compile) @ phoenix-spark ---
[INFO] Changes detected - recompiling the module!
[INFO] 
[INFO] --- maven-resources-plugin:2.6:testResources (default-testResources) @ phoenix-spark
---
[INFO] Using 'UTF-8' encoding to copy filtered resources.
[INFO] Copying 2 resources
[INFO] Copying 3 resources
[INFO] 
[INFO] --- scala-maven-plugin:3.2.0:testCompile (scala-test-compile) @ phoenix-spark ---
[WARNING]  Expected all dependencies to require Scala version: 2.10.4
[WARNING]  org.apache.phoenix:phoenix-spark:4.6.0-HBase-1.0-SNAPSHOT requires scala version:
2.10.4
[WARNING]  com.twitter:chill_2.10:0.5.0 requires scala version: 2.10.4
[WARNING]  org.spark-project.akka:akka-remote_2.10:2.3.4-spark requires scala version: 2.10.4
[WARNING]  org.spark-project.akka:akka-actor_2.10:2.3.4-spark requires scala version: 2.10.4
[WARNING]  org.spark-project.akka:akka-slf4j_2.10:2.3.4-spark requires scala version: 2.10.4
[WARNING]  org.apache.spark:spark-core_2.10:1.4.0 requires scala version: 2.10.4
[WARNING]  org.json4s:json4s-jackson_2.10:3.2.10 requires scala version: 2.10.0
[WARNING] Multiple versions of scala libraries detected!
[INFO] <https://builds.apache.org/job/Phoenix-4.x-HBase-1.0/ws/phoenix-spark/src/it/scala>:-1:
info: compiling
[INFO] Compiling 1 source files to <https://builds.apache.org/job/Phoenix-4.x-HBase-1.0/ws/phoenix-spark/target/test-classes>
at 1441916787181
[WARNING] warning: Class org.joda.convert.FromString not found - continuing with a stub.
[WARNING] warning: Class org.joda.convert.ToString not found - continuing with a stub.
[WARNING] warning: Class org.joda.convert.ToString not found - continuing with a stub.
[WARNING] warning: Class org.joda.convert.FromString not found - continuing with a stub.
[WARNING] warning: Class org.joda.convert.ToString not found - continuing with a stub.
[WARNING] warning: Class org.joda.convert.FromString not found - continuing with a stub.
[WARNING] warning: Class org.joda.convert.FromString not found - continuing with a stub.
[WARNING] warning: Class org.apache.hadoop.mapred.MiniMRCluster not found - continuing with
a stub.
[WARNING] warning: there were 5 deprecation warning(s); re-run with -deprecation for details
[WARNING] 9 warnings found
[INFO] prepare-compile in 0 s
[INFO] compile in 9 s
[INFO] 
[INFO] --- maven-compiler-plugin:3.0:testCompile (default-testCompile) @ phoenix-spark ---
[INFO] Changes detected - recompiling the module!
[INFO] 
[INFO] --- maven-surefire-plugin:2.18:test (default-test) @ phoenix-spark ---
[INFO] 
[INFO] --- scalatest-maven-plugin:1.0:test (test) @ phoenix-spark ---
[INFO] Tests are skipped.
[INFO] 
[INFO] --- maven-source-plugin:2.2.1:jar-no-fork (attach-sources) @ phoenix-spark ---
[INFO] Building jar: <https://builds.apache.org/job/Phoenix-4.x-HBase-1.0/162/artifact/phoenix-spark/target/phoenix-spark-4.6.0-HBase-1.0-SNAPSHOT-sources.jar>
[INFO] 
[INFO] --- maven-jar-plugin:2.4:test-jar (default) @ phoenix-spark ---
[INFO] Building jar: <https://builds.apache.org/job/Phoenix-4.x-HBase-1.0/162/artifact/phoenix-spark/target/phoenix-spark-4.6.0-HBase-1.0-SNAPSHOT-tests.jar>
[INFO] 
[INFO] --- maven-jar-plugin:2.4:jar (default-jar) @ phoenix-spark ---
[INFO] Building jar: <https://builds.apache.org/job/Phoenix-4.x-HBase-1.0/162/artifact/phoenix-spark/target/phoenix-spark-4.6.0-HBase-1.0-SNAPSHOT.jar>
[INFO] 
[INFO] --- maven-site-plugin:3.2:attach-descriptor (attach-descriptor) @ phoenix-spark ---
[INFO] 
[INFO] --- scalatest-maven-plugin:1.0:test (integration-test) @ phoenix-spark ---
WARNING: -c has been deprecated and will be reused for a different (but still very cool) purpose
in ScalaTest 2.0. Please change all uses of -c to -P.
Discovery starting.
Discovery completed in 299 milliseconds.
Run starting. Expected test count is: 18
PhoenixSparkIT:
Formatting using clusterid: testClusterID
#
# A fatal error has been detected by the Java Runtime Environment:
#
#  SIGSEGV (0xb) at pc=0x4cb1f52c, pid=3992, tid=1161956160
#
# JRE version: 7.0_25-b15
# Java VM: Java HotSpot(TM) Server VM (23.25-b01 mixed mode linux-x86 )
# Problematic frame:
# C  [libnet.so+0x352c]  _init+0x620
#
# Failed to write core dump. Core dumps have been disabled. To enable core dumping, try "ulimit
-c unlimited" before starting Java again
#
# An error report file with more information is saved as:
# <https://builds.apache.org/job/Phoenix-4.x-HBase-1.0/ws/phoenix-spark/hs_err_pid3992.log>
java: malloc.c:2372: sysmalloc: Assertion `(old_top == (((mbinptr) (((char *) &((av)->bins[((1)
- 1) * 2])) - __builtin_offsetof (struct malloc_chunk, fd)))) && old_size == 0) ||
((unsigned long) (old_size) >= (unsigned long)((((__builtin_offsetof (struct malloc_chunk,
fd_nextsize))+((2 *(sizeof(size_t))) - 1)) & ~((2 *(sizeof(size_t))) - 1))) &&
((old_top)->size & 0x1) && ((unsigned long) old_end & pagemask) == 0)'
failed.
Aborted
[INFO] ------------------------------------------------------------------------
[INFO] Reactor Summary:
[INFO] 
[INFO] Apache Phoenix .................................... SUCCESS [4.637s]
[INFO] Phoenix Core ...................................... SUCCESS [2:08.592s]
[INFO] Phoenix - Flume ................................... SUCCESS [10.027s]
[INFO] Phoenix - Pig ..................................... SUCCESS [12.057s]
[INFO] Phoenix Query Server Client ....................... SUCCESS [1.415s]
[INFO] Phoenix Query Server .............................. SUCCESS [26.968s]
[INFO] Phoenix - Pherf ................................... SUCCESS [52.593s]
[INFO] Phoenix - Spark ................................... FAILURE [30.327s]
[INFO] Phoenix Assembly .................................. SKIPPED
[INFO] Phoenix - Tracing Web Application ................. SKIPPED
[INFO] ------------------------------------------------------------------------
[INFO] BUILD FAILURE
[INFO] ------------------------------------------------------------------------
[INFO] Total time: 4:27.234s
[INFO] Finished at: Thu Sep 10 20:26:43 UTC 2015
[INFO] Final Memory: 87M/862M
[INFO] ------------------------------------------------------------------------
[ERROR] Failed to execute goal org.scalatest:scalatest-maven-plugin:1.0:test (integration-test)
on project phoenix-spark: There are test failures -> [Help 1]
[ERROR] 
[ERROR] To see the full stack trace of the errors, re-run Maven with the -e switch.
[ERROR] Re-run Maven using the -X switch to enable full debug logging.
[ERROR] 
[ERROR] For more information about the errors and possible solutions, please read the following
articles:
[ERROR] [Help 1] http://cwiki.apache.org/confluence/display/MAVEN/MojoFailureException
[ERROR] 
[ERROR] After correcting the problems, you can resume the build with the command
[ERROR]   mvn <goals> -rf :phoenix-spark
Build step 'Invoke top-level Maven targets' marked build as failure
Archiving artifacts
Sending artifact delta relative to Phoenix-4.x-HBase-1.0 #159
Archived 419 artifacts
Archive block size is 32768
Received 6622 blocks and 50217987 bytes
Compression is 81.2%
Took 58 sec
Recording test results

Mime
View raw message