phoenix-commits mailing list archives

Site index · List index
Message view « Date » · « Thread »
Top « Date » · « Thread »
From Apache Jenkins Server <jenk...@builds.apache.org>
Subject Build failed in Jenkins: Phoenix-4.x-HBase-1.0 #161
Date Wed, 09 Sep 2015 23:11:06 GMT
See <https://builds.apache.org/job/Phoenix-4.x-HBase-1.0/161/changes>

Changes:

[maryannxue] PHOENIX-2198 Support correlate variable

------------------------------------------
[...truncated 118901 lines...]
	at org.apache.phoenix.end2end.SortOrderIT.runQuery(SortOrderIT.java:603)
	at org.apache.phoenix.end2end.SortOrderIT.runQueryTest(SortOrderIT.java:552)
	at org.apache.phoenix.end2end.SortOrderIT.descVarLengthDescPKGT(SortOrderIT.java:383)

descVarLengthDescPKLTE(org.apache.phoenix.end2end.SortOrderIT)  Time elapsed: 0.508 sec  <<<
FAILURE!
org.junit.internal.ArrayComparisonFailure: Unexpected result for query SELECT k1 FROM DescColumnSortOrderTest
WHERE k2 <= 'bb': arrays first differed at element [0]; expected:<2> but was:<3>
	at org.junit.Assert.fail(Assert.java:88)
	at org.junit.Assert.failNotEquals(Assert.java:834)
	at org.junit.Assert.assertEquals(Assert.java:118)
	at org.junit.Assert.assertEquals(Assert.java:144)
	at org.junit.internal.ExactComparisonCriteria.assertElementsEqual(ExactComparisonCriteria.java:8)
	at org.junit.internal.ComparisonCriteria.arrayEquals(ComparisonCriteria.java:53)
	at org.junit.Assert.internalArrayEquals(Assert.java:532)
	at org.junit.Assert.assertArrayEquals(Assert.java:283)
	at org.apache.phoenix.end2end.SortOrderIT.runQuery(SortOrderIT.java:603)
	at org.apache.phoenix.end2end.SortOrderIT.runQueryTest(SortOrderIT.java:552)
	at org.apache.phoenix.end2end.SortOrderIT.descVarLengthDescPKLTE(SortOrderIT.java:392)

testSkipScanCompare(org.apache.phoenix.end2end.SortOrderIT)  Time elapsed: 2.31 sec  <<<
FAILURE!
java.lang.AssertionError: t_null_DECIMAL_DESC
	at org.junit.Assert.fail(Assert.java:88)
	at org.junit.Assert.assertTrue(Assert.java:41)
	at org.apache.phoenix.end2end.SortOrderIT.testCompareCompositeKey(SortOrderIT.java:482)
	at org.apache.phoenix.end2end.SortOrderIT.testSkipScanCompare(SortOrderIT.java:456)

descVarLengthAscPKLTE(org.apache.phoenix.end2end.SortOrderIT)  Time elapsed: 0.515 sec  <<<
FAILURE!
org.junit.internal.ArrayComparisonFailure: Unexpected result for query SELECT k1 FROM DescColumnSortOrderTest
WHERE 'bb' <= k2: arrays first differed at element [0]; expected:<1> but was:<4>
	at org.junit.Assert.fail(Assert.java:88)
	at org.junit.Assert.failNotEquals(Assert.java:834)
	at org.junit.Assert.assertEquals(Assert.java:118)
	at org.junit.Assert.assertEquals(Assert.java:144)
	at org.junit.internal.ExactComparisonCriteria.assertElementsEqual(ExactComparisonCriteria.java:8)
	at org.junit.internal.ComparisonCriteria.arrayEquals(ComparisonCriteria.java:53)
	at org.junit.Assert.internalArrayEquals(Assert.java:532)
	at org.junit.Assert.assertArrayEquals(Assert.java:283)
	at org.apache.phoenix.end2end.SortOrderIT.runQuery(SortOrderIT.java:603)
	at org.apache.phoenix.end2end.SortOrderIT.runQueryTest(SortOrderIT.java:552)
	at org.apache.phoenix.end2end.SortOrderIT.descVarLengthAscPKLTE(SortOrderIT.java:401)

testNonPKCompare(org.apache.phoenix.end2end.SortOrderIT)  Time elapsed: 0.923 sec  <<<
FAILURE!
java.lang.AssertionError: t_null_DECIMAL_DESC expected:<2> but was:<3>
	at org.junit.Assert.fail(Assert.java:88)
	at org.junit.Assert.failNotEquals(Assert.java:834)
	at org.junit.Assert.assertEquals(Assert.java:645)
	at org.apache.phoenix.end2end.SortOrderIT.testCompareCompositeKey(SortOrderIT.java:483)
	at org.apache.phoenix.end2end.SortOrderIT.testNonPKCompare(SortOrderIT.java:440)

Running org.apache.phoenix.end2end.LikeExpressionIT
Tests run: 1, Failures: 0, Errors: 0, Skipped: 0, Time elapsed: 8.462 sec - in org.apache.phoenix.end2end.MappingTableDataTypeIT
Running org.apache.phoenix.end2end.UpsertSelectAutoCommitIT
Tests run: 2, Failures: 0, Errors: 0, Skipped: 0, Time elapsed: 4.541 sec - in org.apache.phoenix.end2end.LikeExpressionIT
Running org.apache.phoenix.end2end.IsNullIT
Tests run: 3, Failures: 0, Errors: 0, Skipped: 0, Time elapsed: 5.646 sec - in org.apache.phoenix.end2end.IsNullIT
Running org.apache.phoenix.end2end.BinaryRowKeyIT
Tests run: 3, Failures: 0, Errors: 0, Skipped: 0, Time elapsed: 12.491 sec - in org.apache.phoenix.end2end.UpsertSelectAutoCommitIT
Running org.apache.phoenix.end2end.RegexpReplaceFunctionIT
Tests run: 3, Failures: 0, Errors: 0, Skipped: 0, Time elapsed: 3.752 sec - in org.apache.phoenix.end2end.BinaryRowKeyIT
Running org.apache.phoenix.end2end.salted.SaltedTableUpsertSelectIT
Tests run: 2, Failures: 0, Errors: 0, Skipped: 0, Time elapsed: 2.759 sec - in org.apache.phoenix.end2end.RegexpReplaceFunctionIT
Running org.apache.phoenix.end2end.salted.SaltedTableVarLengthRowKeyIT
Tests run: 1, Failures: 0, Errors: 0, Skipped: 0, Time elapsed: 2.676 sec - in org.apache.phoenix.end2end.salted.SaltedTableVarLengthRowKeyIT
Running org.apache.phoenix.end2end.HashJoinIT
Tests run: 5, Failures: 0, Errors: 0, Skipped: 0, Time elapsed: 11.269 sec - in org.apache.phoenix.end2end.salted.SaltedTableUpsertSelectIT
Running org.apache.phoenix.end2end.MD5FunctionIT
Tests run: 108, Failures: 0, Errors: 0, Skipped: 0, Time elapsed: 112.382 sec - in org.apache.phoenix.end2end.SortMergeJoinIT
Running org.apache.phoenix.end2end.DateTimeIT
Tests run: 3, Failures: 0, Errors: 0, Skipped: 0, Time elapsed: 5.615 sec - in org.apache.phoenix.end2end.MD5FunctionIT
Running org.apache.phoenix.end2end.TenantSpecificViewIndexIT
Tests run: 19, Failures: 0, Errors: 0, Skipped: 0, Time elapsed: 9.382 sec - in org.apache.phoenix.end2end.DateTimeIT
Running org.apache.phoenix.end2end.AlterSessionIT
Tests run: 2, Failures: 0, Errors: 0, Skipped: 0, Time elapsed: 2.522 sec - in org.apache.phoenix.end2end.AlterSessionIT
Running org.apache.phoenix.end2end.PhoenixRuntimeIT
Tests run: 8, Failures: 0, Errors: 0, Skipped: 0, Time elapsed: 18.488 sec - in org.apache.phoenix.end2end.TenantSpecificViewIndexIT
Running org.apache.phoenix.end2end.DecodeFunctionIT
Tests run: 2, Failures: 0, Errors: 0, Skipped: 0, Time elapsed: 12.793 sec - in org.apache.phoenix.end2end.PhoenixRuntimeIT
Running org.apache.phoenix.end2end.UpgradeIT
Tests run: 6, Failures: 0, Errors: 0, Skipped: 0, Time elapsed: 5.309 sec - in org.apache.phoenix.end2end.DecodeFunctionIT
Running org.apache.phoenix.end2end.ServerExceptionIT
Tests run: 1, Failures: 0, Errors: 0, Skipped: 0, Time elapsed: 2.204 sec - in org.apache.phoenix.end2end.ServerExceptionIT
Running org.apache.phoenix.end2end.RegexpSplitFunctionIT
Tests run: 108, Failures: 0, Errors: 0, Skipped: 0, Time elapsed: 114.264 sec - in org.apache.phoenix.end2end.SpooledSortMergeJoinIT
Running org.apache.phoenix.end2end.ExecuteStatementsIT
Tests run: 11, Failures: 0, Errors: 0, Skipped: 0, Time elapsed: 7.939 sec - in org.apache.phoenix.end2end.RegexpSplitFunctionIT
Running org.apache.phoenix.end2end.SkipScanAfterManualSplitIT
Tests run: 2, Failures: 0, Errors: 0, Skipped: 0, Time elapsed: 14.533 sec - in org.apache.phoenix.end2end.ExecuteStatementsIT
Running org.apache.phoenix.end2end.ConvertTimezoneFunctionIT
Tests run: 7, Failures: 0, Errors: 0, Skipped: 0, Time elapsed: 3.086 sec - in org.apache.phoenix.end2end.ConvertTimezoneFunctionIT
Running org.apache.phoenix.end2end.RTrimFunctionIT
Tests run: 2, Failures: 0, Errors: 0, Skipped: 0, Time elapsed: 2.048 sec - in org.apache.phoenix.end2end.RTrimFunctionIT
Running org.apache.phoenix.end2end.SignFunctionEnd2EndIT
Tests run: 6, Failures: 0, Errors: 0, Skipped: 0, Time elapsed: 36.11 sec - in org.apache.phoenix.end2end.UpgradeIT
Running org.apache.phoenix.end2end.SkipScanQueryIT
Tests run: 2, Failures: 0, Errors: 0, Skipped: 0, Time elapsed: 4.234 sec - in org.apache.phoenix.end2end.SignFunctionEnd2EndIT
Running org.apache.phoenix.end2end.ExpFunctionEnd2EndIT
Tests run: 28, Failures: 0, Errors: 0, Skipped: 0, Time elapsed: 124.974 sec - in org.apache.phoenix.end2end.InListIT
Running org.apache.phoenix.end2end.ArrayAppendFunctionIT
Tests run: 3, Failures: 0, Errors: 0, Skipped: 0, Time elapsed: 26.98 sec - in org.apache.phoenix.end2end.SkipScanAfterManualSplitIT
Running org.apache.phoenix.end2end.TenantIdTypeIT
Tests run: 3, Failures: 0, Errors: 0, Skipped: 0, Time elapsed: 6.933 sec - in org.apache.phoenix.end2end.ExpFunctionEnd2EndIT
Running org.apache.phoenix.end2end.LpadFunctionIT
Tests run: 9, Failures: 0, Errors: 0, Skipped: 0, Time elapsed: 12.979 sec - in org.apache.phoenix.end2end.SkipScanQueryIT
Tests run: 12, Failures: 0, Errors: 0, Skipped: 0, Time elapsed: 11.883 sec - in org.apache.phoenix.end2end.LpadFunctionIT
Tests run: 34, Failures: 0, Errors: 0, Skipped: 0, Time elapsed: 24.354 sec - in org.apache.phoenix.end2end.ArrayAppendFunctionIT
Tests run: 15, Failures: 0, Errors: 0, Skipped: 0, Time elapsed: 69.998 sec - in org.apache.phoenix.end2end.TenantIdTypeIT
Tests run: 108, Failures: 0, Errors: 0, Skipped: 0, Time elapsed: 295.367 sec - in org.apache.phoenix.end2end.HashJoinIT

Results :

Failed tests: 
  SortOrderIT.descVarLengthAscPKLTE:401->runQueryTest:552->runQuery:603 Unexpected result
for query SELECT k1 FROM DescColumnSortOrderTest WHERE 'bb' <= k2: arrays first differed
at element [0]; expected:<1> but was:<4>
  SortOrderIT.descVarLengthDescPKGT:383->runQueryTest:552->runQuery:603 Unexpected result
for query SELECT k1 FROM DescColumnSortOrderTest WHERE k2 > 'b': arrays first differed
at element [0]; expected:<3> but was:<5>
  SortOrderIT.descVarLengthDescPKLTE:392->runQueryTest:552->runQuery:603 Unexpected
result for query SELECT k1 FROM DescColumnSortOrderTest WHERE k2 <= 'bb': arrays first
differed at element [0]; expected:<2> but was:<3>
  SortOrderIT.testNonPKCompare:440->testCompareCompositeKey:483 t_null_DECIMAL_DESC expected:<2>
but was:<3>
  SortOrderIT.testSkipScanCompare:456->testCompareCompositeKey:482 t_null_DECIMAL_DESC



Tests run: 1165, Failures: 5, Errors: 0, Skipped: 0

[INFO] 
[INFO] --- maven-failsafe-plugin:2.18:integration-test (NeedTheirOwnClusterTests) @ phoenix-core
---
[INFO] Failsafe report directory: <https://builds.apache.org/job/Phoenix-4.x-HBase-1.0/ws/phoenix-core/target/failsafe-reports>
[INFO] parallel='none', perCoreThreadCount=true, threadCount=0, useUnlimitedThreads=false,
threadCountSuites=0, threadCountClasses=0, threadCountMethods=0, parallelOptimized=true

-------------------------------------------------------
 T E S T S
-------------------------------------------------------
Running org.apache.hadoop.hbase.regionserver.wal.WALReplayWithIndexWritesAndUncompressedWALInHBase_094_9_IT
Running org.apache.hadoop.hbase.regionserver.wal.WALReplayWithIndexWritesAndCompressedWALIT
Running org.apache.phoenix.hbase.index.balancer.IndexLoadBalancerIT
Tests run: 1, Failures: 0, Errors: 0, Skipped: 0, Time elapsed: 19.211 sec - in org.apache.hadoop.hbase.regionserver.wal.WALReplayWithIndexWritesAndUncompressedWALInHBase_094_9_IT
Running org.apache.phoenix.hbase.index.FailForUnsupportedHBaseVersionsIT
Running org.apache.phoenix.rpc.PhoenixClientRpcIT
Running org.apache.phoenix.rpc.PhoenixServerRpcIT
Tests run: 1, Failures: 0, Errors: 0, Skipped: 0, Time elapsed: 28.195 sec - in org.apache.hadoop.hbase.regionserver.wal.WALReplayWithIndexWritesAndCompressedWALIT
Tests run: 2, Failures: 0, Errors: 0, Skipped: 0, Time elapsed: 7.88 sec - in org.apache.phoenix.rpc.PhoenixClientRpcIT
Running org.apache.phoenix.hbase.index.covered.example.EndToEndCoveredIndexingIT
Running org.apache.phoenix.hbase.index.covered.EndToEndCoveredColumnsIndexBuilderIT
Tests run: 2, Failures: 0, Errors: 0, Skipped: 0, Time elapsed: 16.844 sec - in org.apache.phoenix.hbase.index.FailForUnsupportedHBaseVersionsIT
Tests run: 2, Failures: 0, Errors: 0, Skipped: 0, Time elapsed: 17.751 sec - in org.apache.phoenix.rpc.PhoenixServerRpcIT
Running org.apache.phoenix.hbase.index.covered.example.FailWithoutRetriesIT
Running org.apache.phoenix.hbase.index.covered.example.EndtoEndIndexingWithCompressionIT
Tests run: 2, Failures: 0, Errors: 0, Skipped: 0, Time elapsed: 9.935 sec - in org.apache.phoenix.hbase.index.covered.EndToEndCoveredColumnsIndexBuilderIT
Tests run: 1, Failures: 0, Errors: 0, Skipped: 0, Time elapsed: 9.213 sec - in org.apache.phoenix.hbase.index.covered.example.FailWithoutRetriesIT
Running org.apache.phoenix.monitoring.PhoenixMetricsIT
Running org.apache.phoenix.iterate.RoundRobinResultIteratorWithStatsIT
Tests run: 11, Failures: 0, Errors: 0, Skipped: 0, Time elapsed: 49.538 sec - in org.apache.phoenix.hbase.index.covered.example.EndToEndCoveredIndexingIT
Tests run: 1, Failures: 0, Errors: 0, Skipped: 0, Time elapsed: 15.876 sec - in org.apache.phoenix.iterate.RoundRobinResultIteratorWithStatsIT
Tests run: 11, Failures: 0, Errors: 0, Skipped: 0, Time elapsed: 49.908 sec - in org.apache.phoenix.hbase.index.covered.example.EndtoEndIndexingWithCompressionIT
Running org.apache.phoenix.end2end.TenantSpecificTablesDMLIT
Tests run: 9, Failures: 0, Errors: 0, Skipped: 0, Time elapsed: 92.739 sec - in org.apache.phoenix.hbase.index.balancer.IndexLoadBalancerIT
Running org.apache.phoenix.end2end.index.MutableIndexFailureIT
Tests run: 17, Failures: 0, Errors: 0, Skipped: 0, Time elapsed: 39.341 sec - in org.apache.phoenix.monitoring.PhoenixMetricsIT
Running org.apache.phoenix.end2end.ViewIT
Running org.apache.phoenix.end2end.TenantSpecificTablesDDLIT
Running org.apache.phoenix.end2end.index.MutableIndexReplicationIT
Tests run: 1, Failures: 0, Errors: 0, Skipped: 0, Time elapsed: 17.799 sec - in org.apache.phoenix.end2end.index.MutableIndexReplicationIT
Tests run: 16, Failures: 0, Errors: 0, Skipped: 0, Time elapsed: 41.327 sec - in org.apache.phoenix.end2end.TenantSpecificTablesDMLIT
Tests run: 17, Failures: 0, Errors: 0, Skipped: 0, Time elapsed: 31.091 sec - in org.apache.phoenix.end2end.TenantSpecificTablesDDLIT
Running org.apache.phoenix.end2end.UnionAllIT
Running org.apache.phoenix.end2end.index.ImmutableIndexWithStatsIT
Running org.apache.phoenix.end2end.StatsCollectorIT
Tests run: 22, Failures: 0, Errors: 0, Skipped: 0, Time elapsed: 47.854 sec - in org.apache.phoenix.end2end.ViewIT
Tests run: 1, Failures: 0, Errors: 0, Skipped: 0, Time elapsed: 11.074 sec - in org.apache.phoenix.end2end.index.ImmutableIndexWithStatsIT
Tests run: 11, Failures: 0, Errors: 0, Skipped: 0, Time elapsed: 21.908 sec - in org.apache.phoenix.end2end.UnionAllIT
Running org.apache.phoenix.end2end.KeyOnlyIT
Running org.apache.phoenix.end2end.UserDefinedFunctionsIT
Running org.apache.phoenix.end2end.ContextClassloaderIT
Tests run: 13, Failures: 0, Errors: 0, Skipped: 0, Time elapsed: 9.678 sec - in org.apache.phoenix.end2end.UserDefinedFunctionsIT
Tests run: 3, Failures: 0, Errors: 0, Skipped: 0, Time elapsed: 17.926 sec - in org.apache.phoenix.end2end.KeyOnlyIT
Tests run: 3, Failures: 0, Errors: 0, Skipped: 0, Time elapsed: 10.171 sec - in org.apache.phoenix.end2end.ContextClassloaderIT
Tests run: 4, Failures: 0, Errors: 0, Skipped: 0, Time elapsed: 51.973 sec - in org.apache.phoenix.end2end.StatsCollectorIT
Running org.apache.phoenix.end2end.MultiCfQueryExecIT
Running org.apache.phoenix.end2end.QueryWithLimitIT
Running org.apache.phoenix.end2end.QueryTimeoutIT
Running org.apache.phoenix.end2end.ParallelIteratorsIT
Tests run: 2, Failures: 0, Errors: 0, Skipped: 0, Time elapsed: 12.664 sec - in org.apache.phoenix.end2end.QueryWithLimitIT
Tests run: 7, Failures: 0, Errors: 0, Skipped: 0, Time elapsed: 20.318 sec - in org.apache.phoenix.end2end.MultiCfQueryExecIT
Tests run: 1, Failures: 0, Errors: 0, Skipped: 0, Time elapsed: 18.15 sec - in org.apache.phoenix.end2end.QueryTimeoutIT
Running org.apache.phoenix.end2end.SaltedViewIT
Tests run: 2, Failures: 0, Errors: 0, Skipped: 0, Time elapsed: 21.248 sec - in org.apache.phoenix.end2end.ParallelIteratorsIT
Running org.apache.phoenix.end2end.SpillableGroupByIT
Tests run: 2, Failures: 0, Errors: 0, Skipped: 0, Time elapsed: 12.234 sec - in org.apache.phoenix.end2end.SaltedViewIT
Running org.apache.phoenix.end2end.StatsCollectorWithSplitsAndMultiCFIT
Running org.apache.phoenix.end2end.AlterTableIT
Tests run: 1, Failures: 0, Errors: 0, Skipped: 0, Time elapsed: 9.503 sec - in org.apache.phoenix.end2end.SpillableGroupByIT
Tests run: 3, Failures: 0, Errors: 0, Skipped: 0, Time elapsed: 151.212 sec - in org.apache.phoenix.end2end.index.MutableIndexFailureIT
Running org.apache.phoenix.end2end.CountDistinctCompressionIT
Tests run: 1, Failures: 0, Errors: 0, Skipped: 0, Time elapsed: 11.412 sec - in org.apache.phoenix.end2end.CountDistinctCompressionIT
Tests run: 2, Failures: 0, Errors: 0, Skipped: 0, Time elapsed: 27.962 sec - in org.apache.phoenix.end2end.StatsCollectorWithSplitsAndMultiCFIT
Running org.apache.phoenix.mapreduce.IndexToolIT
Running org.apache.phoenix.execute.PartialCommitIT
Tests run: 6, Failures: 0, Errors: 0, Skipped: 0, Time elapsed: 5.48 sec - in org.apache.phoenix.execute.PartialCommitIT
Running org.apache.phoenix.mapreduce.CsvBulkLoadToolIT
Tests run: 51, Failures: 0, Errors: 0, Skipped: 0, Time elapsed: 313.24 sec - in org.apache.phoenix.end2end.AlterTableIT
Tests run: 6, Failures: 0, Errors: 0, Skipped: 0, Time elapsed: 293.086 sec - in org.apache.phoenix.mapreduce.CsvBulkLoadToolIT
Tests run: 9, Failures: 0, Errors: 0, Skipped: 0, Time elapsed: 336.054 sec - in org.apache.phoenix.mapreduce.IndexToolIT

Results :




Tests run: 244, Failures: 0, Errors: 0, Skipped: 0

[INFO] 
[INFO] --- maven-failsafe-plugin:2.18:verify (ClientManagedTimeTests) @ phoenix-core ---
[INFO] Failsafe report directory: <https://builds.apache.org/job/Phoenix-4.x-HBase-1.0/ws/phoenix-core/target/failsafe-reports>
[INFO] ------------------------------------------------------------------------
[INFO] Reactor Summary:
[INFO] 
[INFO] Apache Phoenix .................................... SUCCESS [3.914s]
[INFO] Phoenix Core ...................................... FAILURE [28:32.779s]
[INFO] Phoenix - Flume ................................... SKIPPED
[INFO] Phoenix - Pig ..................................... SKIPPED
[INFO] Phoenix Query Server Client ....................... SKIPPED
[INFO] Phoenix Query Server .............................. SKIPPED
[INFO] Phoenix - Pherf ................................... SKIPPED
[INFO] Phoenix - Spark ................................... SKIPPED
[INFO] Phoenix Assembly .................................. SKIPPED
[INFO] ------------------------------------------------------------------------
[INFO] BUILD FAILURE
[INFO] ------------------------------------------------------------------------
[INFO] Total time: 28:37.257s
[INFO] Finished at: Wed Sep 09 23:07:50 UTC 2015
[INFO] Final Memory: 56M/975M
[INFO] ------------------------------------------------------------------------
[ERROR] Failed to execute goal org.apache.maven.plugins:maven-failsafe-plugin:2.18:verify
(ClientManagedTimeTests) on project phoenix-core: There are test failures.
[ERROR] 
[ERROR] Please refer to <https://builds.apache.org/job/Phoenix-4.x-HBase-1.0/ws/phoenix-core/target/failsafe-reports>
for the individual test results.
[ERROR] -> [Help 1]
[ERROR] 
[ERROR] To see the full stack trace of the errors, re-run Maven with the -e switch.
[ERROR] Re-run Maven using the -X switch to enable full debug logging.
[ERROR] 
[ERROR] For more information about the errors and possible solutions, please read the following
articles:
[ERROR] [Help 1] http://cwiki.apache.org/confluence/display/MAVEN/MojoFailureException
[ERROR] 
[ERROR] After correcting the problems, you can resume the build with the command
[ERROR]   mvn <goals> -rf :phoenix-core
Build step 'Invoke top-level Maven targets' marked build as failure
Archiving artifacts
Sending artifact delta relative to Phoenix-4.x-HBase-1.0 #159
Archived 1324 artifacts
Archive block size is 32768
Received 23270 blocks and 583366549 bytes
Compression is 56.7%
Took 3 min 10 sec
Recording test results

Mime
View raw message