phoenix-commits mailing list archives

Site index · List index
Message view « Date » · « Thread »
Top « Date » · « Thread »
From Apache Jenkins Server <jenk...@builds.apache.org>
Subject Build failed in Jenkins: Phoenix-4.x-HBase-1.0 #141
Date Thu, 13 Aug 2015 20:03:03 GMT
See <https://builds.apache.org/job/Phoenix-4.x-HBase-1.0/141/changes>

Changes:

[mujtaba] PHOENIX-2165 Make zip file name and directory consistent for phoenix-*-cluster.zip
(gliptak)

------------------------------------------
[...truncated 116562 lines...]
[ERROR] PhoenixMetaFactory.java[2] (header) Header: Line does not match expected header line
of ' * Licensed to the Apache Software Foundation (ASF) under one or more'.
[WARNING] checkstyle:check violations detected but failOnViolation set to false
[INFO] 
[INFO] --- build-helper-maven-plugin:1.9.1:add-test-source (add-test-source) @ phoenix-server
---
[INFO] Test Source directory: <https://builds.apache.org/job/Phoenix-4.x-HBase-1.0/ws/phoenix-server/src/it/java>
added.
[INFO] 
[INFO] --- build-helper-maven-plugin:1.9.1:add-test-resource (add-test-resource) @ phoenix-server
---
[INFO] 
[INFO] --- maven-remote-resources-plugin:1.5:process (default) @ phoenix-server ---
[INFO] 
[INFO] --- maven-resources-plugin:2.6:resources (default-resources) @ phoenix-server ---
[INFO] Using 'UTF-8' encoding to copy filtered resources.
[INFO] skip non existing resourceDirectory <https://builds.apache.org/job/Phoenix-4.x-HBase-1.0/ws/phoenix-server/src/main/resources>
[INFO] Copying 3 resources
[INFO] 
[INFO] --- maven-compiler-plugin:3.0:compile (default-compile) @ phoenix-server ---
[INFO] Changes detected - recompiling the module!
[INFO] Compiling 3 source files to <https://builds.apache.org/job/Phoenix-4.x-HBase-1.0/ws/phoenix-server/target/classes>
[INFO] 
[INFO] --- maven-resources-plugin:2.6:testResources (default-testResources) @ phoenix-server
---
[INFO] Using 'UTF-8' encoding to copy filtered resources.
[INFO] skip non existing resourceDirectory <https://builds.apache.org/job/Phoenix-4.x-HBase-1.0/ws/phoenix-server/src/test/resources>
[INFO] Copying 1 resource
[INFO] Copying 3 resources
[INFO] 
[INFO] --- maven-compiler-plugin:3.0:testCompile (default-testCompile) @ phoenix-server ---
[INFO] Changes detected - recompiling the module!
[INFO] Compiling 3 source files to <https://builds.apache.org/job/Phoenix-4.x-HBase-1.0/ws/phoenix-server/target/test-classes>
[INFO] 
[INFO] --- maven-surefire-plugin:2.18:test (default-test) @ phoenix-server ---
[INFO] Surefire report directory: <https://builds.apache.org/job/Phoenix-4.x-HBase-1.0/ws/phoenix-server/target/surefire-reports>

-------------------------------------------------------
 T E S T S
-------------------------------------------------------
Running org.apache.phoenix.DriverCohabitationTest
Tests run: 1, Failures: 0, Errors: 0, Skipped: 0, Time elapsed: 0.187 sec - in org.apache.phoenix.DriverCohabitationTest

Results :




Tests run: 1, Failures: 0, Errors: 0, Skipped: 0

[INFO] 
[INFO] --- maven-source-plugin:2.2.1:jar-no-fork (attach-sources) @ phoenix-server ---
[INFO] Building jar: <https://builds.apache.org/job/Phoenix-4.x-HBase-1.0/141/artifact/phoenix-server/target/phoenix-server-4.6.0-HBase-1.0-SNAPSHOT-sources.jar>
[INFO] 
[INFO] --- maven-jar-plugin:2.4:test-jar (default) @ phoenix-server ---
[INFO] Building jar: <https://builds.apache.org/job/Phoenix-4.x-HBase-1.0/141/artifact/phoenix-server/target/phoenix-server-4.6.0-HBase-1.0-SNAPSHOT-tests.jar>
[INFO] 
[INFO] --- maven-jar-plugin:2.4:jar (default-jar) @ phoenix-server ---
[INFO] Building jar: <https://builds.apache.org/job/Phoenix-4.x-HBase-1.0/141/artifact/phoenix-server/target/phoenix-server-4.6.0-HBase-1.0-SNAPSHOT.jar>
[INFO] 
[INFO] --- maven-site-plugin:3.2:attach-descriptor (attach-descriptor) @ phoenix-server ---
[INFO] 
[INFO] --- maven-assembly-plugin:2.5.2:single (runnable) @ phoenix-server ---
[INFO] Reading assembly descriptor: src/build/query-server-runnable.xml
[INFO] Building jar: <https://builds.apache.org/job/Phoenix-4.x-HBase-1.0/141/artifact/phoenix-server/target/phoenix-server-4.6.0-HBase-1.0-SNAPSHOT-runnable.jar>
[INFO] 
[INFO] --- maven-failsafe-plugin:2.18:integration-test (ClientManagedTimeTests) @ phoenix-server
---
[INFO] Failsafe report directory: <https://builds.apache.org/job/Phoenix-4.x-HBase-1.0/ws/phoenix-server/target/failsafe-reports>
[INFO] parallel='none', perCoreThreadCount=true, threadCount=0, useUnlimitedThreads=false,
threadCountSuites=0, threadCountClasses=0, threadCountMethods=0, parallelOptimized=true

-------------------------------------------------------
 T E S T S
-------------------------------------------------------

Results :




Tests run: 0, Failures: 0, Errors: 0, Skipped: 0

[INFO] 
[INFO] --- maven-failsafe-plugin:2.18:integration-test (HBaseManagedTimeTests) @ phoenix-server
---
[INFO] Failsafe report directory: <https://builds.apache.org/job/Phoenix-4.x-HBase-1.0/ws/phoenix-server/target/failsafe-reports>
[INFO] parallel='none', perCoreThreadCount=true, threadCount=0, useUnlimitedThreads=false,
threadCountSuites=0, threadCountClasses=0, threadCountMethods=0, parallelOptimized=true

-------------------------------------------------------
 T E S T S
-------------------------------------------------------
Running org.apache.phoenix.end2end.QueryServerBasicsIT
Tests run: 1, Failures: 0, Errors: 1, Skipped: 0, Time elapsed: 0.007 sec <<< FAILURE!
- in org.apache.phoenix.end2end.QueryServerBasicsIT
org.apache.phoenix.end2end.QueryServerBasicsIT  Time elapsed: 0.007 sec  <<< ERROR!
java.lang.NoClassDefFoundError: org/apache/htrace/Sampler
	at org.apache.phoenix.trace.util.Tracing$Frequency.<clinit>(Tracing.java:72)
	at org.apache.phoenix.query.QueryServicesOptions.<clinit>(QueryServicesOptions.java:161)
	at org.apache.phoenix.query.QueryServicesTestImpl.getDefaultServicesOptions(QueryServicesTestImpl.java:70)
	at org.apache.phoenix.query.QueryServicesTestImpl.<init>(QueryServicesTestImpl.java:96)
	at org.apache.phoenix.jdbc.PhoenixTestDriver.<init>(PhoenixTestDriver.java:64)
	at org.apache.phoenix.jdbc.PhoenixTestDriver.<init>(PhoenixTestDriver.java:58)
	at org.apache.phoenix.query.BaseTest.setDefaultTestConfig(BaseTest.java:625)
	at org.apache.phoenix.query.BaseTest.setUpConfigForMiniCluster(BaseTest.java:647)
	at org.apache.phoenix.query.BaseTest.initMiniCluster(BaseTest.java:576)
	at org.apache.phoenix.query.BaseTest.setUpTestCluster(BaseTest.java:509)
	at org.apache.phoenix.query.BaseTest.checkClusterInitialized(BaseTest.java:496)
	at org.apache.phoenix.query.BaseTest.setUpTestDriver(BaseTest.java:553)
	at org.apache.phoenix.query.BaseTest.setUpTestDriver(BaseTest.java:549)
	at org.apache.phoenix.end2end.BaseHBaseManagedTimeIT.doSetup(BaseHBaseManagedTimeIT.java:54)
	at sun.reflect.NativeMethodAccessorImpl.invoke0(Native Method)
	at sun.reflect.NativeMethodAccessorImpl.invoke(NativeMethodAccessorImpl.java:57)
	at sun.reflect.DelegatingMethodAccessorImpl.invoke(DelegatingMethodAccessorImpl.java:43)
	at java.lang.reflect.Method.invoke(Method.java:606)
	at org.junit.runners.model.FrameworkMethod$1.runReflectiveCall(FrameworkMethod.java:50)
	at org.junit.internal.runners.model.ReflectiveCallable.run(ReflectiveCallable.java:12)
	at org.junit.runners.model.FrameworkMethod.invokeExplosively(FrameworkMethod.java:47)
	at org.junit.internal.runners.statements.RunBefores.evaluate(RunBefores.java:24)
	at org.junit.internal.runners.statements.RunAfters.evaluate(RunAfters.java:27)
	at org.junit.runners.ParentRunner.run(ParentRunner.java:363)
	at org.junit.runners.Suite.runChild(Suite.java:128)
	at org.junit.runners.Suite.runChild(Suite.java:27)
	at org.junit.runners.ParentRunner$3.run(ParentRunner.java:290)
	at org.junit.runners.ParentRunner$1.schedule(ParentRunner.java:71)
	at org.junit.runners.ParentRunner.runChildren(ParentRunner.java:288)
	at org.junit.runners.ParentRunner.access$000(ParentRunner.java:58)
	at org.junit.runners.ParentRunner$2.evaluate(ParentRunner.java:268)
	at org.junit.runners.ParentRunner.run(ParentRunner.java:363)
	at org.junit.runner.JUnitCore.run(JUnitCore.java:137)
	at org.junit.runner.JUnitCore.run(JUnitCore.java:115)
	at org.apache.maven.surefire.junitcore.JUnitCoreWrapper.createRequestAndRun(JUnitCoreWrapper.java:107)
	at org.apache.maven.surefire.junitcore.JUnitCoreWrapper.executeLazy(JUnitCoreWrapper.java:88)
	at org.apache.maven.surefire.junitcore.JUnitCoreWrapper.execute(JUnitCoreWrapper.java:57)
	at org.apache.maven.surefire.junitcore.JUnitCoreProvider.invoke(JUnitCoreProvider.java:144)
	at org.apache.maven.surefire.booter.ForkedBooter.invokeProviderInSameClassLoader(ForkedBooter.java:203)
	at org.apache.maven.surefire.booter.ForkedBooter.runSuitesInProcess(ForkedBooter.java:155)
	at org.apache.maven.surefire.booter.ForkedBooter.main(ForkedBooter.java:103)
Caused by: java.lang.ClassNotFoundException: org.apache.htrace.Sampler
	at java.net.URLClassLoader$1.run(URLClassLoader.java:366)
	at java.net.URLClassLoader$1.run(URLClassLoader.java:355)
	at java.security.AccessController.doPrivileged(Native Method)
	at java.net.URLClassLoader.findClass(URLClassLoader.java:354)
	at java.lang.ClassLoader.loadClass(ClassLoader.java:424)
	at sun.misc.Launcher$AppClassLoader.loadClass(Launcher.java:308)
	at java.lang.ClassLoader.loadClass(ClassLoader.java:357)
	at org.apache.phoenix.trace.util.Tracing$Frequency.<clinit>(Tracing.java:72)
	at org.apache.phoenix.query.QueryServicesOptions.<clinit>(QueryServicesOptions.java:161)
	at org.apache.phoenix.query.QueryServicesTestImpl.getDefaultServicesOptions(QueryServicesTestImpl.java:70)
	at org.apache.phoenix.query.QueryServicesTestImpl.<init>(QueryServicesTestImpl.java:96)
	at org.apache.phoenix.jdbc.PhoenixTestDriver.<init>(PhoenixTestDriver.java:64)
	at org.apache.phoenix.jdbc.PhoenixTestDriver.<init>(PhoenixTestDriver.java:58)
	at org.apache.phoenix.query.BaseTest.setDefaultTestConfig(BaseTest.java:625)
	at org.apache.phoenix.query.BaseTest.setUpConfigForMiniCluster(BaseTest.java:647)
	at org.apache.phoenix.query.BaseTest.initMiniCluster(BaseTest.java:576)
	at org.apache.phoenix.query.BaseTest.setUpTestCluster(BaseTest.java:509)
	at org.apache.phoenix.query.BaseTest.checkClusterInitialized(BaseTest.java:496)
	at org.apache.phoenix.query.BaseTest.setUpTestDriver(BaseTest.java:553)
	at org.apache.phoenix.query.BaseTest.setUpTestDriver(BaseTest.java:549)
	at org.apache.phoenix.end2end.BaseHBaseManagedTimeIT.doSetup(BaseHBaseManagedTimeIT.java:54)
	at sun.reflect.NativeMethodAccessorImpl.invoke0(Native Method)
	at sun.reflect.NativeMethodAccessorImpl.invoke(NativeMethodAccessorImpl.java:57)
	at sun.reflect.DelegatingMethodAccessorImpl.invoke(DelegatingMethodAccessorImpl.java:43)
	at java.lang.reflect.Method.invoke(Method.java:606)
	at org.junit.runners.model.FrameworkMethod$1.runReflectiveCall(FrameworkMethod.java:50)
	at org.junit.internal.runners.model.ReflectiveCallable.run(ReflectiveCallable.java:12)
	at org.junit.runners.model.FrameworkMethod.invokeExplosively(FrameworkMethod.java:47)
	at org.junit.internal.runners.statements.RunBefores.evaluate(RunBefores.java:24)
	at org.junit.internal.runners.statements.RunAfters.evaluate(RunAfters.java:27)
	at org.junit.runners.ParentRunner.run(ParentRunner.java:363)
	at org.junit.runners.Suite.runChild(Suite.java:128)
	at org.junit.runners.Suite.runChild(Suite.java:27)
	at org.junit.runners.ParentRunner$3.run(ParentRunner.java:290)
	at org.junit.runners.ParentRunner$1.schedule(ParentRunner.java:71)
	at org.junit.runners.ParentRunner.runChildren(ParentRunner.java:288)
	at org.junit.runners.ParentRunner.access$000(ParentRunner.java:58)
	at org.junit.runners.ParentRunner$2.evaluate(ParentRunner.java:268)
	at org.junit.runners.ParentRunner.run(ParentRunner.java:363)
	at org.junit.runner.JUnitCore.run(JUnitCore.java:137)
	at org.junit.runner.JUnitCore.run(JUnitCore.java:115)
	at org.apache.maven.surefire.junitcore.JUnitCoreWrapper.createRequestAndRun(JUnitCoreWrapper.java:107)
	at org.apache.maven.surefire.junitcore.JUnitCoreWrapper.executeLazy(JUnitCoreWrapper.java:88)
	at org.apache.maven.surefire.junitcore.JUnitCoreWrapper.execute(JUnitCoreWrapper.java:57)
	at org.apache.maven.surefire.junitcore.JUnitCoreProvider.invoke(JUnitCoreProvider.java:144)
	at org.apache.maven.surefire.booter.ForkedBooter.invokeProviderInSameClassLoader(ForkedBooter.java:203)
	at org.apache.maven.surefire.booter.ForkedBooter.runSuitesInProcess(ForkedBooter.java:155)
	at org.apache.maven.surefire.booter.ForkedBooter.main(ForkedBooter.java:103)


Results :


Tests in error: 
  QueryServerBasicsIT>BaseHBaseManagedTimeIT.doSetup:54->BaseTest.setUpTestDriver:549->BaseTest.setUpTestDriver:553->BaseTest.checkClusterInitialized:496->BaseTest.setUpTestCluster:509->BaseTest.initMiniCluster:576->BaseTest.setUpConfigForMiniCluster:647->BaseTest.setDefaultTestConfig:625
ยป NoClassDefFound


Tests run: 1, Failures: 0, Errors: 1, Skipped: 0

[INFO] 
[INFO] --- maven-failsafe-plugin:2.18:integration-test (NeedTheirOwnClusterTests) @ phoenix-server
---
[INFO] Failsafe report directory: <https://builds.apache.org/job/Phoenix-4.x-HBase-1.0/ws/phoenix-server/target/failsafe-reports>
[INFO] parallel='none', perCoreThreadCount=true, threadCount=0, useUnlimitedThreads=false,
threadCountSuites=0, threadCountClasses=0, threadCountMethods=0, parallelOptimized=true

-------------------------------------------------------
 T E S T S
-------------------------------------------------------

Results :




Tests run: 0, Failures: 0, Errors: 0, Skipped: 0

[INFO] 
[INFO] --- maven-failsafe-plugin:2.18:verify (ClientManagedTimeTests) @ phoenix-server ---
[INFO] Failsafe report directory: <https://builds.apache.org/job/Phoenix-4.x-HBase-1.0/ws/phoenix-server/target/failsafe-reports>
[INFO] ------------------------------------------------------------------------
[INFO] Reactor Summary:
[INFO] 
[INFO] Apache Phoenix .................................... SUCCESS [3.884s]
[INFO] Phoenix Core ...................................... SUCCESS [1:48:23.818s]
[INFO] Phoenix - Flume ................................... SUCCESS [1:01.359s]
[INFO] Phoenix - Pig ..................................... SUCCESS [1:05.320s]
[INFO] Phoenix Query Server Client ....................... SUCCESS [1.634s]
[INFO] Phoenix Query Server .............................. FAILURE [22.079s]
[INFO] Phoenix - Pherf ................................... SKIPPED
[INFO] Phoenix - Spark ................................... SKIPPED
[INFO] Phoenix Assembly .................................. SKIPPED
[INFO] ------------------------------------------------------------------------
[INFO] BUILD FAILURE
[INFO] ------------------------------------------------------------------------
[INFO] Total time: 1:50:58.672s
[INFO] Finished at: Thu Aug 13 19:54:14 UTC 2015
[INFO] Final Memory: 67M/1152M
[INFO] ------------------------------------------------------------------------
[ERROR] Failed to execute goal org.apache.maven.plugins:maven-failsafe-plugin:2.18:verify
(ClientManagedTimeTests) on project phoenix-server: There are test failures.
[ERROR] 
[ERROR] Please refer to <https://builds.apache.org/job/Phoenix-4.x-HBase-1.0/ws/phoenix-server/target/failsafe-reports>
for the individual test results.
[ERROR] -> [Help 1]
[ERROR] 
[ERROR] To see the full stack trace of the errors, re-run Maven with the -e switch.
[ERROR] Re-run Maven using the -X switch to enable full debug logging.
[ERROR] 
[ERROR] For more information about the errors and possible solutions, please read the following
articles:
[ERROR] [Help 1] http://cwiki.apache.org/confluence/display/MAVEN/MojoFailureException
[ERROR] 
[ERROR] After correcting the problems, you can resume the build with the command
[ERROR]   mvn <goals> -rf :phoenix-server
Build step 'Invoke top-level Maven targets' marked build as failure
Archiving artifacts
Sending artifact delta relative to Phoenix-4.x-HBase-1.0 #140
Archived 1210 artifacts
Archive block size is 32768
Received 18842 blocks and 559081817 bytes
Compression is 52.5%
Took 3 min 42 sec
Recording test results

Mime
View raw message