phoenix-commits mailing list archives

Site index · List index
Message view « Date » · « Thread »
Top « Date » · « Thread »
From Apache Jenkins Server <jenk...@builds.apache.org>
Subject Build failed in Jenkins: Phoenix | Master #816
Date Tue, 07 Jul 2015 20:55:48 GMT
See <https://builds.apache.org/job/Phoenix-master/816/changes>

Changes:

[tdsilva] PHOENIX-2025 Phoenix-core's hbase-default.xml prevents HBaseTestingUtility from
starting up in client apps (Mujtaba Chohan)

------------------------------------------
[...truncated 119567 lines...]
Running org.apache.phoenix.expression.PowerFunctionTest
Tests run: 3, Failures: 0, Errors: 0, Skipped: 0, Time elapsed: 0.349 sec - in org.apache.phoenix.compile.ViewCompilerTest
Running org.apache.phoenix.compile.WhereCompilerTest
Tests run: 1, Failures: 0, Errors: 0, Skipped: 0, Time elapsed: 0.019 sec - in org.apache.phoenix.expression.PowerFunctionTest
Running org.apache.phoenix.expression.DeterminismTest
Tests run: 1, Failures: 0, Errors: 0, Skipped: 0, Time elapsed: 0 sec - in org.apache.phoenix.expression.DeterminismTest
Running org.apache.phoenix.expression.RoundFloorCeilExpressionsTest
Tests run: 37, Failures: 0, Errors: 0, Skipped: 0, Time elapsed: 0.771 sec - in org.apache.phoenix.compile.QueryOptimizerTest
Running org.apache.phoenix.compile.ScanRangesTest
Tests run: 34, Failures: 0, Errors: 0, Skipped: 0, Time elapsed: 0.02 sec - in org.apache.phoenix.compile.ScanRangesTest
Running org.apache.phoenix.compile.HavingCompilerTest
Tests run: 43, Failures: 0, Errors: 0, Skipped: 1, Time elapsed: 0.465 sec - in org.apache.phoenix.compile.WhereCompilerTest
Running org.apache.phoenix.compile.QueryCompilerTest
Tests run: 11, Failures: 0, Errors: 0, Skipped: 0, Time elapsed: 0.097 sec - in org.apache.phoenix.compile.HavingCompilerTest
Running org.apache.phoenix.index.IndexMaintainerTest
Tests run: 21, Failures: 0, Errors: 0, Skipped: 0, Time elapsed: 0.498 sec - in org.apache.phoenix.expression.RoundFloorCeilExpressionsTest
Running org.apache.phoenix.expression.CbrtFunctionTest
Tests run: 1, Failures: 0, Errors: 0, Skipped: 0, Time elapsed: 0.006 sec - in org.apache.phoenix.expression.CbrtFunctionTest
Running org.apache.phoenix.expression.SqrtFunctionTest
Tests run: 1, Failures: 0, Errors: 0, Skipped: 0, Time elapsed: 0.007 sec - in org.apache.phoenix.expression.SqrtFunctionTest
Running org.apache.phoenix.expression.RegexpReplaceFunctionTest
Tests run: 1, Failures: 0, Errors: 0, Skipped: 0, Time elapsed: 0.116 sec - in org.apache.phoenix.expression.RegexpReplaceFunctionTest
Running org.apache.phoenix.expression.function.ExternalSqlTypeIdFunctionTest
Tests run: 3, Failures: 0, Errors: 0, Skipped: 0, Time elapsed: 0.001 sec - in org.apache.phoenix.expression.function.ExternalSqlTypeIdFunctionTest
Running org.apache.phoenix.expression.SortOrderExpressionTest
Tests run: 24, Failures: 0, Errors: 0, Skipped: 0, Time elapsed: 0.038 sec - in org.apache.phoenix.expression.SortOrderExpressionTest
Running org.apache.phoenix.jdbc.PhoenixResultSetMetadataTest
Tests run: 1, Failures: 0, Errors: 0, Skipped: 0, Time elapsed: 0.099 sec - in org.apache.phoenix.jdbc.PhoenixResultSetMetadataTest
Running org.apache.phoenix.iterate.MergeSortResultIteratorTest
Tests run: 1, Failures: 0, Errors: 0, Skipped: 0, Time elapsed: 0.005 sec - in org.apache.phoenix.iterate.MergeSortResultIteratorTest
Running org.apache.phoenix.query.KeyRangeCoalesceTest
Tests run: 13, Failures: 0, Errors: 0, Skipped: 0, Time elapsed: 0.019 sec - in org.apache.phoenix.query.KeyRangeCoalesceTest
Running org.apache.phoenix.query.QueryPlanTest
Tests run: 23, Failures: 0, Errors: 0, Skipped: 0, Time elapsed: 0.395 sec - in org.apache.phoenix.index.IndexMaintainerTest
Running org.apache.phoenix.hbase.index.covered.TestLocalTableState
Tests run: 3, Failures: 0, Errors: 0, Skipped: 0, Time elapsed: 0.316 sec - in org.apache.phoenix.query.QueryPlanTest
Running org.apache.phoenix.query.HBaseFactoryProviderTest
Tests run: 3, Failures: 0, Errors: 0, Skipped: 0, Time elapsed: 0.002 sec - in org.apache.phoenix.query.HBaseFactoryProviderTest
Running org.apache.phoenix.mapreduce.CsvBulkImportUtilTest
Tests run: 2, Failures: 0, Errors: 0, Skipped: 0, Time elapsed: 0.051 sec - in org.apache.phoenix.mapreduce.CsvBulkImportUtilTest
Running org.apache.phoenix.filter.SkipScanBigFilterTest
Tests run: 3, Failures: 0, Errors: 0, Skipped: 0, Time elapsed: 0.309 sec - in org.apache.phoenix.hbase.index.covered.TestLocalTableState
Running org.apache.phoenix.hbase.index.covered.example.TestColumnTracker
Tests run: 3, Failures: 0, Errors: 0, Skipped: 0, Time elapsed: 0.001 sec - in org.apache.phoenix.hbase.index.covered.example.TestColumnTracker
Running org.apache.phoenix.hbase.index.covered.TestCoveredColumns
Tests run: 1, Failures: 0, Errors: 0, Skipped: 0, Time elapsed: 0 sec - in org.apache.phoenix.hbase.index.covered.TestCoveredColumns
Running org.apache.phoenix.hbase.index.covered.filter.TestApplyAndFilterDeletesFilter
Tests run: 6, Failures: 0, Errors: 0, Skipped: 0, Time elapsed: 0.002 sec - in org.apache.phoenix.hbase.index.covered.filter.TestApplyAndFilterDeletesFilter
Running org.apache.phoenix.hbase.index.write.recovery.TestPerRegionIndexWriteCache
Tests run: 106, Failures: 0, Errors: 0, Skipped: 0, Time elapsed: 0.784 sec - in org.apache.phoenix.compile.QueryCompilerTest
Running org.apache.phoenix.hbase.index.covered.data.TestIndexMemStore
Tests run: 2, Failures: 0, Errors: 0, Skipped: 0, Time elapsed: 0.006 sec - in org.apache.phoenix.hbase.index.covered.data.TestIndexMemStore
Running org.apache.phoenix.hbase.index.covered.filter.TestNewerTimestampFilter
Tests run: 1, Failures: 0, Errors: 0, Skipped: 0, Time elapsed: 0.001 sec - in org.apache.phoenix.hbase.index.covered.filter.TestNewerTimestampFilter
Running org.apache.phoenix.hbase.index.write.TestCachingHTableFactory
Tests run: 1, Failures: 0, Errors: 0, Skipped: 0, Time elapsed: 0.037 sec - in org.apache.phoenix.hbase.index.write.TestCachingHTableFactory
Running org.apache.phoenix.hbase.index.write.TestParalleIndexWriter
Tests run: 2, Failures: 0, Errors: 0, Skipped: 0, Time elapsed: 0.043 sec - in org.apache.phoenix.hbase.index.write.TestParalleIndexWriter
Running org.apache.phoenix.hbase.index.parallel.TestThreadPoolManager
Tests run: 3, Failures: 0, Errors: 0, Skipped: 0, Time elapsed: 0.006 sec - in org.apache.phoenix.hbase.index.parallel.TestThreadPoolManager
Running org.apache.phoenix.cache.JodaTimezoneCacheTest
Tests run: 4, Failures: 0, Errors: 0, Skipped: 0, Time elapsed: 0.04 sec - in org.apache.phoenix.cache.JodaTimezoneCacheTest
Running org.apache.phoenix.expression.ArrayAppendFunctionTest
Tests run: 22, Failures: 0, Errors: 0, Skipped: 0, Time elapsed: 0.381 sec - in org.apache.phoenix.expression.ArrayAppendFunctionTest
Running org.apache.phoenix.expression.AbsFunctionTest
Tests run: 1, Failures: 0, Errors: 0, Skipped: 0, Time elapsed: 0.011 sec - in org.apache.phoenix.expression.AbsFunctionTest
Running org.apache.phoenix.expression.LikeExpressionTest
Tests run: 3, Failures: 0, Errors: 0, Skipped: 0, Time elapsed: 0.725 sec - in org.apache.phoenix.hbase.index.write.recovery.TestPerRegionIndexWriteCache
Running org.apache.phoenix.hbase.index.write.TestWALRecoveryCaching
Tests run: 1, Failures: 0, Errors: 0, Skipped: 1, Time elapsed: 0.001 sec - in org.apache.phoenix.hbase.index.write.TestWALRecoveryCaching
Running org.apache.phoenix.execute.MutationStateTest
Tests run: 1, Failures: 0, Errors: 0, Skipped: 0, Time elapsed: 0 sec - in org.apache.phoenix.execute.MutationStateTest
Running org.apache.phoenix.expression.util.regex.PatternPerformanceTest
Tests run: 1, Failures: 0, Errors: 0, Skipped: 0, Time elapsed: 0 sec - in org.apache.phoenix.expression.util.regex.PatternPerformanceTest
Running org.apache.phoenix.expression.ExpFunctionTest
Tests run: 4, Failures: 0, Errors: 0, Skipped: 0, Time elapsed: 0.141 sec - in org.apache.phoenix.expression.LikeExpressionTest
Running org.apache.phoenix.expression.RegexpSplitFunctionTest
Tests run: 1, Failures: 0, Errors: 0, Skipped: 0, Time elapsed: 0.008 sec - in org.apache.phoenix.expression.ExpFunctionTest
Running org.apache.phoenix.expression.ArithmeticOperationTest
Tests run: 1, Failures: 0, Errors: 0, Skipped: 0, Time elapsed: 0.012 sec - in org.apache.phoenix.expression.RegexpSplitFunctionTest
Running org.apache.phoenix.expression.ILikeExpressionTest
Tests run: 6, Failures: 0, Errors: 0, Skipped: 0, Time elapsed: 0.009 sec - in org.apache.phoenix.expression.ArithmeticOperationTest
Running org.apache.phoenix.expression.SignFunctionTest
Tests run: 3, Failures: 0, Errors: 0, Skipped: 0, Time elapsed: 0.01 sec - in org.apache.phoenix.expression.ILikeExpressionTest
Running org.apache.phoenix.expression.ArrayFillFunctionTest
Tests run: 1, Failures: 0, Errors: 0, Skipped: 0, Time elapsed: 0.011 sec - in org.apache.phoenix.expression.SignFunctionTest
Running org.apache.phoenix.expression.ArrayPrependFunctionTest
Tests run: 14, Failures: 0, Errors: 0, Skipped: 0, Time elapsed: 0.01 sec - in org.apache.phoenix.expression.ArrayFillFunctionTest
Running org.apache.phoenix.expression.function.InstrFunctionTest
Tests run: 1, Failures: 0, Errors: 0, Skipped: 0, Time elapsed: 0.001 sec - in org.apache.phoenix.expression.function.InstrFunctionTest
Running org.apache.phoenix.memory.MemoryManagerTest
Tests run: 34, Failures: 0, Errors: 0, Skipped: 0, Time elapsed: 0.21 sec - in org.apache.phoenix.expression.ArrayPrependFunctionTest
Running org.apache.phoenix.expression.CoerceExpressionTest
Tests run: 5, Failures: 0, Errors: 0, Skipped: 0, Time elapsed: 0.002 sec - in org.apache.phoenix.expression.CoerceExpressionTest
Running org.apache.phoenix.expression.ColumnExpressionTest
Tests run: 4, Failures: 0, Errors: 0, Skipped: 0, Time elapsed: 0.001 sec - in org.apache.phoenix.expression.ColumnExpressionTest
Running org.apache.phoenix.expression.RegexpSubstrFunctionTest
Tests run: 2, Failures: 0, Errors: 0, Skipped: 0, Time elapsed: 1.11 sec - in org.apache.phoenix.filter.SkipScanBigFilterTest
Tests run: 1, Failures: 0, Errors: 0, Skipped: 0, Time elapsed: 0.139 sec - in org.apache.phoenix.expression.RegexpSubstrFunctionTest
Running org.apache.phoenix.expression.LnLogFunctionTest
Tests run: 1, Failures: 0, Errors: 0, Skipped: 0, Time elapsed: 0.012 sec - in org.apache.phoenix.expression.LnLogFunctionTest
Running org.apache.phoenix.jdbc.PhoenixDriverTest
Tests run: 3, Failures: 0, Errors: 0, Skipped: 0, Time elapsed: 0.161 sec - in org.apache.phoenix.jdbc.PhoenixDriverTest
Running org.apache.phoenix.jdbc.PhoenixEmbeddedDriverTest
Tests run: 3, Failures: 0, Errors: 0, Skipped: 0, Time elapsed: 0.001 sec - in org.apache.phoenix.jdbc.PhoenixEmbeddedDriverTest
Running org.apache.phoenix.iterate.AggregateResultScannerTest
Tests run: 1, Failures: 0, Errors: 0, Skipped: 0, Time elapsed: 0.068 sec - in org.apache.phoenix.iterate.AggregateResultScannerTest
Running org.apache.phoenix.iterate.SpoolingResultIteratorTest
Tests run: 3, Failures: 0, Errors: 0, Skipped: 0, Time elapsed: 0.009 sec - in org.apache.phoenix.iterate.SpoolingResultIteratorTest
Running org.apache.phoenix.query.ConnectionlessTest
Tests run: 3, Failures: 0, Errors: 0, Skipped: 0, Time elapsed: 0.093 sec - in org.apache.phoenix.query.ConnectionlessTest
Running org.apache.phoenix.query.KeyRangeIntersectTest
Tests run: 8, Failures: 0, Errors: 0, Skipped: 0, Time elapsed: 0.008 sec - in org.apache.phoenix.query.KeyRangeIntersectTest
Running org.apache.phoenix.mapreduce.util.ColumnInfoToStringEncoderDecoderTest
Tests run: 3, Failures: 0, Errors: 0, Skipped: 0, Time elapsed: 0.003 sec - in org.apache.phoenix.mapreduce.util.ColumnInfoToStringEncoderDecoderTest
Running org.apache.phoenix.mapreduce.CsvToKeyValueMapperTest
Tests run: 7, Failures: 0, Errors: 0, Skipped: 0, Time elapsed: 0.085 sec - in org.apache.phoenix.mapreduce.CsvToKeyValueMapperTest
Running org.apache.phoenix.filter.SkipScanFilterIntersectTest
Tests run: 19, Failures: 0, Errors: 0, Skipped: 0, Time elapsed: 0.034 sec - in org.apache.phoenix.filter.SkipScanFilterIntersectTest
Running org.apache.hadoop.hbase.regionserver.PhoenixRpcSchedulerFactoryTest
Tests run: 2, Failures: 0, Errors: 0, Skipped: 0, Time elapsed: 0.011 sec - in org.apache.hadoop.hbase.regionserver.PhoenixRpcSchedulerFactoryTest
Tests run: 5, Failures: 0, Errors: 0, Skipped: 1, Time elapsed: 6.01 sec - in org.apache.phoenix.memory.MemoryManagerTest
Running org.apache.phoenix.jdbc.PhoenixPreparedStatementTest
Tests run: 3, Failures: 0, Errors: 0, Skipped: 0, Time elapsed: 0.084 sec - in org.apache.phoenix.jdbc.PhoenixPreparedStatementTest
Running org.apache.phoenix.iterate.ConcatResultIteratorTest
Tests run: 2, Failures: 0, Errors: 0, Skipped: 0, Time elapsed: 0.003 sec - in org.apache.phoenix.iterate.ConcatResultIteratorTest
Running org.apache.phoenix.query.KeyRangeUnionTest
Tests run: 8, Failures: 0, Errors: 0, Skipped: 0, Time elapsed: 0.011 sec - in org.apache.phoenix.query.KeyRangeUnionTest
Running org.apache.phoenix.query.ParallelIteratorsSplitTest
Tests run: 8, Failures: 0, Errors: 0, Skipped: 0, Time elapsed: 0.157 sec - in org.apache.phoenix.query.ParallelIteratorsSplitTest
Running org.apache.phoenix.mapreduce.util.PhoenixConfigurationUtilTest
Tests run: 7, Failures: 0, Errors: 5, Skipped: 0, Time elapsed: 0.387 sec <<< FAILURE!
- in org.apache.phoenix.mapreduce.util.PhoenixConfigurationUtilTest
testSelectStatementForSpecificColumns(org.apache.phoenix.mapreduce.util.PhoenixConfigurationUtilTest)
 Time elapsed: 0.029 sec  <<< ERROR!
java.lang.NumberFormatException: null
	at java.lang.Integer.parseInt(Integer.java:454)
	at java.lang.Integer.parseInt(Integer.java:527)
	at org.apache.phoenix.mapreduce.util.PhoenixConfigurationUtil.getClientPort(PhoenixConfigurationUtil.java:376)
	at org.apache.phoenix.mapreduce.util.ConnectionUtil.getInputConnection(ConnectionUtil.java:57)
	at org.apache.phoenix.mapreduce.util.ConnectionUtil.getInputConnection(ConnectionUtil.java:45)
	at org.apache.phoenix.mapreduce.util.PhoenixConfigurationUtil.getSelectColumnMetadataList(PhoenixConfigurationUtil.java:263)
	at org.apache.phoenix.mapreduce.util.PhoenixConfigurationUtil.getSelectStatement(PhoenixConfigurationUtil.java:295)
	at org.apache.phoenix.mapreduce.util.PhoenixConfigurationUtilTest.testSelectStatementForSpecificColumns(PhoenixConfigurationUtilTest.java:118)

testSelectStatementWithSchema(org.apache.phoenix.mapreduce.util.PhoenixConfigurationUtilTest)
 Time elapsed: 0.005 sec  <<< ERROR!
java.lang.NumberFormatException: null
	at java.lang.Integer.parseInt(Integer.java:454)
	at java.lang.Integer.parseInt(Integer.java:527)
	at org.apache.phoenix.mapreduce.util.PhoenixConfigurationUtil.getClientPort(PhoenixConfigurationUtil.java:376)
	at org.apache.phoenix.mapreduce.util.ConnectionUtil.getInputConnection(ConnectionUtil.java:57)
	at org.apache.phoenix.mapreduce.util.ConnectionUtil.getInputConnection(ConnectionUtil.java:45)
	at org.apache.phoenix.mapreduce.util.PhoenixConfigurationUtil.getSelectColumnMetadataList(PhoenixConfigurationUtil.java:263)
	at org.apache.phoenix.mapreduce.util.PhoenixConfigurationUtil.getSelectStatement(PhoenixConfigurationUtil.java:295)
	at org.apache.phoenix.mapreduce.util.PhoenixConfigurationUtilTest.testSelectStatementWithSchema(PhoenixConfigurationUtilTest.java:97)

testSelectStatementForArrayTypes(org.apache.phoenix.mapreduce.util.PhoenixConfigurationUtilTest)
 Time elapsed: 0.007 sec  <<< ERROR!
java.lang.NumberFormatException: null
	at java.lang.Integer.parseInt(Integer.java:454)
	at java.lang.Integer.parseInt(Integer.java:527)
	at org.apache.phoenix.mapreduce.util.PhoenixConfigurationUtil.getClientPort(PhoenixConfigurationUtil.java:376)
	at org.apache.phoenix.mapreduce.util.ConnectionUtil.getInputConnection(ConnectionUtil.java:57)
	at org.apache.phoenix.mapreduce.util.ConnectionUtil.getInputConnection(ConnectionUtil.java:45)
	at org.apache.phoenix.mapreduce.util.PhoenixConfigurationUtil.getSelectColumnMetadataList(PhoenixConfigurationUtil.java:263)
	at org.apache.phoenix.mapreduce.util.PhoenixConfigurationUtil.getSelectStatement(PhoenixConfigurationUtil.java:295)
	at org.apache.phoenix.mapreduce.util.PhoenixConfigurationUtilTest.testSelectStatementForArrayTypes(PhoenixConfigurationUtilTest.java:139)

testUpsertStatement(org.apache.phoenix.mapreduce.util.PhoenixConfigurationUtilTest)  Time
elapsed: 0.016 sec  <<< ERROR!
java.lang.NumberFormatException: null
	at java.lang.Integer.parseInt(Integer.java:454)
	at java.lang.Integer.parseInt(Integer.java:527)
	at org.apache.phoenix.mapreduce.util.PhoenixConfigurationUtil.getClientPort(PhoenixConfigurationUtil.java:376)
	at org.apache.phoenix.mapreduce.util.ConnectionUtil.getOutputConnection(ConnectionUtil.java:80)
	at org.apache.phoenix.mapreduce.util.ConnectionUtil.getOutputConnection(ConnectionUtil.java:68)
	at org.apache.phoenix.mapreduce.util.PhoenixConfigurationUtil.getUpsertColumnMetadataList(PhoenixConfigurationUtil.java:213)
	at org.apache.phoenix.mapreduce.util.PhoenixConfigurationUtil.getUpsertStatement(PhoenixConfigurationUtil.java:240)
	at org.apache.phoenix.mapreduce.util.PhoenixConfigurationUtilTest.testUpsertStatement(PhoenixConfigurationUtilTest.java:55)

testSelectStatement(org.apache.phoenix.mapreduce.util.PhoenixConfigurationUtilTest)  Time
elapsed: 0.012 sec  <<< ERROR!
java.lang.NumberFormatException: null
	at java.lang.Integer.parseInt(Integer.java:454)
	at java.lang.Integer.parseInt(Integer.java:527)
	at org.apache.phoenix.mapreduce.util.PhoenixConfigurationUtil.getClientPort(PhoenixConfigurationUtil.java:376)
	at org.apache.phoenix.mapreduce.util.ConnectionUtil.getInputConnection(ConnectionUtil.java:57)
	at org.apache.phoenix.mapreduce.util.ConnectionUtil.getInputConnection(ConnectionUtil.java:45)
	at org.apache.phoenix.mapreduce.util.PhoenixConfigurationUtil.getSelectColumnMetadataList(PhoenixConfigurationUtil.java:263)
	at org.apache.phoenix.mapreduce.util.PhoenixConfigurationUtil.getSelectStatement(PhoenixConfigurationUtil.java:295)
	at org.apache.phoenix.mapreduce.util.PhoenixConfigurationUtilTest.testSelectStatement(PhoenixConfigurationUtilTest.java:75)

Running org.apache.phoenix.mapreduce.CsvBulkLoadToolTest
Tests run: 6, Failures: 0, Errors: 0, Skipped: 0, Time elapsed: 0.003 sec - in org.apache.phoenix.mapreduce.CsvBulkLoadToolTest
Running org.apache.phoenix.filter.SkipScanFilterTest
Tests run: 13, Failures: 0, Errors: 0, Skipped: 0, Time elapsed: 0.016 sec - in org.apache.phoenix.filter.SkipScanFilterTest
Running org.apache.hadoop.hbase.ipc.PhoenixIndexRpcSchedulerTest
Tests run: 2, Failures: 0, Errors: 0, Skipped: 0, Time elapsed: 0.149 sec - in org.apache.hadoop.hbase.ipc.PhoenixIndexRpcSchedulerTest

Results :


Tests in error: 
  PhoenixConfigurationUtilTest.testSelectStatement:75 » NumberFormat null
  PhoenixConfigurationUtilTest.testSelectStatementForArrayTypes:139 » NumberFormat
  PhoenixConfigurationUtilTest.testSelectStatementForSpecificColumns:118 » NumberFormat
  PhoenixConfigurationUtilTest.testSelectStatementWithSchema:97 » NumberFormat n...
  PhoenixConfigurationUtilTest.testUpsertStatement:55 » NumberFormat null


Tests run: 1130, Failures: 0, Errors: 5, Skipped: 3

[INFO] ------------------------------------------------------------------------
[INFO] Reactor Summary:
[INFO] 
[INFO] Apache Phoenix .................................... SUCCESS [3.630s]
[INFO] Phoenix Core ...................................... FAILURE [1:36.573s]
[INFO] Phoenix - Flume ................................... SKIPPED
[INFO] Phoenix - Pig ..................................... SKIPPED
[INFO] Phoenix Query Server Client ....................... SKIPPED
[INFO] Phoenix Query Server .............................. SKIPPED
[INFO] Phoenix - Pherf ................................... SKIPPED
[INFO] Phoenix - Spark ................................... SKIPPED
[INFO] Phoenix Assembly .................................. SKIPPED
[INFO] ------------------------------------------------------------------------
[INFO] BUILD FAILURE
[INFO] ------------------------------------------------------------------------
[INFO] Total time: 1:40.992s
[INFO] Finished at: Tue Jul 07 20:55:05 UTC 2015
[INFO] Final Memory: 68M/1147M
[INFO] ------------------------------------------------------------------------
[ERROR] Failed to execute goal org.apache.maven.plugins:maven-surefire-plugin:2.18:test (default-test)
on project phoenix-core: There are test failures.
[ERROR] 
[ERROR] Please refer to <https://builds.apache.org/job/Phoenix-master/ws/phoenix-core/target/surefire-reports>
for the individual test results.
[ERROR] -> [Help 1]
[ERROR] 
[ERROR] To see the full stack trace of the errors, re-run Maven with the -e switch.
[ERROR] Re-run Maven using the -X switch to enable full debug logging.
[ERROR] 
[ERROR] For more information about the errors and possible solutions, please read the following
articles:
[ERROR] [Help 1] http://cwiki.apache.org/confluence/display/MAVEN/MojoFailureException
[ERROR] 
[ERROR] After correcting the problems, you can resume the build with the command
[ERROR]   mvn <goals> -rf :phoenix-core
Build step 'Invoke top-level Maven targets' marked build as failure
Archiving artifacts
Sending artifact delta relative to Phoenix | Master #790
Archived 430 artifacts
Archive block size is 32768
Received 5438 blocks and 48412146 bytes
Compression is 78.6%
Took 44 sec
Updating PHOENIX-2025
Recording test results

Mime
View raw message