phoenix-commits mailing list archives

Site index · List index
Message view « Date » · « Thread »
Top « Date » · « Thread »
From Apache Jenkins Server <jenk...@builds.apache.org>
Subject Build failed in Jenkins: Phoenix | Master #852
Date Wed, 22 Jul 2015 19:45:18 GMT
See <https://builds.apache.org/job/Phoenix-master/852/changes>

Changes:

[samarth.jain] PHOENIX-2110 Primary key changes should be pushed to diverged views

------------------------------------------
[...truncated 118973 lines...]
Running org.apache.phoenix.end2end.HashJoinLocalIndexIT
Tests run: 31, Failures: 0, Errors: 0, Skipped: 0, Time elapsed: 25.322 sec - in org.apache.phoenix.end2end.RoundFloorCeilFunctionsEnd2EndIT
Running org.apache.phoenix.end2end.SubqueryIT
Tests run: 16, Failures: 0, Errors: 0, Skipped: 0, Time elapsed: 85.563 sec - in org.apache.phoenix.end2end.ArraysWithNullsIT
Running org.apache.phoenix.end2end.UpsertBigValuesIT
Tests run: 1, Failures: 0, Errors: 0, Skipped: 0, Time elapsed: 33.744 sec - in org.apache.phoenix.end2end.HashJoinLocalIndexIT
Running org.apache.phoenix.end2end.TenantSpecificViewIndexSaltedIT
Tests run: 15, Failures: 0, Errors: 0, Skipped: 0, Time elapsed: 70.962 sec - in org.apache.phoenix.end2end.SubqueryUsingSortMergeJoinIT
Running org.apache.phoenix.end2end.AbsFunctionEnd2EndIT
Tests run: 1, Failures: 0, Errors: 0, Skipped: 0, Time elapsed: 5.028 sec - in org.apache.phoenix.end2end.AbsFunctionEnd2EndIT
Running org.apache.phoenix.end2end.ToDateFunctionIT
Tests run: 4, Failures: 0, Errors: 0, Skipped: 0, Time elapsed: 22.041 sec - in org.apache.phoenix.end2end.UpsertBigValuesIT
Tests run: 4, Failures: 0, Errors: 0, Skipped: 0, Time elapsed: 17.73 sec - in org.apache.phoenix.end2end.TenantSpecificViewIndexSaltedIT
Running org.apache.phoenix.end2end.CSVCommonsLoaderIT
Running org.apache.phoenix.end2end.DynamicFamilyIT
Tests run: 11, Failures: 0, Errors: 0, Skipped: 0, Time elapsed: 11.092 sec - in org.apache.phoenix.end2end.ToDateFunctionIT
Running org.apache.phoenix.end2end.SortMergeJoinIT
Tests run: 58, Failures: 0, Errors: 0, Skipped: 0, Time elapsed: 228.683 sec - in org.apache.phoenix.end2end.index.IndexExpressionIT
Running org.apache.phoenix.end2end.ReadOnlyIT
Tests run: 4, Failures: 0, Errors: 0, Skipped: 0, Time elapsed: 13.025 sec - in org.apache.phoenix.end2end.DynamicFamilyIT
Running org.apache.phoenix.end2end.FirstValueFunctionIT
Tests run: 7, Failures: 0, Errors: 0, Skipped: 0, Time elapsed: 8.673 sec - in org.apache.phoenix.end2end.FirstValueFunctionIT
Running org.apache.phoenix.end2end.CoalesceFunctionIT
Tests run: 1, Failures: 0, Errors: 0, Skipped: 0, Time elapsed: 12.929 sec - in org.apache.phoenix.end2end.ReadOnlyIT
Running org.apache.phoenix.end2end.DisableLocalIndexIT
Tests run: 1, Failures: 0, Errors: 0, Skipped: 0, Time elapsed: 10.322 sec - in org.apache.phoenix.end2end.DisableLocalIndexIT
Running org.apache.phoenix.end2end.TimezoneOffsetFunctionIT
Tests run: 15, Failures: 0, Errors: 0, Skipped: 0, Time elapsed: 36.542 sec - in org.apache.phoenix.end2end.CSVCommonsLoaderIT
Running org.apache.phoenix.end2end.RegexpSubstrFunctionIT
Tests run: 2, Failures: 0, Errors: 0, Skipped: 0, Time elapsed: 5.429 sec - in org.apache.phoenix.end2end.RegexpSubstrFunctionIT
Running org.apache.phoenix.end2end.CbrtFunctionEnd2EndIT
Tests run: 10, Failures: 0, Errors: 0, Skipped: 0, Time elapsed: 21.162 sec - in org.apache.phoenix.end2end.CoalesceFunctionIT
Running org.apache.phoenix.end2end.StoreNullsIT
Tests run: 7, Failures: 0, Errors: 0, Skipped: 0, Time elapsed: 13.197 sec - in org.apache.phoenix.end2end.TimezoneOffsetFunctionIT
Running org.apache.phoenix.end2end.SpooledSortMergeJoinIT
Tests run: 2, Failures: 0, Errors: 0, Skipped: 0, Time elapsed: 10.093 sec - in org.apache.phoenix.end2end.CbrtFunctionEnd2EndIT
Running org.apache.phoenix.end2end.SortOrderIT
Tests run: 36, Failures: 0, Errors: 0, Skipped: 0, Time elapsed: 10.555 sec - in org.apache.phoenix.end2end.SortOrderIT
Running org.apache.phoenix.end2end.InListIT
Tests run: 3, Failures: 0, Errors: 0, Skipped: 0, Time elapsed: 29.728 sec - in org.apache.phoenix.end2end.StoreNullsIT
Running org.apache.phoenix.end2end.ReverseScanIT
Tests run: 3, Failures: 0, Errors: 0, Skipped: 0, Time elapsed: 12.379 sec - in org.apache.phoenix.end2end.ReverseScanIT
Running org.apache.phoenix.end2end.NthValueFunctionIT
Tests run: 21, Failures: 0, Errors: 0, Skipped: 0, Time elapsed: 123.482 sec - in org.apache.phoenix.end2end.SubqueryIT
Running org.apache.phoenix.end2end.MappingTableDataTypeIT
Tests run: 1, Failures: 0, Errors: 0, Skipped: 0, Time elapsed: 11.681 sec - in org.apache.phoenix.end2end.MappingTableDataTypeIT
Running org.apache.phoenix.end2end.LikeExpressionIT
Tests run: 11, Failures: 0, Errors: 0, Skipped: 0, Time elapsed: 15.98 sec - in org.apache.phoenix.end2end.NthValueFunctionIT
Running org.apache.phoenix.end2end.UpsertSelectAutoCommitIT
Tests run: 1, Failures: 0, Errors: 0, Skipped: 0, Time elapsed: 5.439 sec - in org.apache.phoenix.end2end.LikeExpressionIT
Running org.apache.phoenix.end2end.IsNullIT
Tests run: 3, Failures: 0, Errors: 0, Skipped: 0, Time elapsed: 12.181 sec - in org.apache.phoenix.end2end.IsNullIT
Running org.apache.phoenix.end2end.BinaryRowKeyIT
Tests run: 3, Failures: 0, Errors: 0, Skipped: 0, Time elapsed: 6.39 sec - in org.apache.phoenix.end2end.BinaryRowKeyIT
Running org.apache.phoenix.end2end.RegexpReplaceFunctionIT
Tests run: 3, Failures: 0, Errors: 0, Skipped: 0, Time elapsed: 28.04 sec - in org.apache.phoenix.end2end.UpsertSelectAutoCommitIT
Running org.apache.phoenix.end2end.salted.SaltedTableUpsertSelectIT
Tests run: 2, Failures: 0, Errors: 0, Skipped: 0, Time elapsed: 6.896 sec - in org.apache.phoenix.end2end.RegexpReplaceFunctionIT
Running org.apache.phoenix.end2end.salted.SaltedTableVarLengthRowKeyIT
Tests run: 1, Failures: 0, Errors: 0, Skipped: 0, Time elapsed: 6.432 sec - in org.apache.phoenix.end2end.salted.SaltedTableVarLengthRowKeyIT
Running org.apache.phoenix.end2end.HashJoinIT
Tests run: 5, Failures: 0, Errors: 0, Skipped: 0, Time elapsed: 21.182 sec - in org.apache.phoenix.end2end.salted.SaltedTableUpsertSelectIT
Running org.apache.phoenix.end2end.MD5FunctionIT
Tests run: 28, Failures: 0, Errors: 0, Skipped: 0, Time elapsed: 93.797 sec - in org.apache.phoenix.end2end.InListIT
Running org.apache.phoenix.end2end.DateTimeIT
Tests run: 3, Failures: 0, Errors: 0, Skipped: 0, Time elapsed: 11.113 sec - in org.apache.phoenix.end2end.MD5FunctionIT
Running org.apache.phoenix.end2end.TenantSpecificViewIndexIT
Tests run: 19, Failures: 0, Errors: 0, Skipped: 0, Time elapsed: 13.32 sec - in org.apache.phoenix.end2end.DateTimeIT
Running org.apache.phoenix.end2end.AlterSessionIT
Tests run: 108, Failures: 0, Errors: 0, Skipped: 0, Time elapsed: 172.627 sec - in org.apache.phoenix.end2end.SortMergeJoinIT
Running org.apache.phoenix.end2end.PhoenixRuntimeIT
Tests run: 2, Failures: 0, Errors: 0, Skipped: 0, Time elapsed: 6.548 sec - in org.apache.phoenix.end2end.AlterSessionIT
Running org.apache.phoenix.end2end.DecodeFunctionIT
Tests run: 6, Failures: 0, Errors: 0, Skipped: 0, Time elapsed: 13.88 sec - in org.apache.phoenix.end2end.DecodeFunctionIT
Running org.apache.phoenix.end2end.UpgradeIT
Tests run: 2, Failures: 0, Errors: 0, Skipped: 0, Time elapsed: 40.937 sec - in org.apache.phoenix.end2end.PhoenixRuntimeIT
Running org.apache.phoenix.end2end.ServerExceptionIT
Tests run: 7, Failures: 0, Errors: 0, Skipped: 0, Time elapsed: 48.338 sec - in org.apache.phoenix.end2end.TenantSpecificViewIndexIT
Running org.apache.phoenix.end2end.RegexpSplitFunctionIT
Tests run: 1, Failures: 0, Errors: 0, Skipped: 0, Time elapsed: 5.012 sec - in org.apache.phoenix.end2end.ServerExceptionIT
Running org.apache.phoenix.end2end.ExecuteStatementsIT
Tests run: 11, Failures: 0, Errors: 0, Skipped: 0, Time elapsed: 10.491 sec - in org.apache.phoenix.end2end.RegexpSplitFunctionIT
Running org.apache.phoenix.end2end.SkipScanAfterManualSplitIT
Tests run: 2, Failures: 0, Errors: 0, Skipped: 0, Time elapsed: 26.542 sec - in org.apache.phoenix.end2end.ExecuteStatementsIT
Running org.apache.phoenix.end2end.ConvertTimezoneFunctionIT
Tests run: 7, Failures: 0, Errors: 0, Skipped: 0, Time elapsed: 7.217 sec - in org.apache.phoenix.end2end.ConvertTimezoneFunctionIT
Running org.apache.phoenix.end2end.RTrimFunctionIT
Tests run: 2, Failures: 0, Errors: 0, Skipped: 0, Time elapsed: 5.199 sec - in org.apache.phoenix.end2end.RTrimFunctionIT
Running org.apache.phoenix.end2end.SignFunctionEnd2EndIT
Tests run: 3, Failures: 0, Errors: 0, Skipped: 0, Time elapsed: 36.351 sec - in org.apache.phoenix.end2end.SkipScanAfterManualSplitIT
Running org.apache.phoenix.end2end.SkipScanQueryIT
Tests run: 2, Failures: 0, Errors: 0, Skipped: 0, Time elapsed: 10.115 sec - in org.apache.phoenix.end2end.SignFunctionEnd2EndIT
Running org.apache.phoenix.end2end.ExpFunctionEnd2EndIT
Tests run: 2, Failures: 0, Errors: 0, Skipped: 0, Time elapsed: 10.031 sec - in org.apache.phoenix.end2end.ExpFunctionEnd2EndIT
Running org.apache.phoenix.end2end.ArrayAppendFunctionIT
Tests run: 9, Failures: 0, Errors: 0, Skipped: 0, Time elapsed: 33.745 sec - in org.apache.phoenix.end2end.SkipScanQueryIT
Running org.apache.phoenix.end2end.LpadFunctionIT
Tests run: 34, Failures: 0, Errors: 0, Skipped: 0, Time elapsed: 22.037 sec - in org.apache.phoenix.end2end.ArrayAppendFunctionIT
Tests run: 12, Failures: 0, Errors: 0, Skipped: 0, Time elapsed: 31.328 sec - in org.apache.phoenix.end2end.LpadFunctionIT
Tests run: 6, Failures: 0, Errors: 0, Skipped: 0, Time elapsed: 153.503 sec - in org.apache.phoenix.end2end.UpgradeIT
Tests run: 108, Failures: 0, Errors: 0, Skipped: 0, Time elapsed: 374.385 sec - in org.apache.phoenix.end2end.SpooledSortMergeJoinIT
Tests run: 108, Failures: 0, Errors: 0, Skipped: 0, Time elapsed: 370.601 sec - in org.apache.phoenix.end2end.HashJoinIT

Results :




Tests run: 1111, Failures: 0, Errors: 0, Skipped: 0

[INFO] 
[INFO] --- maven-failsafe-plugin:2.18:integration-test (NeedTheirOwnClusterTests) @ phoenix-core
---
[INFO] Failsafe report directory: <https://builds.apache.org/job/Phoenix-master/ws/phoenix-core/target/failsafe-reports>
[INFO] parallel='none', perCoreThreadCount=true, threadCount=0, useUnlimitedThreads=false,
threadCountSuites=0, threadCountClasses=0, threadCountMethods=0, parallelOptimized=true

-------------------------------------------------------
 T E S T S
-------------------------------------------------------
Running org.apache.hadoop.hbase.regionserver.wal.WALReplayWithIndexWritesAndCompressedWALIT
Running org.apache.hadoop.hbase.regionserver.wal.WALReplayWithIndexWritesAndUncompressedWALInHBase_094_9_IT
Running org.apache.phoenix.hbase.index.balancer.IndexLoadBalancerIT
Running org.apache.phoenix.rpc.PhoenixServerRpcIT
Running org.apache.phoenix.rpc.PhoenixClientRpcIT
Tests run: 1, Failures: 0, Errors: 0, Skipped: 0, Time elapsed: 30.536 sec - in org.apache.hadoop.hbase.regionserver.wal.WALReplayWithIndexWritesAndCompressedWALIT
Running org.apache.phoenix.hbase.index.FailForUnsupportedHBaseVersionsIT
Tests run: 1, Failures: 0, Errors: 0, Skipped: 0, Time elapsed: 33.581 sec - in org.apache.hadoop.hbase.regionserver.wal.WALReplayWithIndexWritesAndUncompressedWALInHBase_094_9_IT
Tests run: 2, Failures: 0, Errors: 0, Skipped: 0, Time elapsed: 16.543 sec - in org.apache.phoenix.rpc.PhoenixServerRpcIT
Running org.apache.phoenix.hbase.index.covered.EndToEndCoveredColumnsIndexBuilderIT
Tests run: 2, Failures: 0, Errors: 0, Skipped: 0, Time elapsed: 15.549 sec - in org.apache.phoenix.rpc.PhoenixClientRpcIT
Running org.apache.phoenix.hbase.index.covered.example.FailWithoutRetriesIT
Tests run: 2, Failures: 0, Errors: 0, Skipped: 0, Time elapsed: 16.947 sec - in org.apache.phoenix.hbase.index.FailForUnsupportedHBaseVersionsIT
Running org.apache.phoenix.hbase.index.covered.example.EndToEndCoveredIndexingIT
Tests run: 1, Failures: 0, Errors: 0, Skipped: 0, Time elapsed: 8.681 sec - in org.apache.phoenix.hbase.index.covered.example.FailWithoutRetriesIT
Running org.apache.phoenix.hbase.index.covered.example.EndtoEndIndexingWithCompressionIT
Tests run: 2, Failures: 0, Errors: 0, Skipped: 0, Time elapsed: 19.349 sec - in org.apache.phoenix.hbase.index.covered.EndToEndCoveredColumnsIndexBuilderIT
Running org.apache.phoenix.monitoring.PhoenixMetricsIT
Running org.apache.phoenix.end2end.TenantSpecificTablesDMLIT
Tests run: 16, Failures: 0, Errors: 0, Skipped: 0, Time elapsed: 36.138 sec - in org.apache.phoenix.end2end.TenantSpecificTablesDMLIT
Tests run: 17, Failures: 0, Errors: 0, Skipped: 0, Time elapsed: 59.409 sec - in org.apache.phoenix.monitoring.PhoenixMetricsIT
Running org.apache.phoenix.end2end.ViewIT
Running org.apache.phoenix.end2end.TenantSpecificTablesDDLIT
Tests run: 11, Failures: 0, Errors: 0, Skipped: 0, Time elapsed: 119.047 sec - in org.apache.phoenix.hbase.index.covered.example.EndToEndCoveredIndexingIT
Running org.apache.phoenix.end2end.index.MutableIndexFailureIT
Tests run: 11, Failures: 0, Errors: 0, Skipped: 0, Time elapsed: 119.52 sec - in org.apache.phoenix.hbase.index.covered.example.EndtoEndIndexingWithCompressionIT
Tests run: 9, Failures: 0, Errors: 0, Skipped: 0, Time elapsed: 172.055 sec - in org.apache.phoenix.hbase.index.balancer.IndexLoadBalancerIT
Running org.apache.phoenix.end2end.index.MutableIndexReplicationIT
Tests run: 21, Failures: 0, Errors: 0, Skipped: 0, Time elapsed: 57.221 sec - in org.apache.phoenix.end2end.ViewIT
Tests run: 18, Failures: 1, Errors: 0, Skipped: 0, Time elapsed: 58.315 sec <<< FAILURE!
- in org.apache.phoenix.end2end.TenantSpecificTablesDDLIT
testAlterMultiTenantWithViewsToGlobal(org.apache.phoenix.end2end.TenantSpecificTablesDDLIT)
 Time elapsed: 1.897 sec  <<< FAILURE!
java.lang.AssertionError: expected:<1010> but was:<101>
	at org.junit.Assert.fail(Assert.java:88)
	at org.junit.Assert.failNotEquals(Assert.java:834)
	at org.junit.Assert.assertEquals(Assert.java:645)
	at org.junit.Assert.assertEquals(Assert.java:631)
	at org.apache.phoenix.end2end.TenantSpecificTablesDDLIT.testAlterMultiTenantWithViewsToGlobal(TenantSpecificTablesDDLIT.java:98)

Running org.apache.phoenix.end2end.index.ImmutableIndexWithStatsIT
Tests run: 1, Failures: 0, Errors: 0, Skipped: 0, Time elapsed: 5.973 sec - in org.apache.phoenix.end2end.index.ImmutableIndexWithStatsIT
Running org.apache.phoenix.end2end.UnionAllIT
Running org.apache.phoenix.end2end.StatsCollectorIT
Tests run: 1, Failures: 0, Errors: 0, Skipped: 0, Time elapsed: 27.587 sec - in org.apache.phoenix.end2end.index.MutableIndexReplicationIT
Running org.apache.phoenix.end2end.KeyOnlyIT
Tests run: 11, Failures: 0, Errors: 0, Skipped: 0, Time elapsed: 26.725 sec - in org.apache.phoenix.end2end.UnionAllIT
Running org.apache.phoenix.end2end.UserDefinedFunctionsIT
Tests run: 3, Failures: 0, Errors: 0, Skipped: 0, Time elapsed: 15.916 sec - in org.apache.phoenix.end2end.KeyOnlyIT
Running org.apache.phoenix.end2end.ContextClassloaderIT
Tests run: 3, Failures: 0, Errors: 0, Skipped: 0, Time elapsed: 4.11 sec - in org.apache.phoenix.end2end.ContextClassloaderIT
Running org.apache.phoenix.end2end.QueryTimeoutIT
Tests run: 4, Failures: 0, Errors: 0, Skipped: 0, Time elapsed: 57.334 sec - in org.apache.phoenix.end2end.StatsCollectorIT
Tests run: 12, Failures: 0, Errors: 0, Skipped: 0, Time elapsed: 34.236 sec - in org.apache.phoenix.end2end.UserDefinedFunctionsIT
Tests run: 1, Failures: 0, Errors: 0, Skipped: 0, Time elapsed: 15.8 sec - in org.apache.phoenix.end2end.QueryTimeoutIT
Running org.apache.phoenix.end2end.MultiCfQueryExecIT
Running org.apache.phoenix.end2end.QueryWithLimitIT
Running org.apache.phoenix.end2end.ParallelIteratorsIT
Running org.apache.phoenix.end2end.SaltedViewIT
Tests run: 7, Failures: 0, Errors: 0, Skipped: 0, Time elapsed: 17.556 sec - in org.apache.phoenix.end2end.MultiCfQueryExecIT
Tests run: 2, Failures: 0, Errors: 0, Skipped: 0, Time elapsed: 19.002 sec - in org.apache.phoenix.end2end.QueryWithLimitIT
Tests run: 2, Failures: 0, Errors: 0, Skipped: 0, Time elapsed: 9.749 sec - in org.apache.phoenix.end2end.SaltedViewIT
Running org.apache.phoenix.end2end.SpillableGroupByIT
Running org.apache.phoenix.end2end.StatsCollectorWithSplitsAndMultiCFIT
Tests run: 2, Failures: 0, Errors: 0, Skipped: 0, Time elapsed: 27.259 sec - in org.apache.phoenix.end2end.ParallelIteratorsIT
Tests run: 1, Failures: 0, Errors: 0, Skipped: 0, Time elapsed: 6.805 sec - in org.apache.phoenix.end2end.SpillableGroupByIT
Running org.apache.phoenix.end2end.AlterTableIT
Tests run: 3, Failures: 0, Errors: 0, Skipped: 0, Time elapsed: 163.841 sec - in org.apache.phoenix.end2end.index.MutableIndexFailureIT
Running org.apache.phoenix.end2end.CountDistinctCompressionIT
Running org.apache.phoenix.mapreduce.IndexToolIT
Tests run: 1, Failures: 0, Errors: 0, Skipped: 0, Time elapsed: 6.668 sec - in org.apache.phoenix.end2end.CountDistinctCompressionIT
Tests run: 2, Failures: 0, Errors: 0, Skipped: 0, Time elapsed: 28.182 sec - in org.apache.phoenix.end2end.StatsCollectorWithSplitsAndMultiCFIT
Running org.apache.phoenix.mapreduce.CsvBulkLoadToolIT
Running org.apache.phoenix.execute.PartialCommitIT
Tests run: 6, Failures: 0, Errors: 0, Skipped: 0, Time elapsed: 2.903 sec - in org.apache.phoenix.execute.PartialCommitIT
Tests run: 5, Failures: 0, Errors: 0, Skipped: 0, Time elapsed: 212.686 sec - in org.apache.phoenix.mapreduce.IndexToolIT
Tests run: 6, Failures: 0, Errors: 0, Skipped: 0, Time elapsed: 290.054 sec - in org.apache.phoenix.mapreduce.CsvBulkLoadToolIT
Tests run: 51, Failures: 0, Errors: 0, Skipped: 0, Time elapsed: 357.66 sec - in org.apache.phoenix.end2end.AlterTableIT

Results :

Failed tests: 
  TenantSpecificTablesDDLIT.testAlterMultiTenantWithViewsToGlobal:98 expected:<1010>
but was:<101>



Tests run: 238, Failures: 1, Errors: 0, Skipped: 0

[INFO] 
[INFO] --- maven-failsafe-plugin:2.18:verify (ClientManagedTimeTests) @ phoenix-core ---
[INFO] Failsafe report directory: <https://builds.apache.org/job/Phoenix-master/ws/phoenix-core/target/failsafe-reports>
[INFO] ------------------------------------------------------------------------
[INFO] Reactor Summary:
[INFO] 
[INFO] Apache Phoenix .................................... SUCCESS [4.156s]
[INFO] Phoenix Core ...................................... FAILURE [37:01.062s]
[INFO] Phoenix - Flume ................................... SKIPPED
[INFO] Phoenix - Pig ..................................... SKIPPED
[INFO] Phoenix Query Server Client ....................... SKIPPED
[INFO] Phoenix Query Server .............................. SKIPPED
[INFO] Phoenix - Pherf ................................... SKIPPED
[INFO] Phoenix - Spark ................................... SKIPPED
[INFO] Phoenix Assembly .................................. SKIPPED
[INFO] ------------------------------------------------------------------------
[INFO] BUILD FAILURE
[INFO] ------------------------------------------------------------------------
[INFO] Total time: 37:05.819s
[INFO] Finished at: Wed Jul 22 19:42:41 UTC 2015
[INFO] Final Memory: 58M/966M
[INFO] ------------------------------------------------------------------------
[ERROR] Failed to execute goal org.apache.maven.plugins:maven-failsafe-plugin:2.18:verify
(ClientManagedTimeTests) on project phoenix-core: There are test failures.
[ERROR] 
[ERROR] Please refer to <https://builds.apache.org/job/Phoenix-master/ws/phoenix-core/target/failsafe-reports>
for the individual test results.
[ERROR] -> [Help 1]
[ERROR] 
[ERROR] To see the full stack trace of the errors, re-run Maven with the -e switch.
[ERROR] Re-run Maven using the -X switch to enable full debug logging.
[ERROR] 
[ERROR] For more information about the errors and possible solutions, please read the following
articles:
[ERROR] [Help 1] http://cwiki.apache.org/confluence/display/MAVEN/MojoFailureException
[ERROR] 
[ERROR] After correcting the problems, you can resume the build with the command
[ERROR]   mvn <goals> -rf :phoenix-core
Build step 'Invoke top-level Maven targets' marked build as failure
Archiving artifacts
Sending artifact delta relative to Phoenix | Master #850
Archived 1196 artifacts
Archive block size is 32768
Received 18688 blocks and 558998427 bytes
Compression is 52.3%
Took 2 min 55 sec
Updating PHOENIX-2110
Recording test results

Mime
View raw message