phoenix-commits mailing list archives

Site index · List index
Message view « Date » · « Thread »
Top « Date » · « Thread »
From Apache Jenkins Server <jenk...@builds.apache.org>
Subject Build failed in Jenkins: Phoenix | Master #830
Date Mon, 13 Jul 2015 19:11:33 GMT
See <https://builds.apache.org/job/Phoenix-master/830/changes>

Changes:

[mujtaba] PHOENIX-2113 Include log4j.properties in Pherf so runtime logging is displayed on
console by default

------------------------------------------
[...truncated 119857 lines...]
[ERROR] KeyValueSkipListSet.java[106] (indentation) Indentation: method def modifier at indentation
level 2 not at correct indentation, 4
[ERROR] KeyValueSkipListSet.java[108] (indentation) Indentation: method def child at indentation
level 4 not at correct indentation, 8
[ERROR] KeyValueSkipListSet.java[109] (indentation) Indentation: method def rcurly at indentation
level 2 not at correct indentation, 4
[ERROR] KeyValueSkipListSet.java[111] (indentation) Indentation: method def modifier at indentation
level 2 not at correct indentation, 4
[ERROR] KeyValueSkipListSet.java[112] (indentation) Indentation: method def child at indentation
level 4 not at correct indentation, 8
[ERROR] KeyValueSkipListSet.java[113] (indentation) Indentation: method def rcurly at indentation
level 2 not at correct indentation, 4
[ERROR] KeyValueSkipListSet.java[115] (indentation) Indentation: method def modifier at indentation
level 2 not at correct indentation, 4
[ERROR] KeyValueSkipListSet.java[116] (indentation) Indentation: method def child at indentation
level 4 not at correct indentation, 8
[ERROR] KeyValueSkipListSet.java[117] (indentation) Indentation: method def rcurly at indentation
level 2 not at correct indentation, 4
[ERROR] KeyValueSkipListSet.java[119] (indentation) Indentation: method def modifier at indentation
level 2 not at correct indentation, 4
[ERROR] KeyValueSkipListSet.java[120] (indentation) Indentation: method def child at indentation
level 4 not at correct indentation, 8
[ERROR] KeyValueSkipListSet.java[121] (indentation) Indentation: method def rcurly at indentation
level 2 not at correct indentation, 4
[ERROR] KeyValueSkipListSet.java[123] (indentation) Indentation: method def modifier at indentation
level 2 not at correct indentation, 4
[ERROR] KeyValueSkipListSet.java[124] (indentation) Indentation: method def child at indentation
level 4 not at correct indentation, 8
[ERROR] KeyValueSkipListSet.java[125] (indentation) Indentation: method def rcurly at indentation
level 2 not at correct indentation, 4
[ERROR] KeyValueSkipListSet.java[127] (indentation) Indentation: method def modifier at indentation
level 2 not at correct indentation, 4
[ERROR] KeyValueSkipListSet.java[128] (indentation) Indentation: method def child at indentation
level 4 not at correct indentation, 8
[ERROR] KeyValueSkipListSet.java[129] (indentation) Indentation: method def rcurly at indentation
level 2 not at correct indentation, 4
[ERROR] KeyValueSkipListSet.java[131] (indentation) Indentation: method def modifier at indentation
level 2 not at correct indentation, 4
[ERROR] KeyValueSkipListSet.java[132] (indentation) Indentation: method def child at indentation
level 4 not at correct indentation, 8
[ERROR] KeyValueSkipListSet.java[133] (indentation) Indentation: method def rcurly at indentation
level 2 not at correct indentation, 4
[ERROR] KeyValueSkipListSet.java[135] (indentation) Indentation: method def modifier at indentation
level 2 not at correct indentation, 4
[ERROR] KeyValueSkipListSet.java[136] (indentation) Indentation: method def child at indentation
level 4 not at correct indentation, 8
[ERROR] KeyValueSkipListSet.java[137] (indentation) Indentation: method def rcurly at indentation
level 2 not at correct indentation, 4
[ERROR] KeyValueSkipListSet.java[139] (indentation) Indentation: method def modifier at indentation
level 2 not at correct indentation, 4
[ERROR] KeyValueSkipListSet.java[140] (indentation) Indentation: method call child at indentation
level 4 not at correct indentation, 8
[ERROR] KeyValueSkipListSet.java[140] (indentation) Indentation: method def child at indentation
level 4 not at correct indentation, 8
[ERROR] KeyValueSkipListSet.java[141] (indentation) Indentation: method def rcurly at indentation
level 2 not at correct indentation, 4
[ERROR] KeyValueSkipListSet.java[143] (indentation) Indentation: method def modifier at indentation
level 2 not at correct indentation, 4
[ERROR] KeyValueSkipListSet.java[145] (indentation) Indentation: method def child at indentation
level 4 not at correct indentation, 8
[ERROR] KeyValueSkipListSet.java[146] (indentation) Indentation: method def rcurly at indentation
level 2 not at correct indentation, 4
[ERROR] KeyValueSkipListSet.java[148] (indentation) Indentation: method def modifier at indentation
level 2 not at correct indentation, 4
[ERROR] KeyValueSkipListSet.java[149] (indentation) Indentation: method def child at indentation
level 4 not at correct indentation, 8
[ERROR] KeyValueSkipListSet.java[150] (indentation) Indentation: method def rcurly at indentation
level 2 not at correct indentation, 4
[ERROR] KeyValueSkipListSet.java[152] (indentation) Indentation: method def modifier at indentation
level 2 not at correct indentation, 4
[ERROR] KeyValueSkipListSet.java[153] (indentation) Indentation: method def child at indentation
level 4 not at correct indentation, 8
[ERROR] KeyValueSkipListSet.java[154] (indentation) Indentation: method def rcurly at indentation
level 2 not at correct indentation, 4
[ERROR] KeyValueSkipListSet.java[156] (indentation) Indentation: method def modifier at indentation
level 2 not at correct indentation, 4
[ERROR] KeyValueSkipListSet.java[157] (indentation) Indentation: method def child at indentation
level 4 not at correct indentation, 8
[ERROR] KeyValueSkipListSet.java[158] (indentation) Indentation: method def rcurly at indentation
level 2 not at correct indentation, 4
[ERROR] KeyValueSkipListSet.java[160] (indentation) Indentation: method def modifier at indentation
level 2 not at correct indentation, 4
[ERROR] KeyValueSkipListSet.java[161] (indentation) Indentation: method def child at indentation
level 4 not at correct indentation, 8
[ERROR] KeyValueSkipListSet.java[162] (indentation) Indentation: method def rcurly at indentation
level 2 not at correct indentation, 4
[ERROR] KeyValueSkipListSet.java[164] (indentation) Indentation: method def modifier at indentation
level 2 not at correct indentation, 4
[ERROR] KeyValueSkipListSet.java[165] (indentation) Indentation: method def child at indentation
level 4 not at correct indentation, 8
[ERROR] KeyValueSkipListSet.java[166] (indentation) Indentation: method def rcurly at indentation
level 2 not at correct indentation, 4
[ERROR] KeyValueSkipListSet.java[168] (indentation) Indentation: method def modifier at indentation
level 2 not at correct indentation, 4
[ERROR] KeyValueSkipListSet.java[169] (indentation) Indentation: method def child at indentation
level 4 not at correct indentation, 8
[ERROR] KeyValueSkipListSet.java[170] (indentation) Indentation: method def rcurly at indentation
level 2 not at correct indentation, 4
[ERROR] KeyValueSkipListSet.java[172] (indentation) Indentation: method def modifier at indentation
level 2 not at correct indentation, 4
[ERROR] KeyValueSkipListSet.java[173] (indentation) Indentation: method def child at indentation
level 4 not at correct indentation, 8
[ERROR] KeyValueSkipListSet.java[174] (indentation) Indentation: method def rcurly at indentation
level 2 not at correct indentation, 4
[ERROR] KeyValueSkipListSet.java[176] (indentation) Indentation: method def modifier at indentation
level 2 not at correct indentation, 4
[ERROR] KeyValueSkipListSet.java[177] (indentation) Indentation: method def child at indentation
level 4 not at correct indentation, 8
[ERROR] KeyValueSkipListSet.java[178] (indentation) Indentation: method def rcurly at indentation
level 2 not at correct indentation, 4
[ERROR] KeyValueSkipListSet.java[180] (indentation) Indentation: method def modifier at indentation
level 2 not at correct indentation, 4
[ERROR] KeyValueSkipListSet.java[181] (indentation) Indentation: method def child at indentation
level 4 not at correct indentation, 8
[ERROR] KeyValueSkipListSet.java[182] (indentation) Indentation: method def rcurly at indentation
level 2 not at correct indentation, 4
[ERROR] LocalIndexMerger.java[2] (header) Header: Line does not match expected header line
of ' * Licensed to the Apache Software Foundation (ASF) under one or more'.
[ERROR] LocalIndexMerger.java[37] (javadoc) JavadocType: Missing a Javadoc comment.
[ERROR] LocalIndexMerger.java[58] (blocks) NeedBraces: 'if' construct must use '{}'s.
[ERROR] IndexKeyValueSkipListSet.java[0] (misc) NewlineAtEndOfFile: File does not end with
a newline.
[ERROR] IndexKeyValueSkipListSet.java[2] (header) Header: Line does not match expected header
line of ' * Licensed to the Apache Software Foundation (ASF) under one or more'.
[ERROR] IndexKeyValueSkipListSet.java[33] (indentation) Indentation: member def modifier at
indentation level 2 not at correct indentation, 4
[ERROR] IndexKeyValueSkipListSet.java[41] (indentation) Indentation: method def modifier at
indentation level 2 not at correct indentation, 4
[ERROR] IndexKeyValueSkipListSet.java[42] (indentation) Indentation: method def child at indentation
level 4 not at correct indentation, 8
[ERROR] IndexKeyValueSkipListSet.java[43] (indentation) Indentation: assign child at indentation
level 8 not at correct indentation, 12
[ERROR] IndexKeyValueSkipListSet.java[44] (indentation) Indentation: method def child at indentation
level 4 not at correct indentation, 8
[ERROR] IndexKeyValueSkipListSet.java[45] (indentation) Indentation: method def child at indentation
level 4 not at correct indentation, 8
[ERROR] IndexKeyValueSkipListSet.java[46] (indentation) Indentation: method def rcurly at
indentation level 2 not at correct indentation, 4
[ERROR] IndexKeyValueSkipListSet.java[51] (indentation) Indentation: ctor def modifier at
indentation level 2 not at correct indentation, 4
[ERROR] IndexKeyValueSkipListSet.java[53] (indentation) Indentation: ctor def child at indentation
level 4 not at correct indentation, 8
[ERROR] IndexKeyValueSkipListSet.java[54] (indentation) Indentation: ctor def rcurly at indentation
level 2 not at correct indentation, 4
[ERROR] IndexKeyValueSkipListSet.java[73] (indentation) Indentation: method def modifier at
indentation level 2 not at correct indentation, 4
[ERROR] IndexKeyValueSkipListSet.java[74] (indentation) Indentation: method def child at indentation
level 4 not at correct indentation, 8
[ERROR] IndexKeyValueSkipListSet.java[75] (indentation) Indentation: method def rcurly at
indentation level 2 not at correct indentation, 4
[ERROR] ClientRpcControllerFactory.java[0] (misc) NewlineAtEndOfFile: File does not end with
a newline.
[ERROR] ClientRpcControllerFactory.java[0] (javadoc) JavadocPackage: Missing package-info.java
file.
[ERROR] ClientRpcControllerFactory.java[1] (header) Header: Line does not match expected header
line of '/*'.
[ERROR] ClientRpcControllerFactory.java[55] (misc) Regexp: Line matches the illegal pattern
'Trailing whitespace'.
[ERROR] ClientRpcControllerFactory.java[57] (indentation) Indentation: method def child at
indentation level 16 not at correct indentation, 8
[ERROR] ClientRpcControllerFactory.java[57:1] (whitespace) FileTabCharacter: File contains
tab characters (this is the first instance).
[ERROR] ClientRpcControllerFactory.java[59] (misc) Regexp: Line matches the illegal pattern
'Trailing whitespace'.
[ERROR] MetadataRpcController.java[1] (header) Header: Line does not match expected header
line of '/*'.
[ERROR] MetadataRpcController.java[31] (javadoc) JavadocType: Missing a Javadoc comment.
[ERROR] MetadataRpcController.java[33] (indentation) Indentation: member def modifier at indentation
level 8 not at correct indentation, 4
[ERROR] MetadataRpcController.java[33:1] (whitespace) FileTabCharacter: File contains tab
characters (this is the first instance).
[ERROR] MetadataRpcController.java[35] (indentation) Indentation: member def modifier at indentation
level 8 not at correct indentation, 4
[ERROR] MetadataRpcController.java[40] (indentation) Indentation: ctor def modifier at indentation
level 8 not at correct indentation, 4
[ERROR] MetadataRpcController.java[43] (indentation) Indentation: ctor def child at indentation
level 16 not at correct indentation, 8
[ERROR] MetadataRpcController.java[44] (indentation) Indentation: ctor def rcurly at indentation
level 8 not at correct indentation, 4
[ERROR] MetadataRpcController.java[46] (indentation) Indentation: method def modifier at indentation
level 8 not at correct indentation, 4
[ERROR] MetadataRpcController.java[47] (indentation) Indentation: method def modifier at indentation
level 8 not at correct indentation, 4
[ERROR] MetadataRpcController.java[48] (indentation) Indentation: if at indentation level
16 not at correct indentation, 8
[ERROR] MetadataRpcController.java[49] (indentation) Indentation: if child at indentation
level 24 not at correct indentation, 12
[ERROR] MetadataRpcController.java[50] (indentation) Indentation: if rcurly at indentation
level 16 not at correct indentation, 8
[ERROR] MetadataRpcController.java[51] (indentation) Indentation: else child at indentation
level 24 not at correct indentation, 12
[ERROR] MetadataRpcController.java[52] (indentation) Indentation: else rcurly at indentation
level 16 not at correct indentation, 8
[ERROR] MetadataRpcController.java[53] (indentation) Indentation: method def rcurly at indentation
level 8 not at correct indentation, 4
[ERROR] IndexRpcController.java[1] (header) Header: Line does not match expected header line
of '/*'.
[ERROR] IndexRpcController.java[28] (javadoc) JavadocType: Missing a Javadoc comment.
[ERROR] IndexRpcController.java[32] (misc) Regexp: Line matches the illegal pattern 'Trailing
whitespace'.
[ERROR] IndexRpcController.java[39] (misc) Regexp: Line matches the illegal pattern 'Trailing
whitespace'.
[ERROR] IndexRpcController.java[42] (indentation) Indentation: if at indentation level 16
not at correct indentation, 8
[ERROR] IndexRpcController.java[42:1] (whitespace) FileTabCharacter: File contains tab characters
(this is the first instance).
[ERROR] IndexRpcController.java[43] (indentation) Indentation: if child at indentation level
24 not at correct indentation, 12
[ERROR] IndexRpcController.java[44] (misc) Regexp: Line matches the illegal pattern 'Trailing
whitespace'.
[ERROR] IndexRpcController.java[44] (indentation) Indentation: if rcurly at indentation level
16 not at correct indentation, 8
[ERROR] IndexRpcController.java[44:17] (blocks) RightCurly: '}' should be on the same line.
[ERROR] IndexRpcController.java[49] (misc) Regexp: Line matches the illegal pattern 'Trailing
whitespace'.
[ERROR] ServerRpcControllerFactory.java[0] (misc) NewlineAtEndOfFile: File does not end with
a newline.
[ERROR] ServerRpcControllerFactory.java[1] (header) Header: Line does not match expected header
line of '/*'.
[ERROR] ServerRpcControllerFactory.java[55] (misc) Regexp: Line matches the illegal pattern
'Trailing whitespace'.
[ERROR] ServerRpcControllerFactory.java[57:5] (whitespace) FileTabCharacter: File contains
tab characters (this is the first instance).
[ERROR] ServerRpcControllerFactory.java[59] (indentation) Indentation: method def child at
indentation level 16 not at correct indentation, 8
[ERROR] ServerRpcControllerFactory.java[61] (misc) Regexp: Line matches the illegal pattern
'Trailing whitespace'.
[ERROR] PhoenixRpcSchedulerFactory.java[0] (misc) NewlineAtEndOfFile: File does not end with
a newline.
[ERROR] PhoenixRpcSchedulerFactory.java[0] (javadoc) JavadocPackage: Missing package-info.java
file.
[ERROR] PhoenixRpcSchedulerFactory.java[2] (header) Header: Line does not match expected header
line of ' * Licensed to the Apache Software Foundation (ASF) under one or more'.
[ERROR] PhoenixRpcSchedulerFactory.java[25:1] (imports) RedundantImport: Redundant import
from the same package - org.apache.hadoop.hbase.ipc.PriorityFunction.
[ERROR] PhoenixRpcSchedulerFactory.java[26:1] (imports) RedundantImport: Redundant import
from the same package - org.apache.hadoop.hbase.ipc.RpcScheduler.
[ERROR] PhoenixRpcSchedulerFactory.java[27:8] (imports) UnusedImports: Unused import - org.apache.hadoop.hbase.regionserver.RegionServerServices.
[ERROR] PhoenixRpcSchedulerFactory.java[47] (sizes) LineLength: Line is longer than 100 characters
(found 108).
[ERROR] PhoenixRpcSchedulerFactory.java[66] (sizes) LineLength: Line is longer than 100 characters
(found 135).
[ERROR] PhoenixRpcSchedulerFactory.java[66:119] (whitespace) WhitespaceAround: '+' is not
preceded with whitespace.
[ERROR] PhoenixRpcSchedulerFactory.java[67] (sizes) LineLength: Line is longer than 100 characters
(found 152).
[ERROR] PhoenixRpcSchedulerFactory.java[83] (sizes) LineLength: Line is longer than 100 characters
(found 155).
[ERROR] PhoenixRpcSchedulerFactory.java[83] (misc) Regexp: Line matches the illegal pattern
'Trailing whitespace'.
[ERROR] PhoenixRpcSchedulerFactory.java[83:37] (whitespace) ParenPad: '(' is followed by whitespace.
[ERROR] PhoenixRpcSchedulerFactory.java[84] (misc) Regexp: Line matches the illegal pattern
'Trailing whitespace'.
[ERROR] PhoenixRpcSchedulerFactory.java[84:9] (whitespace) FileTabCharacter: File contains
tab characters (this is the first instance).
[ERROR] PhoenixRpcSchedulerFactory.java[84:58] (whitespace) WhitespaceAround: '+' is not followed
by whitespace.
[ERROR] PhoenixRpcSchedulerFactory.java[84:86] (whitespace) ParenPad: ')' is preceded with
whitespace.
[ERROR] PhoenixRpcSchedulerFactory.java[88] (sizes) LineLength: Line is longer than 100 characters
(found 109).
[ERROR] PhoenixRpcSchedulerFactory.java[90] (misc) Regexp: Line matches the illegal pattern
'Trailing whitespace'.
[ERROR] PhoenixRpcSchedulerFactory.java[92] (sizes) LineLength: Line is longer than 100 characters
(found 115).
[ERROR] PhoenixRpcSchedulerFactory.java[94] (misc) Regexp: Line matches the illegal pattern
'Trailing whitespace'.
[ERROR] PhoenixRpcScheduler.java[2] (header) Header: Line does not match expected header line
of ' * Licensed to the Apache Software Foundation (ASF) under one or more'.
[ERROR] PhoenixRpcScheduler.java[35] (sizes) LineLength: Line is longer than 100 characters
(found 107).
[ERROR] PhoenixRpcScheduler.java[46] (sizes) LineLength: Line is longer than 100 characters
(found 116).
[ERROR] PhoenixRpcScheduler.java[48] (sizes) LineLength: Line is longer than 100 characters
(found 136).
[ERROR] PhoenixRpcScheduler.java[48:5] (whitespace) FileTabCharacter: File contains tab characters
(this is the first instance).
[ERROR] PhoenixRpcScheduler.java[49] (sizes) LineLength: Line is longer than 100 characters
(found 142).
[ERROR] PhoenixRpcScheduler.java[50] (sizes) LineLength: Line is longer than 100 characters
(found 134).
[ERROR] PhoenixRpcScheduler.java[50:92] (whitespace) WhitespaceAround: '*' is not preceded
with whitespace.
[ERROR] PhoenixRpcScheduler.java[50:93] (whitespace) WhitespaceAround: '*' is not followed
by whitespace.
[ERROR] PhoenixRpcScheduler.java[51] (sizes) LineLength: Line is longer than 100 characters
(found 140).
[ERROR] PhoenixRpcScheduler.java[51:98] (whitespace) WhitespaceAround: '*' is not preceded
with whitespace.
[ERROR] PhoenixRpcScheduler.java[51:99] (whitespace) WhitespaceAround: '*' is not followed
by whitespace.
[ERROR] PhoenixRpcScheduler.java[54] (sizes) LineLength: Line is longer than 100 characters
(found 105).
[ERROR] PhoenixRpcScheduler.java[59] (sizes) LineLength: Line is longer than 100 characters
(found 127).
[ERROR] PhoenixRpcScheduler.java[60] (sizes) LineLength: Line is longer than 100 characters
(found 142).
[ERROR] PhoenixRpcScheduler.java[100] (sizes) LineLength: Line is longer than 100 characters
(found 140).
[ERROR] PhoenixRpcScheduler.java[115] (sizes) LineLength: Line is longer than 100 characters
(found 157).
[ERROR] PhoenixRpcScheduler.java[122] (misc) Regexp: Line matches the illegal pattern 'Trailing
whitespace'.
[ERROR] PhoenixRpcScheduler.java[127] (misc) Regexp: Line matches the illegal pattern 'Trailing
whitespace'.
[ERROR] PhoenixRpcScheduler.java[128] (misc) Regexp: Line matches the illegal pattern 'Trailing
whitespace'.
[WARNING] checkstyle:check violations detected but failOnViolation set to false
[INFO] 
[INFO] --- build-helper-maven-plugin:1.9.1:add-test-source (add-test-source) @ phoenix-core
---
[INFO] Test Source directory: <https://builds.apache.org/job/Phoenix-master/ws/phoenix-core/src/it/java>
added.
[INFO] 
[INFO] --- build-helper-maven-plugin:1.9.1:add-test-resource (add-test-resource) @ phoenix-core
---
[INFO] 
[INFO] --- build-helper-maven-plugin:1.9.1:add-source (add-source) @ phoenix-core ---
[INFO] Source directory: <https://builds.apache.org/job/Phoenix-master/ws/phoenix-core/target/generated-sources/antlr3>
added.
[INFO] Source directory: <https://builds.apache.org/job/Phoenix-master/ws/phoenix-core/src/main/antlr3>
added.
[INFO] 
[INFO] --- antlr3-maven-plugin:3.5:antlr (default) @ phoenix-core ---
[INFO] ANTLR: Processing source directory <https://builds.apache.org/job/Phoenix-master/ws/phoenix-core/src/main/antlr3>
ANTLR Parser Generator  Version 3.5
Output file <https://builds.apache.org/job/Phoenix-master/ws/phoenix-core/target/generated-sources/antlr3/org/apache/phoenix/parse/PhoenixSQLParser.java>
does not exist: must build <https://builds.apache.org/job/Phoenix-master/ws/phoenix-core/src/main/antlr3/PhoenixSQL.g>
PhoenixSQL.g
[INFO] 
[INFO] --- maven-dependency-plugin:2.1:build-classpath (create-phoenix-generated-classpath)
@ phoenix-core ---
[INFO] Wrote classpath file '<https://builds.apache.org/job/Phoenix-master/ws/phoenix-core/target/cached_classpath.txt'.>
[INFO] 
[INFO] --- maven-remote-resources-plugin:1.5:process (default) @ phoenix-core ---
[INFO] 
[INFO] --- maven-resources-plugin:2.6:resources (default-resources) @ phoenix-core ---
[INFO] Using 'UTF-8' encoding to copy filtered resources.
[INFO] Copying 1 resource to META-INF/services
[INFO] Copying 3 resources
[INFO] 
[INFO] --- maven-compiler-plugin:3.0:compile (default-compile) @ phoenix-core ---
[INFO] Changes detected - recompiling the module!
[INFO] Compiling 857 source files to <https://builds.apache.org/job/Phoenix-master/ws/phoenix-core/target/classes>
[INFO] -------------------------------------------------------------
[WARNING] COMPILATION WARNING : 
[INFO] -------------------------------------------------------------
[WARNING] <https://builds.apache.org/job/Phoenix-master/ws/phoenix-core/src/main/java/org/apache/phoenix/hbase/index/write/ParallelWriterIndexCommitter.java>:
Some input files use or override a deprecated API.
[WARNING] <https://builds.apache.org/job/Phoenix-master/ws/phoenix-core/src/main/java/org/apache/phoenix/hbase/index/write/ParallelWriterIndexCommitter.java>:
Recompile with -Xlint:deprecation for details.
[WARNING] <https://builds.apache.org/job/Phoenix-master/ws/phoenix-core/src/main/java/org/apache/phoenix/parse/FunctionParseNode.java>:
Some input files use unchecked or unsafe operations.
[WARNING] <https://builds.apache.org/job/Phoenix-master/ws/phoenix-core/src/main/java/org/apache/phoenix/parse/FunctionParseNode.java>:
Recompile with -Xlint:unchecked for details.
[INFO] 4 warnings 
[INFO] -------------------------------------------------------------
[INFO] -------------------------------------------------------------
[ERROR] COMPILATION ERROR : 
[INFO] -------------------------------------------------------------
[ERROR] <https://builds.apache.org/job/Phoenix-master/ws/phoenix-core/src/main/java/org/apache/phoenix/coprocessor/BaseScannerRegionObserver.java>:[175,37]
cannot access org.apache.htrace.TraceInfo
  bad class file: /home/jenkins/.m2/repository/org/apache/htrace/htrace-core/3.1.0-incubating/htrace-core-3.1.0-incubating.jar(org/apache/htrace/TraceInfo.class)
    unable to access file: /home/jenkins/.m2/repository/org/apache/htrace/htrace-core/3.1.0-incubating/htrace-core-3.1.0-incubating.jar
(No such file or directory)
    Please remove or make sure it appears in the correct subdirectory of the classpath.
[INFO] 1 error
[INFO] -------------------------------------------------------------
[INFO] ------------------------------------------------------------------------
[INFO] Reactor Summary:
[INFO] 
[INFO] Apache Phoenix .................................... SUCCESS [3.696s]
[INFO] Phoenix Core ...................................... FAILURE [1:08.803s]
[INFO] Phoenix - Flume ................................... SKIPPED
[INFO] Phoenix - Pig ..................................... SKIPPED
[INFO] Phoenix Query Server Client ....................... SKIPPED
[INFO] Phoenix Query Server .............................. SKIPPED
[INFO] Phoenix - Pherf ................................... SKIPPED
[INFO] Phoenix - Spark ................................... SKIPPED
[INFO] Phoenix Assembly .................................. SKIPPED
[INFO] ------------------------------------------------------------------------
[INFO] BUILD FAILURE
[INFO] ------------------------------------------------------------------------
[INFO] Total time: 1:13.082s
[INFO] Finished at: Mon Jul 13 19:11:12 UTC 2015
[INFO] Final Memory: 60M/1147M
[INFO] ------------------------------------------------------------------------
[ERROR] Failed to execute goal org.apache.maven.plugins:maven-compiler-plugin:3.0:compile
(default-compile) on project phoenix-core: Compilation failure
[ERROR] <https://builds.apache.org/job/Phoenix-master/ws/phoenix-core/src/main/java/org/apache/phoenix/coprocessor/BaseScannerRegionObserver.java>:[175,37]
cannot access org.apache.htrace.TraceInfo
[ERROR] bad class file: /home/jenkins/.m2/repository/org/apache/htrace/htrace-core/3.1.0-incubating/htrace-core-3.1.0-incubating.jar(org/apache/htrace/TraceInfo.class)
[ERROR] unable to access file: /home/jenkins/.m2/repository/org/apache/htrace/htrace-core/3.1.0-incubating/htrace-core-3.1.0-incubating.jar
(No such file or directory)
[ERROR] Please remove or make sure it appears in the correct subdirectory of the classpath.
[ERROR] -> [Help 1]
[ERROR] 
[ERROR] To see the full stack trace of the errors, re-run Maven with the -e switch.
[ERROR] Re-run Maven using the -X switch to enable full debug logging.
[ERROR] 
[ERROR] For more information about the errors and possible solutions, please read the following
articles:
[ERROR] [Help 1] http://cwiki.apache.org/confluence/display/MAVEN/MojoFailureException
[ERROR] 
[ERROR] After correcting the problems, you can resume the build with the command
[ERROR]   mvn <goals> -rf :phoenix-core
Build step 'Invoke top-level Maven targets' marked build as failure
Archiving artifacts
Sending artifact delta relative to Phoenix | Master #829
Archived 122 artifacts
Archive block size is 32768
Received 5426 blocks and 43152527 bytes
Compression is 80.5%
Took 33 sec
Updating PHOENIX-2113
Recording test results

Mime
View raw message