phoenix-commits mailing list archives

Site index · List index
Message view « Date » · « Thread »
Top « Date » · « Thread »
From Apache Jenkins Server <jenk...@builds.apache.org>
Subject Build failed in Jenkins: Phoenix | Master #823
Date Thu, 09 Jul 2015 12:52:33 GMT
See <https://builds.apache.org/job/Phoenix-master/823/changes>

Changes:

[rajeshbabu] PHOENIX-1889 Support alter/replace and drop functions(Rajeshbabu)

------------------------------------------
[...truncated 120343 lines...]
Running org.apache.phoenix.end2end.SkipScanQueryIT
Tests run: 3, Failures: 0, Errors: 0, Skipped: 0, Time elapsed: 7.741 sec - in org.apache.phoenix.end2end.BinaryRowKeyIT
Running org.apache.phoenix.end2end.SpooledSortMergeJoinIT
Tests run: 11, Failures: 0, Errors: 0, Skipped: 0, Time elapsed: 14.635 sec - in org.apache.phoenix.end2end.ModulusExpressionIT
Running org.apache.phoenix.end2end.HashJoinIT
Tests run: 9, Failures: 0, Errors: 0, Skipped: 0, Time elapsed: 51.215 sec - in org.apache.phoenix.end2end.SkipScanQueryIT
Running org.apache.phoenix.end2end.ReadOnlyIT
Tests run: 20, Failures: 0, Errors: 0, Skipped: 0, Time elapsed: 77.567 sec - in org.apache.phoenix.end2end.DeleteIT
Running org.apache.phoenix.end2end.MD5FunctionIT
Tests run: 1, Failures: 0, Errors: 0, Skipped: 0, Time elapsed: 16.54 sec - in org.apache.phoenix.end2end.ReadOnlyIT
Running org.apache.phoenix.end2end.InstrFunctionIT
Tests run: 3, Failures: 0, Errors: 0, Skipped: 0, Time elapsed: 16.11 sec - in org.apache.phoenix.end2end.MD5FunctionIT
Running org.apache.phoenix.end2end.DateTimeIT
Tests run: 20, Failures: 0, Errors: 0, Skipped: 0, Time elapsed: 372.792 sec - in org.apache.phoenix.end2end.index.LocalIndexIT
Running org.apache.phoenix.end2end.HashJoinLocalIndexIT
Tests run: 8, Failures: 0, Errors: 0, Skipped: 0, Time elapsed: 13.35 sec - in org.apache.phoenix.end2end.InstrFunctionIT
Running org.apache.phoenix.end2end.StoreNullsIT
Tests run: 19, Failures: 0, Errors: 0, Skipped: 0, Time elapsed: 34.133 sec - in org.apache.phoenix.end2end.DateTimeIT
Running org.apache.phoenix.end2end.ExpFunctionEnd2EndIT
Tests run: 3, Failures: 0, Errors: 0, Skipped: 0, Time elapsed: 39.709 sec - in org.apache.phoenix.end2end.StoreNullsIT
Running org.apache.phoenix.end2end.PowerFunctionEnd2EndIT
Tests run: 2, Failures: 0, Errors: 0, Skipped: 0, Time elapsed: 17.958 sec - in org.apache.phoenix.end2end.ExpFunctionEnd2EndIT
Running org.apache.phoenix.end2end.ArithmeticQueryIT
Tests run: 1, Failures: 0, Errors: 0, Skipped: 0, Time elapsed: 51.595 sec - in org.apache.phoenix.end2end.HashJoinLocalIndexIT
Running org.apache.phoenix.end2end.UpgradeIT
Tests run: 1, Failures: 0, Errors: 0, Skipped: 0, Time elapsed: 19.708 sec - in org.apache.phoenix.end2end.PowerFunctionEnd2EndIT
Running org.apache.phoenix.end2end.LikeExpressionIT
Tests run: 1, Failures: 0, Errors: 0, Skipped: 0, Time elapsed: 6.981 sec - in org.apache.phoenix.end2end.LikeExpressionIT
Running org.apache.phoenix.end2end.DecodeFunctionIT
Tests run: 6, Failures: 0, Errors: 0, Skipped: 0, Time elapsed: 10.176 sec - in org.apache.phoenix.end2end.DecodeFunctionIT
Running org.apache.phoenix.end2end.ExecuteStatementsIT
Tests run: 2, Failures: 0, Errors: 0, Skipped: 0, Time elapsed: 38.425 sec - in org.apache.phoenix.end2end.ExecuteStatementsIT
Running org.apache.phoenix.end2end.ArraysWithNullsIT
Tests run: 26, Failures: 0, Errors: 0, Skipped: 0, Time elapsed: 90.305 sec - in org.apache.phoenix.end2end.ArithmeticQueryIT
Running org.apache.phoenix.end2end.SpooledTmpFileDeleteIT
Tests run: 1, Failures: 0, Errors: 0, Skipped: 0, Time elapsed: 10.04 sec - in org.apache.phoenix.end2end.SpooledTmpFileDeleteIT
Running org.apache.phoenix.end2end.ServerExceptionIT
Tests run: 1, Failures: 0, Errors: 0, Skipped: 0, Time elapsed: 7.357 sec - in org.apache.phoenix.end2end.ServerExceptionIT
Running org.apache.phoenix.end2end.ToDateFunctionIT
Tests run: 11, Failures: 0, Errors: 0, Skipped: 0, Time elapsed: 16.204 sec - in org.apache.phoenix.end2end.ToDateFunctionIT
Running org.apache.phoenix.end2end.CSVCommonsLoaderIT
Tests run: 15, Failures: 0, Errors: 0, Skipped: 0, Time elapsed: 62.73 sec - in org.apache.phoenix.end2end.CSVCommonsLoaderIT
Running org.apache.phoenix.end2end.CbrtFunctionEnd2EndIT
Tests run: 16, Failures: 0, Errors: 0, Skipped: 0, Time elapsed: 121.42 sec - in org.apache.phoenix.end2end.ArraysWithNullsIT
Running org.apache.phoenix.end2end.AlterSessionIT
Tests run: 6, Failures: 0, Errors: 0, Skipped: 0, Time elapsed: 197.667 sec - in org.apache.phoenix.end2end.UpgradeIT
Running org.apache.phoenix.end2end.MappingTableDataTypeIT
Tests run: 2, Failures: 0, Errors: 0, Skipped: 0, Time elapsed: 7.648 sec - in org.apache.phoenix.end2end.AlterSessionIT
Running org.apache.phoenix.end2end.TenantSpecificViewIndexIT
Tests run: 2, Failures: 0, Errors: 0, Skipped: 0, Time elapsed: 16.667 sec - in org.apache.phoenix.end2end.CbrtFunctionEnd2EndIT
Running org.apache.phoenix.end2end.AbsFunctionEnd2EndIT
Tests run: 1, Failures: 0, Errors: 0, Skipped: 0, Time elapsed: 6.892 sec - in org.apache.phoenix.end2end.AbsFunctionEnd2EndIT
Running org.apache.phoenix.end2end.InListIT
Tests run: 1, Failures: 0, Errors: 0, Skipped: 0, Time elapsed: 13.073 sec - in org.apache.phoenix.end2end.MappingTableDataTypeIT
Running org.apache.phoenix.end2end.StatementHintsIT
Tests run: 2, Failures: 0, Errors: 0, Skipped: 0, Time elapsed: 6.763 sec - in org.apache.phoenix.end2end.StatementHintsIT
Running org.apache.phoenix.end2end.TenantSpecificViewIndexSaltedIT
Tests run: 4, Failures: 0, Errors: 0, Skipped: 0, Time elapsed: 21.702 sec - in org.apache.phoenix.end2end.TenantSpecificViewIndexSaltedIT
Running org.apache.phoenix.end2end.TimezoneOffsetFunctionIT
Tests run: 7, Failures: 0, Errors: 0, Skipped: 0, Time elapsed: 48.849 sec - in org.apache.phoenix.end2end.TenantSpecificViewIndexIT
Running org.apache.phoenix.end2end.QueryExecWithoutSCNIT
Tests run: 1, Failures: 0, Errors: 0, Skipped: 0, Time elapsed: 6.891 sec - in org.apache.phoenix.end2end.QueryExecWithoutSCNIT
Tests run: 108, Failures: 0, Errors: 0, Skipped: 0, Time elapsed: 386.035 sec - in org.apache.phoenix.end2end.SpooledSortMergeJoinIT
Running org.apache.phoenix.end2end.CoalesceFunctionIT
Running org.apache.phoenix.end2end.LpadFunctionIT
Tests run: 7, Failures: 0, Errors: 0, Skipped: 0, Time elapsed: 17.566 sec - in org.apache.phoenix.end2end.TimezoneOffsetFunctionIT
Running org.apache.phoenix.end2end.RegexpReplaceFunctionIT
Tests run: 2, Failures: 0, Errors: 0, Skipped: 0, Time elapsed: 6.642 sec - in org.apache.phoenix.end2end.RegexpReplaceFunctionIT
Running org.apache.phoenix.end2end.EvaluationOfORIT
Tests run: 2, Failures: 0, Errors: 0, Skipped: 0, Time elapsed: 6.389 sec - in org.apache.phoenix.end2end.EvaluationOfORIT
Running org.apache.phoenix.end2end.LastValueFunctionIT
Tests run: 10, Failures: 0, Errors: 0, Skipped: 0, Time elapsed: 20.56 sec - in org.apache.phoenix.end2end.CoalesceFunctionIT
Running org.apache.phoenix.end2end.SkipScanAfterManualSplitIT
Tests run: 10, Failures: 0, Errors: 0, Skipped: 0, Time elapsed: 27.04 sec - in org.apache.phoenix.end2end.LpadFunctionIT
Running org.apache.phoenix.end2end.salted.SaltedTableVarLengthRowKeyIT
Tests run: 11, Failures: 0, Errors: 0, Skipped: 0, Time elapsed: 17.558 sec - in org.apache.phoenix.end2end.LastValueFunctionIT
Running org.apache.phoenix.end2end.salted.SaltedTableUpsertSelectIT
Tests run: 1, Failures: 0, Errors: 0, Skipped: 0, Time elapsed: 9.935 sec - in org.apache.phoenix.end2end.salted.SaltedTableVarLengthRowKeyIT
Running org.apache.phoenix.end2end.DynamicFamilyIT
Tests run: 4, Failures: 0, Errors: 0, Skipped: 0, Time elapsed: 17.583 sec - in org.apache.phoenix.end2end.DynamicFamilyIT
Running org.apache.phoenix.end2end.MinMaxAggregateFunctionIT
Tests run: 5, Failures: 0, Errors: 0, Skipped: 0, Time elapsed: 28.075 sec - in org.apache.phoenix.end2end.salted.SaltedTableUpsertSelectIT
Running org.apache.phoenix.end2end.SubqueryIT
Tests run: 3, Failures: 0, Errors: 0, Skipped: 0, Time elapsed: 42.945 sec - in org.apache.phoenix.end2end.SkipScanAfterManualSplitIT
Running org.apache.phoenix.end2end.ArrayAppendFunctionIT
Tests run: 1, Failures: 0, Errors: 0, Skipped: 0, Time elapsed: 6.925 sec - in org.apache.phoenix.end2end.MinMaxAggregateFunctionIT
Running org.apache.phoenix.end2end.ReverseScanIT
Tests run: 2, Failures: 0, Errors: 0, Skipped: 0, Time elapsed: 12.917 sec - in org.apache.phoenix.end2end.ReverseScanIT
Running org.apache.phoenix.end2end.SortMergeJoinIT
Tests run: 34, Failures: 0, Errors: 0, Skipped: 0, Time elapsed: 28.224 sec - in org.apache.phoenix.end2end.ArrayAppendFunctionIT
Running org.apache.phoenix.end2end.SignFunctionEnd2EndIT
Tests run: 2, Failures: 0, Errors: 0, Skipped: 0, Time elapsed: 13.034 sec - in org.apache.phoenix.end2end.SignFunctionEnd2EndIT
Running org.apache.phoenix.end2end.QueryMoreIT
Tests run: 108, Failures: 0, Errors: 0, Skipped: 0, Time elapsed: 497.361 sec - in org.apache.phoenix.end2end.HashJoinIT
Running org.apache.phoenix.end2end.ArrayConcatFunctionIT
Tests run: 5, Failures: 0, Errors: 0, Skipped: 0, Time elapsed: 51.018 sec - in org.apache.phoenix.end2end.QueryMoreIT
Running org.apache.phoenix.end2end.ConvertTimezoneFunctionIT
Tests run: 30, Failures: 0, Errors: 0, Skipped: 0, Time elapsed: 40.819 sec - in org.apache.phoenix.end2end.ArrayConcatFunctionIT
Running org.apache.phoenix.end2end.LnLogFunctionEnd2EndIT
Tests run: 7, Failures: 0, Errors: 0, Skipped: 0, Time elapsed: 8.271 sec - in org.apache.phoenix.end2end.ConvertTimezoneFunctionIT
Running org.apache.phoenix.trace.PhoenixTraceReaderIT
Tests run: 2, Failures: 0, Errors: 0, Skipped: 0, Time elapsed: 3.031 sec - in org.apache.phoenix.trace.PhoenixTraceReaderIT
Running org.apache.phoenix.trace.PhoenixTracingEndToEndIT
Tests run: 25, Failures: 0, Errors: 0, Skipped: 0, Time elapsed: 217.105 sec - in org.apache.phoenix.end2end.InListIT
Running org.apache.phoenix.trace.PhoenixTableMetricsWriterIT
Tests run: 2, Failures: 0, Errors: 0, Skipped: 0, Time elapsed: 3.315 sec - in org.apache.phoenix.trace.PhoenixTableMetricsWriterIT
Tests run: 21, Failures: 0, Errors: 0, Skipped: 0, Time elapsed: 112.883 sec - in org.apache.phoenix.end2end.SubqueryIT
Running org.apache.phoenix.rpc.UpdateCacheIT
Tests run: 1, Failures: 0, Errors: 0, Skipped: 0, Time elapsed: 15.466 sec - in org.apache.phoenix.end2end.LnLogFunctionEnd2EndIT
Tests run: 1, Failures: 0, Errors: 0, Skipped: 0, Time elapsed: 7.16 sec - in org.apache.phoenix.rpc.UpdateCacheIT
Tests run: 6, Failures: 0, Errors: 0, Skipped: 0, Time elapsed: 92.822 sec - in org.apache.phoenix.trace.PhoenixTracingEndToEndIT
Tests run: 108, Failures: 0, Errors: 0, Skipped: 0, Time elapsed: 451.365 sec - in org.apache.phoenix.end2end.SortMergeJoinIT

Results :




Tests run: 1045, Failures: 0, Errors: 0, Skipped: 0

[INFO] 
[INFO] --- maven-failsafe-plugin:2.18:integration-test (NeedTheirOwnClusterTests) @ phoenix-core
---
[INFO] Failsafe report directory: <https://builds.apache.org/job/Phoenix-master/ws/phoenix-core/target/failsafe-reports>
[INFO] parallel='none', perCoreThreadCount=true, threadCount=0, useUnlimitedThreads=false,
threadCountSuites=0, threadCountClasses=0, threadCountMethods=0, parallelOptimized=true

-------------------------------------------------------
 T E S T S
-------------------------------------------------------
Running org.apache.phoenix.end2end.index.MutableIndexFailureIT
Running org.apache.phoenix.end2end.TenantSpecificTablesDMLIT
Running org.apache.phoenix.end2end.index.ImmutableIndexWithStatsIT
Running org.apache.phoenix.end2end.ViewIT
Running org.apache.phoenix.execute.PartialCommitIT
Tests run: 1, Failures: 0, Errors: 0, Skipped: 0, Time elapsed: 12.703 sec - in org.apache.phoenix.end2end.index.ImmutableIndexWithStatsIT
Tests run: 6, Failures: 0, Errors: 0, Skipped: 0, Time elapsed: 10.684 sec - in org.apache.phoenix.execute.PartialCommitIT
Running org.apache.phoenix.end2end.index.MutableIndexReplicationIT
Tests run: 16, Failures: 0, Errors: 0, Skipped: 0, Time elapsed: 51.346 sec - in org.apache.phoenix.end2end.TenantSpecificTablesDMLIT
Running org.apache.phoenix.end2end.QueryWithLimitIT
Tests run: 20, Failures: 0, Errors: 0, Skipped: 0, Time elapsed: 77.769 sec - in org.apache.phoenix.end2end.ViewIT
Tests run: 1, Failures: 0, Errors: 0, Skipped: 0, Time elapsed: 37.48 sec - in org.apache.phoenix.end2end.index.MutableIndexReplicationIT
Tests run: 2, Failures: 0, Errors: 0, Skipped: 0, Time elapsed: 23.746 sec - in org.apache.phoenix.end2end.QueryWithLimitIT
Running org.apache.phoenix.end2end.StatsCollectorIT
Running org.apache.phoenix.end2end.KeyOnlyIT
Tests run: 3, Failures: 0, Errors: 0, Skipped: 0, Time elapsed: 22.833 sec - in org.apache.phoenix.end2end.KeyOnlyIT
Running org.apache.phoenix.end2end.ContextClassloaderIT
Tests run: 3, Failures: 0, Errors: 0, Skipped: 0, Time elapsed: 9.274 sec - in org.apache.phoenix.end2end.ContextClassloaderIT
Running org.apache.phoenix.end2end.UnionAllIT
Running org.apache.phoenix.end2end.MultiCfQueryExecIT
Tests run: 4, Failures: 0, Errors: 0, Skipped: 0, Time elapsed: 64.493 sec - in org.apache.phoenix.end2end.StatsCollectorIT
Tests run: 3, Failures: 0, Errors: 0, Skipped: 0, Time elapsed: 204.831 sec - in org.apache.phoenix.end2end.index.MutableIndexFailureIT
Tests run: 7, Failures: 0, Errors: 0, Skipped: 0, Time elapsed: 22.435 sec - in org.apache.phoenix.end2end.MultiCfQueryExecIT
Tests run: 11, Failures: 0, Errors: 0, Skipped: 0, Time elapsed: 32.591 sec - in org.apache.phoenix.end2end.UnionAllIT
Running org.apache.phoenix.end2end.UserDefinedFunctionsIT
Running org.apache.phoenix.end2end.SaltedViewIT
Running org.apache.phoenix.end2end.TenantSpecificTablesDDLIT
Running org.apache.phoenix.end2end.AlterTableIT
Tests run: 2, Failures: 0, Errors: 0, Skipped: 0, Time elapsed: 23.896 sec - in org.apache.phoenix.end2end.SaltedViewIT
Running org.apache.phoenix.end2end.CountDistinctCompressionIT
Tests run: 10, Failures: 0, Errors: 0, Skipped: 0, Time elapsed: 48.439 sec - in org.apache.phoenix.end2end.UserDefinedFunctionsIT
Tests run: 1, Failures: 0, Errors: 0, Skipped: 0, Time elapsed: 14.796 sec - in org.apache.phoenix.end2end.CountDistinctCompressionIT
Running org.apache.phoenix.end2end.SpillableGroupByIT
Tests run: 18, Failures: 0, Errors: 0, Skipped: 0, Time elapsed: 64.048 sec - in org.apache.phoenix.end2end.TenantSpecificTablesDDLIT
Tests run: 1, Failures: 0, Errors: 0, Skipped: 0, Time elapsed: 13.764 sec - in org.apache.phoenix.end2end.SpillableGroupByIT
Running org.apache.phoenix.end2end.StatsCollectorWithSplitsAndMultiCFIT
Running org.apache.phoenix.end2end.ParallelIteratorsIT
Running org.apache.phoenix.mapreduce.IndexToolIT
Tests run: 2, Failures: 0, Errors: 0, Skipped: 0, Time elapsed: 31.771 sec - in org.apache.phoenix.end2end.StatsCollectorWithSplitsAndMultiCFIT
Tests run: 2, Failures: 0, Errors: 0, Skipped: 0, Time elapsed: 33.723 sec - in org.apache.phoenix.end2end.ParallelIteratorsIT
Running org.apache.phoenix.monitoring.PhoenixMetricsIT
Running org.apache.phoenix.mapreduce.CsvBulkLoadToolIT
Tests run: 17, Failures: 0, Errors: 0, Skipped: 0, Time elapsed: 80.535 sec - in org.apache.phoenix.monitoring.PhoenixMetricsIT
Running org.apache.phoenix.hbase.index.FailForUnsupportedHBaseVersionsIT
Tests run: 2, Failures: 0, Errors: 0, Skipped: 0, Time elapsed: 18.035 sec - in org.apache.phoenix.hbase.index.FailForUnsupportedHBaseVersionsIT
Running org.apache.phoenix.hbase.index.covered.example.EndToEndCoveredIndexingIT
Tests run: 5, Failures: 0, Errors: 0, Skipped: 0, Time elapsed: 242.801 sec - in org.apache.phoenix.mapreduce.IndexToolIT
Running org.apache.phoenix.hbase.index.covered.example.EndtoEndIndexingWithCompressionIT
Tests run: 11, Failures: 0, Errors: 0, Skipped: 0, Time elapsed: 158.873 sec - in org.apache.phoenix.hbase.index.covered.example.EndToEndCoveredIndexingIT
Running org.apache.phoenix.hbase.index.covered.example.FailWithoutRetriesIT
Tests run: 1, Failures: 0, Errors: 0, Skipped: 0, Time elapsed: 8.89 sec - in org.apache.phoenix.hbase.index.covered.example.FailWithoutRetriesIT
Running org.apache.phoenix.hbase.index.covered.EndToEndCoveredColumnsIndexBuilderIT
Tests run: 2, Failures: 0, Errors: 0, Skipped: 0, Time elapsed: 18.961 sec - in org.apache.phoenix.hbase.index.covered.EndToEndCoveredColumnsIndexBuilderIT
Running org.apache.phoenix.hbase.index.balancer.IndexLoadBalancerIT
Tests run: 6, Failures: 0, Errors: 0, Skipped: 0, Time elapsed: 326.614 sec - in org.apache.phoenix.mapreduce.CsvBulkLoadToolIT
Running org.apache.phoenix.rpc.PhoenixClientRpcIT
Tests run: 11, Failures: 0, Errors: 0, Skipped: 0, Time elapsed: 158.775 sec - in org.apache.phoenix.hbase.index.covered.example.EndtoEndIndexingWithCompressionIT
Tests run: 2, Failures: 0, Errors: 0, Skipped: 0, Time elapsed: 14.077 sec - in org.apache.phoenix.rpc.PhoenixClientRpcIT
Running org.apache.hadoop.hbase.regionserver.wal.WALReplayWithIndexWritesAndCompressedWALIT
Running org.apache.phoenix.rpc.PhoenixServerRpcIT
Tests run: 1, Failures: 0, Errors: 0, Skipped: 0, Time elapsed: 27.991 sec - in org.apache.hadoop.hbase.regionserver.wal.WALReplayWithIndexWritesAndCompressedWALIT
Running org.apache.hadoop.hbase.regionserver.wal.WALReplayWithIndexWritesAndUncompressedWALInHBase_094_9_IT
Tests run: 2, Failures: 0, Errors: 0, Skipped: 0, Time elapsed: 22.019 sec - in org.apache.phoenix.rpc.PhoenixServerRpcIT
Tests run: 61, Failures: 0, Errors: 0, Skipped: 1, Time elapsed: 551.603 sec - in org.apache.phoenix.end2end.AlterTableIT
Tests run: 1, Failures: 0, Errors: 0, Skipped: 0, Time elapsed: 27.769 sec - in org.apache.hadoop.hbase.regionserver.wal.WALReplayWithIndexWritesAndUncompressedWALInHBase_094_9_IT
Tests run: 9, Failures: 0, Errors: 0, Skipped: 0, Time elapsed: 244.054 sec - in org.apache.phoenix.hbase.index.balancer.IndexLoadBalancerIT
Running org.apache.phoenix.end2end.QueryTimeoutIT
Tests run: 1, Failures: 0, Errors: 0, Skipped: 0, Time elapsed: 19.364 sec - in org.apache.phoenix.end2end.QueryTimeoutIT

Results :




Tests run: 245, Failures: 0, Errors: 0, Skipped: 1

[INFO] 
[INFO] --- maven-failsafe-plugin:2.18:verify (ClientManagedTimeTests) @ phoenix-core ---
[INFO] Failsafe report directory: <https://builds.apache.org/job/Phoenix-master/ws/phoenix-core/target/failsafe-reports>
[INFO] ------------------------------------------------------------------------
[INFO] Reactor Summary:
[INFO] 
[INFO] Apache Phoenix .................................... SUCCESS [4.594s]
[INFO] Phoenix Core ...................................... FAILURE [56:37.462s]
[INFO] Phoenix - Flume ................................... SKIPPED
[INFO] Phoenix - Pig ..................................... SKIPPED
[INFO] Phoenix Query Server Client ....................... SKIPPED
[INFO] Phoenix Query Server .............................. SKIPPED
[INFO] Phoenix - Pherf ................................... SKIPPED
[INFO] Phoenix - Spark ................................... SKIPPED
[INFO] Phoenix Assembly .................................. SKIPPED
[INFO] ------------------------------------------------------------------------
[INFO] BUILD FAILURE
[INFO] ------------------------------------------------------------------------
[INFO] Total time: 56:42.675s
[INFO] Finished at: Thu Jul 09 12:50:05 UTC 2015
[INFO] Final Memory: 45M/1122M
[INFO] ------------------------------------------------------------------------
[ERROR] Failed to execute goal org.apache.maven.plugins:maven-failsafe-plugin:2.18:verify
(ClientManagedTimeTests) on project phoenix-core: There are test failures.
[ERROR] 
[ERROR] Please refer to <https://builds.apache.org/job/Phoenix-master/ws/phoenix-core/target/failsafe-reports>
for the individual test results.
[ERROR] -> [Help 1]
[ERROR] 
[ERROR] To see the full stack trace of the errors, re-run Maven with the -e switch.
[ERROR] Re-run Maven using the -X switch to enable full debug logging.
[ERROR] 
[ERROR] For more information about the errors and possible solutions, please read the following
articles:
[ERROR] [Help 1] http://cwiki.apache.org/confluence/display/MAVEN/MojoFailureException
[ERROR] 
[ERROR] After correcting the problems, you can resume the build with the command
[ERROR]   mvn <goals> -rf :phoenix-core
Build step 'Invoke top-level Maven targets' marked build as failure
Archiving artifacts
Sending artifact delta relative to Phoenix | Master #790
Archived 1182 artifacts
Archive block size is 32768
Received 19860 blocks and 494518908 bytes
Compression is 56.8%
Took 2 min 28 sec
Updating PHOENIX-1889
Recording test results

Mime
View raw message