phoenix-commits mailing list archives

Site index · List index
Message view « Date » · « Thread »
Top « Date » · « Thread »
From Apache Jenkins Server <jenk...@builds.apache.org>
Subject Build failed in Jenkins: Phoenix | Master #717
Date Fri, 24 Apr 2015 21:03:36 GMT
See <https://builds.apache.org/job/Phoenix-master/717/changes>

Changes:

[maryannxue] PHOENIX-1917 Correlated subquery fails if the inner query contains JOIN

------------------------------------------
[...truncated 1146 lines...]
	at java.lang.Thread.start(Thread.java:693)
	at org.apache.zookeeper.ClientCnxn.start(ClientCnxn.java:406)
	at org.apache.zookeeper.ZooKeeper.<init>(ZooKeeper.java:450)
	at org.apache.zookeeper.ZooKeeper.<init>(ZooKeeper.java:380)
	at org.apache.hadoop.hbase.zookeeper.RecoverableZooKeeper.checkZk(RecoverableZooKeeper.java:142)
	at org.apache.hadoop.hbase.zookeeper.RecoverableZooKeeper.<init>(RecoverableZooKeeper.java:129)
	at org.apache.hadoop.hbase.zookeeper.ZKUtil.connect(ZKUtil.java:134)
	at org.apache.hadoop.hbase.zookeeper.ZooKeeperWatcher.<init>(ZooKeeperWatcher.java:165)
	at org.apache.hadoop.hbase.zookeeper.ZooKeeperWatcher.<init>(ZooKeeperWatcher.java:133)
	at org.apache.hadoop.hbase.client.ZooKeeperKeepAliveConnection.<init>(ZooKeeperKeepAliveConnection.java:43)
	at org.apache.hadoop.hbase.client.ConnectionManager$HConnectionImplementation.getKeepAliveZooKeeperWatcher(ConnectionManager.java:1597)
	at org.apache.hadoop.hbase.client.ZooKeeperRegistry.getClusterId(ZooKeeperRegistry.java:85)
	at org.apache.hadoop.hbase.client.ConnectionManager$HConnectionImplementation.retrieveClusterId(ConnectionManager.java:833)
	at org.apache.hadoop.hbase.client.ConnectionManager$HConnectionImplementation.<init>(ConnectionManager.java:623)
	at sun.reflect.GeneratedConstructorAccessor32.newInstance(Unknown Source)
	at sun.reflect.DelegatingConstructorAccessorImpl.newInstance(DelegatingConstructorAccessorImpl.java:45)
	at java.lang.reflect.Constructor.newInstance(Constructor.java:526)
	at org.apache.hadoop.hbase.client.ConnectionFactory.createConnection(ConnectionFactory.java:238)
	at org.apache.hadoop.hbase.client.ConnectionManager.createConnection(ConnectionManager.java:410)
	at org.apache.hadoop.hbase.client.ConnectionManager.createConnection(ConnectionManager.java:403)
	at org.apache.hadoop.hbase.client.ConnectionManager.getConnectionInternal(ConnectionManager.java:281)
	at org.apache.hadoop.hbase.client.HBaseAdmin.<init>(HBaseAdmin.java:202)
	at org.apache.phoenix.query.ConnectionQueryServicesImpl.ensureTableCreated(ConnectionQueryServicesImpl.java:802)
	at org.apache.phoenix.query.ConnectionQueryServicesImpl.createTable(ConnectionQueryServicesImpl.java:1194)
	at org.apache.phoenix.schema.MetaDataClient.createTableInternal(MetaDataClient.java:1701)
	at org.apache.phoenix.schema.MetaDataClient.createTable(MetaDataClient.java:594)
	at org.apache.phoenix.compile.CreateTableCompiler$2.execute(CreateTableCompiler.java:186)
	at org.apache.phoenix.jdbc.PhoenixStatement$2.call(PhoenixStatement.java:298)
	at org.apache.phoenix.jdbc.PhoenixStatement$2.call(PhoenixStatement.java:290)
	at org.apache.phoenix.call.CallRunner.run(CallRunner.java:53)
	at org.apache.phoenix.jdbc.PhoenixStatement.executeMutation(PhoenixStatement.java:288)
	at org.apache.phoenix.jdbc.PhoenixStatement.execute(PhoenixStatement.java:1163)
	at org.apache.phoenix.end2end.HashJoinIT.testJoinOverSaltedTables(HashJoinIT.java:2851)

Running org.apache.phoenix.end2end.index.SaltedIndexIT
Tests run: 15, Failures: 0, Errors: 0, Skipped: 0, Time elapsed: 68.687 sec - in org.apache.phoenix.end2end.index.GlobalMutableIndexIT
Running org.apache.phoenix.end2end.index.IndexMetadataIT
Tests run: 3, Failures: 0, Errors: 0, Skipped: 0, Time elapsed: 18.99 sec - in org.apache.phoenix.end2end.index.SaltedIndexIT
Running org.apache.phoenix.end2end.index.IndexExpressionIT
Tests run: 105, Failures: 0, Errors: 0, Skipped: 0, Time elapsed: 299.712 sec - in org.apache.phoenix.end2end.SortMergeJoinIT
Running org.apache.phoenix.end2end.index.DropViewIT
Tests run: 1, Failures: 0, Errors: 0, Skipped: 0, Time elapsed: 7.632 sec - in org.apache.phoenix.end2end.index.DropViewIT
Running org.apache.phoenix.end2end.index.LocalMutableIndexIT
Tests run: 20, Failures: 0, Errors: 0, Skipped: 0, Time elapsed: 146.14 sec - in org.apache.phoenix.end2end.index.LocalIndexIT
Running org.apache.phoenix.end2end.index.ViewIndexIT
Tests run: 6, Failures: 0, Errors: 0, Skipped: 0, Time elapsed: 40.683 sec - in org.apache.phoenix.end2end.index.IndexMetadataIT
Running org.apache.phoenix.end2end.index.ImmutableIndexIT
Tests run: 1, Failures: 0, Errors: 0, Skipped: 0, Time elapsed: 4.374 sec - in org.apache.phoenix.end2end.index.ViewIndexIT
Running org.apache.phoenix.end2end.ServerExceptionIT
Tests run: 1, Failures: 0, Errors: 0, Skipped: 0, Time elapsed: 1.822 sec - in org.apache.phoenix.end2end.ServerExceptionIT
Running org.apache.phoenix.end2end.CSVCommonsLoaderIT
Tests run: 15, Failures: 0, Errors: 0, Skipped: 0, Time elapsed: 18.251 sec - in org.apache.phoenix.end2end.CSVCommonsLoaderIT
Running org.apache.phoenix.end2end.ReverseFunctionIT
Tests run: 5, Failures: 0, Errors: 0, Skipped: 0, Time elapsed: 2.859 sec - in org.apache.phoenix.end2end.ReverseFunctionIT
Running org.apache.phoenix.end2end.ArrayAppendFunctionIT
Tests run: 13, Failures: 0, Errors: 0, Skipped: 0, Time elapsed: 34.624 sec - in org.apache.phoenix.end2end.index.ImmutableIndexIT
Running org.apache.phoenix.end2end.AutoCommitIT
Tests run: 35, Failures: 0, Errors: 0, Skipped: 0, Time elapsed: 11.291 sec - in org.apache.phoenix.end2end.ArrayAppendFunctionIT
Running org.apache.phoenix.end2end.TenantSpecificViewIndexSaltedIT
Tests run: 1, Failures: 0, Errors: 0, Skipped: 0, Time elapsed: 2.723 sec - in org.apache.phoenix.end2end.AutoCommitIT
Running org.apache.phoenix.end2end.DateTimeIT
Tests run: 15, Failures: 0, Errors: 0, Skipped: 0, Time elapsed: 70.838 sec - in org.apache.phoenix.end2end.index.LocalMutableIndexIT
Tests run: 4, Failures: 0, Errors: 0, Skipped: 0, Time elapsed: 8.747 sec - in org.apache.phoenix.end2end.TenantSpecificViewIndexSaltedIT
Running org.apache.phoenix.end2end.DecodeFunctionIT
Running org.apache.phoenix.end2end.SpooledTmpFileDeleteIT
Tests run: 6, Failures: 0, Errors: 0, Skipped: 0, Time elapsed: 2.767 sec - in org.apache.phoenix.end2end.DecodeFunctionIT
Tests run: 105, Failures: 0, Errors: 0, Skipped: 0, Time elapsed: 301.589 sec - in org.apache.phoenix.end2end.SpooledSortMergeJoinIT
Running org.apache.phoenix.end2end.ModulusExpressionIT
Tests run: 1, Failures: 0, Errors: 0, Skipped: 0, Time elapsed: 3.299 sec - in org.apache.phoenix.end2end.SpooledTmpFileDeleteIT
Running org.apache.phoenix.end2end.LastValueFunctionIT
Running org.apache.phoenix.end2end.FirstValueFunctionIT
Tests run: 11, Failures: 0, Errors: 0, Skipped: 0, Time elapsed: 6.026 sec - in org.apache.phoenix.end2end.ModulusExpressionIT
Running org.apache.phoenix.end2end.PhoenixMetricsIT
Tests run: 7, Failures: 0, Errors: 0, Skipped: 0, Time elapsed: 6.674 sec - in org.apache.phoenix.end2end.FirstValueFunctionIT
Running org.apache.phoenix.end2end.DisableLocalIndexIT
Tests run: 19, Failures: 0, Errors: 0, Skipped: 0, Time elapsed: 19.51 sec - in org.apache.phoenix.end2end.DateTimeIT
Running org.apache.phoenix.end2end.HashJoinLocalIndexIT
Tests run: 11, Failures: 0, Errors: 0, Skipped: 0, Time elapsed: 10.582 sec - in org.apache.phoenix.end2end.LastValueFunctionIT
Tests run: 4, Failures: 0, Errors: 0, Skipped: 0, Time elapsed: 4.962 sec - in org.apache.phoenix.end2end.PhoenixMetricsIT
Running org.apache.phoenix.end2end.MD5FunctionIT
Running org.apache.phoenix.end2end.UpsertBigValuesIT
Tests run: 1, Failures: 0, Errors: 0, Skipped: 0, Time elapsed: 4.576 sec - in org.apache.phoenix.end2end.DisableLocalIndexIT
Running org.apache.phoenix.end2end.LpadFunctionIT
Tests run: 2, Failures: 0, Errors: 0, Skipped: 0, Time elapsed: 4.201 sec - in org.apache.phoenix.end2end.MD5FunctionIT
Running org.apache.phoenix.end2end.SignFunctionEnd2EndIT
Tests run: 2, Failures: 0, Errors: 0, Skipped: 0, Time elapsed: 4.625 sec - in org.apache.phoenix.end2end.SignFunctionEnd2EndIT
Running org.apache.phoenix.end2end.QueryExecWithoutSCNIT
Tests run: 4, Failures: 0, Errors: 0, Skipped: 0, Time elapsed: 11.115 sec - in org.apache.phoenix.end2end.UpsertBigValuesIT
Running org.apache.phoenix.end2end.RegexpReplaceFunctionIT
Tests run: 1, Failures: 0, Errors: 0, Skipped: 0, Time elapsed: 2.505 sec - in org.apache.phoenix.end2end.QueryExecWithoutSCNIT
Running org.apache.phoenix.end2end.DynamicFamilyIT
Tests run: 2, Failures: 0, Errors: 0, Skipped: 0, Time elapsed: 3.611 sec - in org.apache.phoenix.end2end.RegexpReplaceFunctionIT
Running org.apache.phoenix.end2end.RoundFloorCeilFunctionsEnd2EndIT
Tests run: 1, Failures: 0, Errors: 0, Skipped: 0, Time elapsed: 17.088 sec - in org.apache.phoenix.end2end.HashJoinLocalIndexIT
Running org.apache.phoenix.end2end.DeleteIT
Tests run: 4, Failures: 0, Errors: 0, Skipped: 0, Time elapsed: 4.891 sec - in org.apache.phoenix.end2end.DynamicFamilyIT
Running org.apache.phoenix.end2end.InListIT
Tests run: 10, Failures: 0, Errors: 0, Skipped: 0, Time elapsed: 16.022 sec - in org.apache.phoenix.end2end.LpadFunctionIT
Running org.apache.phoenix.end2end.EvaluationOfORIT
Tests run: 1, Failures: 0, Errors: 0, Skipped: 0, Time elapsed: 3.307 sec - in org.apache.phoenix.end2end.EvaluationOfORIT
Running org.apache.phoenix.end2end.ReverseScanIT
Tests run: 2, Failures: 0, Errors: 0, Skipped: 0, Time elapsed: 4.056 sec - in org.apache.phoenix.end2end.ReverseScanIT
Running org.apache.phoenix.end2end.NthValueFunctionIT
Tests run: 31, Failures: 0, Errors: 0, Skipped: 0, Time elapsed: 21.004 sec - in org.apache.phoenix.end2end.RoundFloorCeilFunctionsEnd2EndIT
Running org.apache.phoenix.end2end.ReadOnlyIT
Tests run: 11, Failures: 0, Errors: 0, Skipped: 0, Time elapsed: 10.494 sec - in org.apache.phoenix.end2end.NthValueFunctionIT
Running org.apache.phoenix.end2end.ExecuteStatementsIT
Tests run: 1, Failures: 0, Errors: 0, Skipped: 0, Time elapsed: 8.484 sec - in org.apache.phoenix.end2end.ReadOnlyIT
Running org.apache.phoenix.iterate.RoundRobinResultIteratorIT
Tests run: 20, Failures: 0, Errors: 0, Skipped: 0, Time elapsed: 39.799 sec - in org.apache.phoenix.end2end.DeleteIT
Tests run: 2, Failures: 0, Errors: 0, Skipped: 0, Time elapsed: 18.829 sec - in org.apache.phoenix.end2end.ExecuteStatementsIT
Tests run: 58, Failures: 0, Errors: 0, Skipped: 0, Time elapsed: 174.477 sec - in org.apache.phoenix.end2end.index.IndexExpressionIT
Tests run: 25, Failures: 0, Errors: 0, Skipped: 0, Time elapsed: 62.706 sec - in org.apache.phoenix.end2end.InListIT
Tests run: 7, Failures: 0, Errors: 0, Skipped: 0, Time elapsed: 48.966 sec - in org.apache.phoenix.iterate.RoundRobinResultIteratorIT

Results :


Tests in error: 
  HashJoinIT.testJoinOverSaltedTables:2851 ยป PhoenixIO java.lang.reflect.Invocat...


Tests run: 916, Failures: 0, Errors: 1, Skipped: 0

[INFO] 
[INFO] --- maven-failsafe-plugin:2.18:integration-test (NeedTheirOwnClusterTests) @ phoenix-core
---
[INFO] Failsafe report directory: <https://builds.apache.org/job/Phoenix-master/ws/phoenix-core/target/failsafe-reports>
[INFO] parallel='none', perCoreThreadCount=true, threadCount=0, useUnlimitedThreads=false,
threadCountSuites=0, threadCountClasses=0, threadCountMethods=0, parallelOptimized=true

-------------------------------------------------------
 T E S T S
-------------------------------------------------------
Running org.apache.phoenix.rpc.PhoenixServerRpcIT
Running org.apache.phoenix.execute.PartialCommitIT
Running org.apache.phoenix.rpc.PhoenixClientRpcIT
Running org.apache.phoenix.mapreduce.IndexToolIT
Tests run: 6, Failures: 0, Errors: 0, Skipped: 0, Time elapsed: 5.138 sec - in org.apache.phoenix.execute.PartialCommitIT
Tests run: 2, Failures: 0, Errors: 0, Skipped: 0, Time elapsed: 17.552 sec - in org.apache.phoenix.rpc.PhoenixServerRpcIT
Tests run: 2, Failures: 0, Errors: 0, Skipped: 0, Time elapsed: 13.875 sec - in org.apache.phoenix.rpc.PhoenixClientRpcIT
Running org.apache.phoenix.end2end.StatsCollectorIT
Running org.apache.phoenix.end2end.ViewIT
Running org.apache.phoenix.mapreduce.CsvBulkLoadToolIT
Tests run: 15, Failures: 0, Errors: 0, Skipped: 0, Time elapsed: 31.494 sec - in org.apache.phoenix.end2end.ViewIT
Running org.apache.phoenix.end2end.AlterTableIT
Tests run: 4, Failures: 0, Errors: 0, Skipped: 0, Time elapsed: 60.915 sec - in org.apache.phoenix.end2end.StatsCollectorIT
Running org.apache.phoenix.end2end.SaltedViewIT
Tests run: 2, Failures: 0, Errors: 0, Skipped: 0, Time elapsed: 11.387 sec - in org.apache.phoenix.end2end.SaltedViewIT
Running org.apache.phoenix.end2end.index.ImmutableIndexWithStatsIT
Tests run: 1, Failures: 0, Errors: 0, Skipped: 0, Time elapsed: 12.617 sec - in org.apache.phoenix.end2end.index.ImmutableIndexWithStatsIT
Running org.apache.phoenix.end2end.index.MutableIndexReplicationIT
Tests run: 1, Failures: 0, Errors: 0, Skipped: 0, Time elapsed: 18.264 sec - in org.apache.phoenix.end2end.index.MutableIndexReplicationIT
Running org.apache.phoenix.end2end.index.MutableIndexFailureIT
Tests run: 5, Failures: 0, Errors: 0, Skipped: 0, Time elapsed: 245.486 sec - in org.apache.phoenix.mapreduce.IndexToolIT
Running org.apache.phoenix.end2end.SpillableGroupByIT
Tests run: 1, Failures: 0, Errors: 0, Skipped: 0, Time elapsed: 11.244 sec - in org.apache.phoenix.end2end.SpillableGroupByIT
Running org.apache.phoenix.end2end.CountDistinctCompressionIT
Tests run: 1, Failures: 0, Errors: 0, Skipped: 0, Time elapsed: 8.152 sec - in org.apache.phoenix.end2end.CountDistinctCompressionIT
Running org.apache.phoenix.end2end.KeyOnlyIT
Tests run: 3, Failures: 0, Errors: 0, Skipped: 0, Time elapsed: 144.718 sec - in org.apache.phoenix.end2end.index.MutableIndexFailureIT
Tests run: 6, Failures: 0, Errors: 0, Skipped: 0, Time elapsed: 293.501 sec - in org.apache.phoenix.mapreduce.CsvBulkLoadToolIT
Running org.apache.phoenix.end2end.TenantSpecificTablesDDLIT
Tests run: 3, Failures: 0, Errors: 0, Skipped: 0, Time elapsed: 18.858 sec - in org.apache.phoenix.end2end.KeyOnlyIT
Running org.apache.phoenix.end2end.TenantSpecificTablesDMLIT
Running org.apache.phoenix.end2end.ContextClassloaderIT
Tests run: 3, Failures: 0, Errors: 0, Skipped: 0, Time elapsed: 10.509 sec - in org.apache.phoenix.end2end.ContextClassloaderIT
Tests run: 16, Failures: 0, Errors: 0, Skipped: 0, Time elapsed: 31.83 sec - in org.apache.phoenix.end2end.TenantSpecificTablesDMLIT
Tests run: 51, Failures: 0, Errors: 0, Skipped: 0, Time elapsed: 299.082 sec - in org.apache.phoenix.end2end.AlterTableIT
Running org.apache.phoenix.end2end.QueryTimeoutIT
Tests run: 18, Failures: 0, Errors: 0, Skipped: 0, Time elapsed: 51.597 sec - in org.apache.phoenix.end2end.TenantSpecificTablesDDLIT
Running org.apache.phoenix.end2end.StatsCollectorWithSplitsAndMultiCFIT
Running org.apache.phoenix.end2end.QueryWithLimitIT
Running org.apache.phoenix.end2end.UnionAllIT
Tests run: 2, Failures: 0, Errors: 0, Skipped: 0, Time elapsed: 9.546 sec - in org.apache.phoenix.end2end.QueryWithLimitIT
Tests run: 1, Failures: 0, Errors: 0, Skipped: 0, Time elapsed: 21.447 sec - in org.apache.phoenix.end2end.QueryTimeoutIT
Running org.apache.phoenix.hbase.index.covered.EndToEndCoveredColumnsIndexBuilderIT
Running org.apache.phoenix.end2end.ParallelIteratorsIT
Tests run: 2, Failures: 0, Errors: 0, Skipped: 0, Time elapsed: 9.532 sec - in org.apache.phoenix.hbase.index.covered.EndToEndCoveredColumnsIndexBuilderIT
Tests run: 2, Failures: 0, Errors: 0, Skipped: 0, Time elapsed: 31.881 sec - in org.apache.phoenix.end2end.StatsCollectorWithSplitsAndMultiCFIT
Tests run: 11, Failures: 0, Errors: 0, Skipped: 0, Time elapsed: 20.116 sec - in org.apache.phoenix.end2end.UnionAllIT
Running org.apache.phoenix.hbase.index.covered.example.EndtoEndIndexingWithCompressionIT
Running org.apache.phoenix.hbase.index.covered.example.EndToEndCoveredIndexingIT
Running org.apache.phoenix.hbase.index.covered.example.FailWithoutRetriesIT
Tests run: 2, Failures: 0, Errors: 0, Skipped: 0, Time elapsed: 19.532 sec - in org.apache.phoenix.end2end.ParallelIteratorsIT
Tests run: 1, Failures: 0, Errors: 0, Skipped: 0, Time elapsed: 8.978 sec - in org.apache.phoenix.hbase.index.covered.example.FailWithoutRetriesIT
Running org.apache.phoenix.hbase.index.FailForUnsupportedHBaseVersionsIT
Running org.apache.phoenix.hbase.index.balancer.IndexLoadBalancerIT
Tests run: 2, Failures: 0, Errors: 0, Skipped: 0, Time elapsed: 16.459 sec - in org.apache.phoenix.hbase.index.FailForUnsupportedHBaseVersionsIT
Running org.apache.hadoop.hbase.regionserver.wal.WALReplayWithIndexWritesAndCompressedWALIT
Tests run: 1, Failures: 0, Errors: 0, Skipped: 0, Time elapsed: 13.482 sec - in org.apache.hadoop.hbase.regionserver.wal.WALReplayWithIndexWritesAndCompressedWALIT
Running org.apache.hadoop.hbase.regionserver.wal.WALReplayWithIndexWritesAndUncompressedWALInHBase_094_9_IT
Tests run: 11, Failures: 0, Errors: 0, Skipped: 0, Time elapsed: 49.555 sec - in org.apache.phoenix.hbase.index.covered.example.EndtoEndIndexingWithCompressionIT
Tests run: 11, Failures: 0, Errors: 0, Skipped: 0, Time elapsed: 49.81 sec - in org.apache.phoenix.hbase.index.covered.example.EndToEndCoveredIndexingIT
Tests run: 1, Failures: 0, Errors: 0, Skipped: 0, Time elapsed: 13.188 sec - in org.apache.hadoop.hbase.regionserver.wal.WALReplayWithIndexWritesAndUncompressedWALInHBase_094_9_IT
Tests run: 9, Failures: 0, Errors: 0, Skipped: 0, Time elapsed: 105.112 sec - in org.apache.phoenix.hbase.index.balancer.IndexLoadBalancerIT
Running org.apache.phoenix.end2end.MultiCfQueryExecIT
Tests run: 7, Failures: 0, Errors: 0, Skipped: 0, Time elapsed: 21.449 sec - in org.apache.phoenix.end2end.MultiCfQueryExecIT

Results :




Tests run: 203, Failures: 0, Errors: 0, Skipped: 0

[INFO] 
[INFO] --- maven-failsafe-plugin:2.18:verify (ClientManagedTimeTests) @ phoenix-core ---
[INFO] Failsafe report directory: <https://builds.apache.org/job/Phoenix-master/ws/phoenix-core/target/failsafe-reports>
[INFO] ------------------------------------------------------------------------
[INFO] Reactor Summary:
[INFO] 
[INFO] Apache Phoenix .................................... SUCCESS [2.637s]
[INFO] Phoenix Core ...................................... FAILURE [34:45.828s]
[INFO] Phoenix - Flume ................................... SKIPPED
[INFO] Phoenix - Pig ..................................... SKIPPED
[INFO] Phoenix Query Server Client ....................... SKIPPED
[INFO] Phoenix Query Server .............................. SKIPPED
[INFO] Phoenix - Spark ................................... SKIPPED
[INFO] Phoenix Assembly .................................. SKIPPED
[INFO] Phoenix - Pherf ................................... SKIPPED
[INFO] ------------------------------------------------------------------------
[INFO] BUILD FAILURE
[INFO] ------------------------------------------------------------------------
[INFO] Total time: 34:49.088s
[INFO] Finished at: Fri Apr 24 20:56:31 UTC 2015
[INFO] Final Memory: 53M/1055M
[INFO] ------------------------------------------------------------------------
[ERROR] Failed to execute goal org.apache.maven.plugins:maven-failsafe-plugin:2.18:verify
(ClientManagedTimeTests) on project phoenix-core: There are test failures.
[ERROR] 
[ERROR] Please refer to <https://builds.apache.org/job/Phoenix-master/ws/phoenix-core/target/failsafe-reports>
for the individual test results.
[ERROR] -> [Help 1]
[ERROR] 
[ERROR] To see the full stack trace of the errors, re-run Maven with the -e switch.
[ERROR] Re-run Maven using the -X switch to enable full debug logging.
[ERROR] 
[ERROR] For more information about the errors and possible solutions, please read the following
articles:
[ERROR] [Help 1] http://cwiki.apache.org/confluence/display/MAVEN/MojoFailureException
[ERROR] 
[ERROR] After correcting the problems, you can resume the build with the command
[ERROR]   mvn <goals> -rf :phoenix-core
Build step 'Invoke top-level Maven targets' marked build as failure
Archiving artifacts
Sending artifact delta relative to Phoenix | Master #701
Archived 1003 artifacts
Archive block size is 32768
Received 8888 blocks and 714691449 bytes
Compression is 29.0%
Took 6 min 54 sec
Updating PHOENIX-1917
Recording test results

Mime
View raw message