phoenix-commits mailing list archives

Site index · List index
Message view « Date » · « Thread »
Top « Date » · « Thread »
From Apache Jenkins Server <jenk...@builds.apache.org>
Subject Build failed in Jenkins: Phoenix | Master #682
Date Thu, 16 Apr 2015 00:31:43 GMT
See <https://builds.apache.org/job/Phoenix-master/682/changes>

Changes:

[ndimiduk] PHOENIX-1865 Fix missing ASL headers

------------------------------------------
[...truncated 1186 lines...]
	at org.apache.hadoop.hbase.protobuf.generated.ClientProtos$ClientService$2.callBlockingMethod(ClientProtos.java:31313)
	at org.apache.hadoop.hbase.ipc.RpcServer.call(RpcServer.java:2031)
	at org.apache.hadoop.hbase.ipc.CallRunner.run(CallRunner.java:107)
	at org.apache.hadoop.hbase.ipc.RpcExecutor.consumerLoop(RpcExecutor.java:130)
	at org.apache.hadoop.hbase.ipc.RpcExecutor$1.run(RpcExecutor.java:107)
	at java.lang.Thread.run(Thread.java:724)
Caused by: java.lang.NullPointerException
	at org.apache.phoenix.expression.util.regex.JavaPattern.substr(JavaPattern.java:83)
	at org.apache.phoenix.expression.function.RegexpSubstrFunction.evaluate(RegexpSubstrFunction.java:118)
	at org.apache.phoenix.index.IndexMaintainer.buildRowKey(IndexMaintainer.java:453)
	at org.apache.phoenix.index.IndexMaintainer.buildDeleteMutation(IndexMaintainer.java:842)
	at org.apache.phoenix.index.PhoenixIndexCodec.getIndexUpdates(PhoenixIndexCodec.java:173)
	at org.apache.phoenix.index.PhoenixIndexCodec.getIndexDeletes(PhoenixIndexCodec.java:119)
	at org.apache.phoenix.hbase.index.covered.CoveredColumnsIndexBuilder.addDeleteUpdatesToMap(CoveredColumnsIndexBuilder.java:403)
	at org.apache.phoenix.hbase.index.covered.CoveredColumnsIndexBuilder.addCleanupForCurrentBatch(CoveredColumnsIndexBuilder.java:287)
	at org.apache.phoenix.hbase.index.covered.CoveredColumnsIndexBuilder.addMutationsForBatch(CoveredColumnsIndexBuilder.java:239)
	at org.apache.phoenix.hbase.index.covered.CoveredColumnsIndexBuilder.batchMutationAndAddUpdates(CoveredColumnsIndexBuilder.java:136)
	at org.apache.phoenix.hbase.index.covered.CoveredColumnsIndexBuilder.getIndexUpdate(CoveredColumnsIndexBuilder.java:99)
	at org.apache.phoenix.hbase.index.builder.IndexBuildManager$1.call(IndexBuildManager.java:133)
	at org.apache.phoenix.hbase.index.builder.IndexBuildManager$1.call(IndexBuildManager.java:129)
	at java.util.concurrent.FutureTask$Sync.innerRun(FutureTask.java:334)
	at java.util.concurrent.FutureTask.run(FutureTask.java:166)
	at java.util.concurrent.ThreadPoolExecutor.runWorker(ThreadPoolExecutor.java:1145)
	at java.util.concurrent.ThreadPoolExecutor$Worker.run(ThreadPoolExecutor.java:615)
	... 1 more
: 2 times, 
	at org.apache.hadoop.hbase.client.AsyncProcess$BatchErrors.makeException(AsyncProcess.java:227)
	at org.apache.hadoop.hbase.client.AsyncProcess$BatchErrors.access$1700(AsyncProcess.java:207)
	at org.apache.hadoop.hbase.client.AsyncProcess$AsyncRequestFutureImpl.getErrors(AsyncProcess.java:1563)
	at org.apache.hadoop.hbase.client.HTable.batch(HTable.java:928)
	at org.apache.hadoop.hbase.client.HTable.batch(HTable.java:942)
	at org.apache.phoenix.execute.MutationState.commit(MutationState.java:422)
	at org.apache.phoenix.jdbc.PhoenixConnection$3.call(PhoenixConnection.java:439)
	at org.apache.phoenix.jdbc.PhoenixConnection$3.call(PhoenixConnection.java:436)
	at org.apache.phoenix.call.CallRunner.run(CallRunner.java:53)
	at org.apache.phoenix.jdbc.PhoenixConnection.commit(PhoenixConnection.java:436)
	at org.apache.phoenix.end2end.index.IndexExpressionIT.helpTestCaseSensitiveFunctionIndex(IndexExpressionIT.java:1321)
	at org.apache.phoenix.end2end.index.IndexExpressionIT.testImmutableCaseSensitiveFunctionIndex(IndexExpressionIT.java:1277)

Running org.apache.phoenix.end2end.LikeExpressionIT
Tests run: 1, Failures: 0, Errors: 0, Skipped: 0, Time elapsed: 3.441 sec - in org.apache.phoenix.end2end.LikeExpressionIT
Running org.apache.phoenix.end2end.DecodeFunctionIT
Tests run: 3, Failures: 0, Errors: 0, Skipped: 0, Time elapsed: 22.501 sec - in org.apache.phoenix.end2end.StoreNullsIT
Running org.apache.phoenix.end2end.ExecuteStatementsIT
Tests run: 6, Failures: 0, Errors: 0, Skipped: 0, Time elapsed: 6.346 sec - in org.apache.phoenix.end2end.DecodeFunctionIT
Running org.apache.phoenix.end2end.SpooledTmpFileDeleteIT
Tests run: 1, Failures: 0, Errors: 0, Skipped: 0, Time elapsed: 4.74 sec - in org.apache.phoenix.end2end.SpooledTmpFileDeleteIT
Running org.apache.phoenix.end2end.ServerExceptionIT
Tests run: 1, Failures: 0, Errors: 0, Skipped: 0, Time elapsed: 3.783 sec - in org.apache.phoenix.end2end.ServerExceptionIT
Running org.apache.phoenix.end2end.ToDateFunctionIT
Tests run: 10, Failures: 0, Errors: 0, Skipped: 0, Time elapsed: 5.162 sec - in org.apache.phoenix.end2end.ToDateFunctionIT
Running org.apache.phoenix.end2end.CSVCommonsLoaderIT
Tests run: 2, Failures: 0, Errors: 0, Skipped: 0, Time elapsed: 19.19 sec - in org.apache.phoenix.end2end.ExecuteStatementsIT
Running org.apache.phoenix.end2end.AlterSessionIT
Tests run: 2, Failures: 0, Errors: 0, Skipped: 0, Time elapsed: 3.041 sec - in org.apache.phoenix.end2end.AlterSessionIT
Running org.apache.phoenix.end2end.MappingTableDataTypeIT
Tests run: 26, Failures: 0, Errors: 0, Skipped: 0, Time elapsed: 42.482 sec - in org.apache.phoenix.end2end.ArithmeticQueryIT
Running org.apache.phoenix.end2end.TenantSpecificViewIndexIT
Tests run: 1, Failures: 0, Errors: 0, Skipped: 0, Time elapsed: 9.28 sec - in org.apache.phoenix.end2end.MappingTableDataTypeIT
Running org.apache.phoenix.end2end.InListIT
Tests run: 15, Failures: 0, Errors: 0, Skipped: 0, Time elapsed: 32.348 sec - in org.apache.phoenix.end2end.CSVCommonsLoaderIT
Running org.apache.phoenix.end2end.StatementHintsIT
Tests run: 2, Failures: 0, Errors: 0, Skipped: 0, Time elapsed: 4.142 sec - in org.apache.phoenix.end2end.StatementHintsIT
Running org.apache.phoenix.end2end.TenantSpecificViewIndexSaltedIT
Tests run: 7, Failures: 0, Errors: 0, Skipped: 0, Time elapsed: 24.45 sec - in org.apache.phoenix.end2end.TenantSpecificViewIndexIT
Running org.apache.phoenix.end2end.TimezoneOffsetFunctionIT
Tests run: 7, Failures: 0, Errors: 0, Skipped: 0, Time elapsed: 11.482 sec - in org.apache.phoenix.end2end.TimezoneOffsetFunctionIT
Running org.apache.phoenix.end2end.QueryExecWithoutSCNIT
Tests run: 4, Failures: 0, Errors: 0, Skipped: 0, Time elapsed: 17.285 sec - in org.apache.phoenix.end2end.TenantSpecificViewIndexSaltedIT
Tests run: 1, Failures: 0, Errors: 0, Skipped: 0, Time elapsed: 4.318 sec - in org.apache.phoenix.end2end.QueryExecWithoutSCNIT
Running org.apache.phoenix.end2end.LpadFunctionIT
Running org.apache.phoenix.end2end.PhoenixMetricsIT
Tests run: 4, Failures: 0, Errors: 0, Skipped: 0, Time elapsed: 7.847 sec - in org.apache.phoenix.end2end.PhoenixMetricsIT
Running org.apache.phoenix.end2end.CoalesceFunctionIT
Tests run: 10, Failures: 0, Errors: 0, Skipped: 0, Time elapsed: 21.448 sec - in org.apache.phoenix.end2end.LpadFunctionIT
Running org.apache.phoenix.end2end.RegexpReplaceFunctionIT
Tests run: 10, Failures: 0, Errors: 0, Skipped: 0, Time elapsed: 17.87 sec - in org.apache.phoenix.end2end.CoalesceFunctionIT
Tests run: 2, Failures: 0, Errors: 0, Skipped: 0, Time elapsed: 4.931 sec - in org.apache.phoenix.end2end.RegexpReplaceFunctionIT
Running org.apache.phoenix.end2end.EvaluationOfORIT
Running org.apache.phoenix.end2end.LastValueFunctionIT
Tests run: 1, Failures: 0, Errors: 0, Skipped: 0, Time elapsed: 3.44 sec - in org.apache.phoenix.end2end.EvaluationOfORIT
Running org.apache.phoenix.end2end.SkipScanAfterManualSplitIT
Tests run: 11, Failures: 0, Errors: 0, Skipped: 0, Time elapsed: 13.632 sec - in org.apache.phoenix.end2end.LastValueFunctionIT
Running org.apache.phoenix.end2end.salted.SaltedTableVarLengthRowKeyIT
Tests run: 1, Failures: 0, Errors: 0, Skipped: 0, Time elapsed: 5.182 sec - in org.apache.phoenix.end2end.salted.SaltedTableVarLengthRowKeyIT
Running org.apache.phoenix.end2end.salted.SaltedTableUpsertSelectIT
Tests run: 25, Failures: 0, Errors: 0, Skipped: 0, Time elapsed: 93.633 sec - in org.apache.phoenix.end2end.InListIT
Running org.apache.phoenix.end2end.DynamicFamilyIT
Tests run: 4, Failures: 0, Errors: 0, Skipped: 0, Time elapsed: 6.351 sec - in org.apache.phoenix.end2end.DynamicFamilyIT
Running org.apache.phoenix.end2end.MinMaxAggregateFunctionIT
Tests run: 1, Failures: 0, Errors: 0, Skipped: 0, Time elapsed: 3.193 sec - in org.apache.phoenix.end2end.MinMaxAggregateFunctionIT
Running org.apache.phoenix.end2end.SubqueryIT
Tests run: 5, Failures: 0, Errors: 0, Skipped: 0, Time elapsed: 18.564 sec - in org.apache.phoenix.end2end.salted.SaltedTableUpsertSelectIT
Running org.apache.phoenix.end2end.ArrayAppendFunctionIT
Tests run: 3, Failures: 0, Errors: 0, Skipped: 0, Time elapsed: 40.265 sec - in org.apache.phoenix.end2end.SkipScanAfterManualSplitIT
Running org.apache.phoenix.end2end.ReverseScanIT
Tests run: 2, Failures: 0, Errors: 0, Skipped: 0, Time elapsed: 6.151 sec - in org.apache.phoenix.end2end.ReverseScanIT
Running org.apache.phoenix.end2end.SortMergeJoinIT
Tests run: 35, Failures: 0, Errors: 0, Skipped: 0, Time elapsed: 40.465 sec - in org.apache.phoenix.end2end.ArrayAppendFunctionIT
Running org.apache.phoenix.end2end.SignFunctionEnd2EndIT
Tests run: 2, Failures: 0, Errors: 0, Skipped: 0, Time elapsed: 9.835 sec - in org.apache.phoenix.end2end.SignFunctionEnd2EndIT
Running org.apache.phoenix.end2end.QueryMoreIT
Tests run: 21, Failures: 0, Errors: 0, Skipped: 0, Time elapsed: 76.912 sec - in org.apache.phoenix.end2end.SubqueryIT
Running org.apache.phoenix.end2end.ConvertTimezoneFunctionIT
Tests run: 7, Failures: 0, Errors: 0, Skipped: 0, Time elapsed: 6.308 sec - in org.apache.phoenix.end2end.ConvertTimezoneFunctionIT
Running org.apache.phoenix.trace.PhoenixTraceReaderIT
Tests run: 5, Failures: 0, Errors: 0, Skipped: 0, Time elapsed: 27.916 sec - in org.apache.phoenix.end2end.QueryMoreIT
Tests run: 2, Failures: 0, Errors: 0, Skipped: 0, Time elapsed: 2.488 sec - in org.apache.phoenix.trace.PhoenixTraceReaderIT
Running org.apache.phoenix.trace.PhoenixTracingEndToEndIT
Running org.apache.phoenix.trace.PhoenixTableMetricsWriterIT
Tests run: 2, Failures: 0, Errors: 0, Skipped: 0, Time elapsed: 0.946 sec - in org.apache.phoenix.trace.PhoenixTableMetricsWriterIT
Tests run: 105, Failures: 0, Errors: 0, Skipped: 0, Time elapsed: 381.536 sec - in org.apache.phoenix.end2end.SpooledSortMergeJoinIT
Tests run: 6, Failures: 0, Errors: 0, Skipped: 0, Time elapsed: 90.1 sec - in org.apache.phoenix.trace.PhoenixTracingEndToEndIT
Tests run: 105, Failures: 0, Errors: 0, Skipped: 0, Time elapsed: 430.301 sec - in org.apache.phoenix.end2end.HashJoinIT
Tests run: 105, Failures: 0, Errors: 0, Skipped: 0, Time elapsed: 388.678 sec - in org.apache.phoenix.end2end.SortMergeJoinIT

Results :


Tests in error: 
  IndexExpressionIT.testImmutableCaseSensitiveFunctionIndex:1277->helpTestCaseSensitiveFunctionIndex:1321
» Commit
  IndexExpressionIT.testImmutableLocalCaseSensitiveFunctionIndex:1282->helpTestCaseSensitiveFunctionIndex:1321
» Commit


Tests run: 908, Failures: 0, Errors: 2, Skipped: 0

[INFO] 
[INFO] --- maven-failsafe-plugin:2.18:integration-test (NeedTheirOwnClusterTests) @ phoenix-core
---
[INFO] Failsafe report directory: <https://builds.apache.org/job/Phoenix-master/ws/phoenix-core/target/failsafe-reports>
[INFO] parallel='none', perCoreThreadCount=true, threadCount=0, useUnlimitedThreads=false,
threadCountSuites=0, threadCountClasses=0, threadCountMethods=0, parallelOptimized=true

-------------------------------------------------------
 T E S T S
-------------------------------------------------------
Running org.apache.phoenix.end2end.index.MutableIndexFailureIT
Running org.apache.phoenix.end2end.ViewIT
Running org.apache.phoenix.end2end.TenantSpecificTablesDMLIT
Running org.apache.phoenix.end2end.index.ImmutableIndexWithStatsIT
Running org.apache.phoenix.end2end.index.MutableIndexReplicationIT
Tests run: 1, Failures: 0, Errors: 0, Skipped: 0, Time elapsed: 13.29 sec - in org.apache.phoenix.end2end.index.ImmutableIndexWithStatsIT
Running org.apache.phoenix.end2end.index.DropIndexDuringUpsertIT
Tests run: 1, Failures: 0, Errors: 0, Skipped: 1, Time elapsed: 0 sec - in org.apache.phoenix.end2end.index.DropIndexDuringUpsertIT
Tests run: 1, Failures: 0, Errors: 0, Skipped: 0, Time elapsed: 21.257 sec - in org.apache.phoenix.end2end.index.MutableIndexReplicationIT
Running org.apache.phoenix.end2end.QueryTimeoutIT
Tests run: 16, Failures: 0, Errors: 0, Skipped: 0, Time elapsed: 44.721 sec - in org.apache.phoenix.end2end.TenantSpecificTablesDMLIT
Running org.apache.phoenix.end2end.QueryWithLimitIT
Tests run: 15, Failures: 0, Errors: 0, Skipped: 0, Time elapsed: 46.433 sec - in org.apache.phoenix.end2end.ViewIT
Tests run: 1, Failures: 0, Errors: 0, Skipped: 0, Time elapsed: 18.245 sec - in org.apache.phoenix.end2end.QueryTimeoutIT
Tests run: 2, Failures: 0, Errors: 0, Skipped: 0, Time elapsed: 17.921 sec - in org.apache.phoenix.end2end.QueryWithLimitIT
Running org.apache.phoenix.end2end.KeyOnlyIT
Running org.apache.phoenix.end2end.StatsCollectorIT
Running org.apache.phoenix.end2end.ContextClassloaderIT
Tests run: 3, Failures: 0, Errors: 0, Skipped: 0, Time elapsed: 17.738 sec - in org.apache.phoenix.end2end.KeyOnlyIT
Running org.apache.phoenix.end2end.UnionAllIT
Tests run: 3, Failures: 0, Errors: 0, Skipped: 0, Time elapsed: 6.769 sec - in org.apache.phoenix.end2end.ContextClassloaderIT
Running org.apache.phoenix.end2end.MultiCfQueryExecIT
Running org.apache.phoenix.end2end.SaltedViewIT
Tests run: 11, Failures: 0, Errors: 0, Skipped: 0, Time elapsed: 28.608 sec - in org.apache.phoenix.end2end.UnionAllIT
Tests run: 7, Failures: 0, Errors: 0, Skipped: 0, Time elapsed: 17.767 sec - in org.apache.phoenix.end2end.MultiCfQueryExecIT
Tests run: 2, Failures: 0, Errors: 0, Skipped: 0, Time elapsed: 17.128 sec - in org.apache.phoenix.end2end.SaltedViewIT
Tests run: 4, Failures: 0, Errors: 0, Skipped: 0, Time elapsed: 57.117 sec - in org.apache.phoenix.end2end.StatsCollectorIT
Running org.apache.phoenix.end2end.AlterTableIT
Running org.apache.phoenix.end2end.TenantSpecificTablesDDLIT
Running org.apache.phoenix.end2end.CountDistinctCompressionIT
Running org.apache.phoenix.end2end.SpillableGroupByIT
Tests run: 3, Failures: 0, Errors: 0, Skipped: 0, Time elapsed: 178.984 sec - in org.apache.phoenix.end2end.index.MutableIndexFailureIT
Tests run: 1, Failures: 0, Errors: 0, Skipped: 0, Time elapsed: 8.296 sec - in org.apache.phoenix.end2end.CountDistinctCompressionIT
Tests run: 1, Failures: 0, Errors: 0, Skipped: 0, Time elapsed: 7.619 sec - in org.apache.phoenix.end2end.SpillableGroupByIT
Running org.apache.phoenix.end2end.StatsCollectorWithSplitsAndMultiCFIT
Running org.apache.phoenix.end2end.ParallelIteratorsIT
Running org.apache.phoenix.mapreduce.IndexToolIT
Tests run: 18, Failures: 0, Errors: 0, Skipped: 0, Time elapsed: 49.534 sec - in org.apache.phoenix.end2end.TenantSpecificTablesDDLIT
Tests run: 2, Failures: 0, Errors: 0, Skipped: 0, Time elapsed: 18.251 sec - in org.apache.phoenix.end2end.ParallelIteratorsIT
Running org.apache.phoenix.hbase.index.FailForUnsupportedHBaseVersionsIT
Tests run: 2, Failures: 0, Errors: 0, Skipped: 0, Time elapsed: 27.94 sec - in org.apache.phoenix.end2end.StatsCollectorWithSplitsAndMultiCFIT
Running org.apache.phoenix.hbase.index.covered.example.EndToEndCoveredIndexingIT
Tests run: 2, Failures: 0, Errors: 0, Skipped: 0, Time elapsed: 17.718 sec - in org.apache.phoenix.hbase.index.FailForUnsupportedHBaseVersionsIT
Running org.apache.phoenix.hbase.index.covered.example.EndtoEndIndexingWithCompressionIT
Running org.apache.phoenix.mapreduce.CsvBulkLoadToolIT
Tests run: 11, Failures: 0, Errors: 0, Skipped: 0, Time elapsed: 59.399 sec - in org.apache.phoenix.hbase.index.covered.example.EndToEndCoveredIndexingIT
Running org.apache.phoenix.hbase.index.covered.example.FailWithoutRetriesIT
Tests run: 11, Failures: 0, Errors: 0, Skipped: 0, Time elapsed: 59.477 sec - in org.apache.phoenix.hbase.index.covered.example.EndtoEndIndexingWithCompressionIT
Tests run: 1, Failures: 0, Errors: 0, Skipped: 0, Time elapsed: 9.107 sec - in org.apache.phoenix.hbase.index.covered.example.FailWithoutRetriesIT
Running org.apache.phoenix.hbase.index.covered.EndToEndCoveredColumnsIndexBuilderIT
Running org.apache.phoenix.hbase.index.balancer.IndexLoadBalancerIT
Tests run: 2, Failures: 0, Errors: 0, Skipped: 0, Time elapsed: 9.346 sec - in org.apache.phoenix.hbase.index.covered.EndToEndCoveredColumnsIndexBuilderIT
Running org.apache.phoenix.rpc.PhoenixClientRpcIT
Tests run: 2, Failures: 0, Errors: 0, Skipped: 0, Time elapsed: 8.965 sec - in org.apache.phoenix.rpc.PhoenixClientRpcIT
Running org.apache.phoenix.rpc.PhoenixServerRpcIT
Tests run: 2, Failures: 0, Errors: 0, Skipped: 0, Time elapsed: 11.434 sec - in org.apache.phoenix.rpc.PhoenixServerRpcIT
Running org.apache.hadoop.hbase.regionserver.wal.WALReplayWithIndexWritesAndCompressedWALIT
Tests run: 1, Failures: 0, Errors: 0, Skipped: 0, Time elapsed: 17.721 sec - in org.apache.hadoop.hbase.regionserver.wal.WALReplayWithIndexWritesAndCompressedWALIT
Running org.apache.hadoop.hbase.regionserver.wal.WALReplayWithIndexWritesAndUncompressedWALInHBase_094_9_IT
Tests run: 1, Failures: 0, Errors: 0, Skipped: 0, Time elapsed: 18.621 sec - in org.apache.hadoop.hbase.regionserver.wal.WALReplayWithIndexWritesAndUncompressedWALInHBase_094_9_IT
Tests run: 9, Failures: 0, Errors: 0, Skipped: 0, Time elapsed: 115.885 sec - in org.apache.phoenix.hbase.index.balancer.IndexLoadBalancerIT
Tests run: 5, Failures: 0, Errors: 0, Skipped: 0, Time elapsed: 233.012 sec - in org.apache.phoenix.mapreduce.IndexToolIT
Tests run: 51, Failures: 0, Errors: 0, Skipped: 0, Time elapsed: 297.353 sec - in org.apache.phoenix.end2end.AlterTableIT
Tests run: 6, Failures: 0, Errors: 0, Skipped: 0, Time elapsed: 266.331 sec - in org.apache.phoenix.mapreduce.CsvBulkLoadToolIT

Results :




Tests run: 198, Failures: 0, Errors: 0, Skipped: 1

[INFO] 
[INFO] --- maven-failsafe-plugin:2.18:verify (ClientManagedTimeTests) @ phoenix-core ---
[INFO] Failsafe report directory: <https://builds.apache.org/job/Phoenix-master/ws/phoenix-core/target/failsafe-reports>
[INFO] ------------------------------------------------------------------------
[INFO] Reactor Summary:
[INFO] 
[INFO] Apache Phoenix .................................... SUCCESS [2.924s]
[INFO] Phoenix Core ...................................... FAILURE [33:30.140s]
[INFO] Phoenix - Flume ................................... SKIPPED
[INFO] Phoenix - Pig ..................................... SKIPPED
[INFO] Phoenix Assembly .................................. SKIPPED
[INFO] Phoenix - Pherf ................................... SKIPPED
[INFO] Phoenix - Spark ................................... SKIPPED
[INFO] ------------------------------------------------------------------------
[INFO] BUILD FAILURE
[INFO] ------------------------------------------------------------------------
[INFO] Total time: 33:33.664s
[INFO] Finished at: Thu Apr 16 00:26:56 UTC 2015
[INFO] Final Memory: 54M/1142M
[INFO] ------------------------------------------------------------------------
[ERROR] Failed to execute goal org.apache.maven.plugins:maven-failsafe-plugin:2.18:verify
(ClientManagedTimeTests) on project phoenix-core: There are test failures.
[ERROR] 
[ERROR] Please refer to <https://builds.apache.org/job/Phoenix-master/ws/phoenix-core/target/failsafe-reports>
for the individual test results.
[ERROR] -> [Help 1]
[ERROR] 
[ERROR] To see the full stack trace of the errors, re-run Maven with the -e switch.
[ERROR] Re-run Maven using the -X switch to enable full debug logging.
[ERROR] 
[ERROR] For more information about the errors and possible solutions, please read the following
articles:
[ERROR] [Help 1] http://cwiki.apache.org/confluence/display/MAVEN/MojoFailureException
[ERROR] 
[ERROR] After correcting the problems, you can resume the build with the command
[ERROR]   mvn <goals> -rf :phoenix-core
Build step 'Invoke top-level Maven targets' marked build as failure
Archiving artifacts
Sending artifact delta relative to Phoenix | Master #676
Archived 1017 artifacts
Archive block size is 32768
Received 11131 blocks and 630651542 bytes
Compression is 36.6%
Took 4 min 39 sec
Updating PHOENIX-1865
Recording test results

Mime
View raw message