phoenix-commits mailing list archives

Site index · List index
Message view « Date » · « Thread »
Top « Date » · « Thread »
From Apache Jenkins Server <jenk...@builds.apache.org>
Subject Build failed in Jenkins: Phoenix | Master #667
Date Mon, 06 Apr 2015 21:59:59 GMT
See <https://builds.apache.org/job/Phoenix-master/667/changes>

Changes:

[jamestaylor] PHOENIX-1794 Support Long.MIN_VALUE for phoenix BIGINT type

------------------------------------------
[...truncated 9690 lines...]
6889/7326 KB   
6893/7326 KB   
6897/7326 KB   
6901/7326 KB   
6905/7326 KB   
6909/7326 KB   
6913/7326 KB   
6917/7326 KB   
6921/7326 KB   
6925/7326 KB   
6929/7326 KB   
6933/7326 KB   
6937/7326 KB   
6941/7326 KB   
6945/7326 KB   
6949/7326 KB   
6953/7326 KB   
6957/7326 KB   
6961/7326 KB   
6965/7326 KB   
6969/7326 KB   
6973/7326 KB   
6977/7326 KB   
6981/7326 KB   
6985/7326 KB   
6989/7326 KB   
6993/7326 KB   
6997/7326 KB   
7001/7326 KB   
7005/7326 KB   
7009/7326 KB   
7013/7326 KB   
7017/7326 KB   
7021/7326 KB   
7025/7326 KB   
7029/7326 KB   
7033/7326 KB   
7037/7326 KB   
7041/7326 KB   
7045/7326 KB   
7049/7326 KB   
7053/7326 KB   
7057/7326 KB   
7061/7326 KB   
7065/7326 KB   
7069/7326 KB   
7073/7326 KB   
7077/7326 KB   
7081/7326 KB   
7085/7326 KB   
7089/7326 KB   
7093/7326 KB   
7097/7326 KB   
7101/7326 KB   
7105/7326 KB   
7109/7326 KB   
7113/7326 KB   
7117/7326 KB   
7121/7326 KB   
7125/7326 KB   
7129/7326 KB   
7133/7326 KB   
7137/7326 KB   
7141/7326 KB   
7145/7326 KB   
7149/7326 KB   
7153/7326 KB   
7157/7326 KB   
7161/7326 KB   
7165/7326 KB   
7169/7326 KB   
7173/7326 KB   
7177/7326 KB   
7181/7326 KB   
7185/7326 KB   
7189/7326 KB   
7193/7326 KB   
7197/7326 KB   
7201/7326 KB   
7205/7326 KB   
7209/7326 KB   
7213/7326 KB   
7217/7326 KB   
7221/7326 KB   
7225/7326 KB   
7229/7326 KB   
7233/7326 KB   
7237/7326 KB   
7241/7326 KB   
7245/7326 KB   
7249/7326 KB   
7253/7326 KB   
7257/7326 KB   
7261/7326 KB   
7265/7326 KB   
7269/7326 KB   
7273/7326 KB   
7277/7326 KB   
7281/7326 KB   
7285/7326 KB   
7289/7326 KB   
7293/7326 KB   
7297/7326 KB   
7301/7326 KB   
7305/7326 KB   
7309/7326 KB   
7313/7326 KB   
7317/7326 KB   
7321/7326 KB   
7325/7326 KB   
7326/7326 KB   
               
Downloaded: http://repo.maven.apache.org/maven2/org/scalatest/scalatest_2.10/2.2.2/scalatest_2.10-2.2.2.jar
(7326 KB at 8720.3 KB/sec)
[INFO] 
[INFO] --- maven-clean-plugin:2.5:clean (default-clean) @ phoenix-spark ---
[INFO] 
[INFO] --- maven-remote-resources-plugin:1.5:process (default) @ phoenix-spark ---
[INFO] 
[INFO] --- maven-resources-plugin:2.6:resources (default-resources) @ phoenix-spark ---
[INFO] Using 'UTF-8' encoding to copy filtered resources.
[INFO] skip non existing resourceDirectory <https://builds.apache.org/job/Phoenix-master/ws/phoenix-spark/src/main/resources>
[INFO] Copying 3 resources
[INFO] 
[INFO] --- scala-maven-plugin:3.2.0:add-source (scala-compile-first) @ phoenix-spark ---
[INFO] Add Source directory: <https://builds.apache.org/job/Phoenix-master/ws/phoenix-spark/src/main/scala>
[INFO] Add Test Source directory: <https://builds.apache.org/job/Phoenix-master/ws/phoenix-spark/src/test/scala>
[INFO] 
[INFO] --- scala-maven-plugin:3.2.0:compile (scala-compile-first) @ phoenix-spark ---
[WARNING]  Expected all dependencies to require Scala version: 2.10.4
[WARNING]  org.apache.phoenix:phoenix-spark:4.4.0-SNAPSHOT requires scala version: 2.10.4
[WARNING]  org.scalatest:scalatest_2.10:2.2.2 requires scala version: 2.10.4
[WARNING]  org.scalamock:scalamock-scalatest-support_2.10:3.1.4 requires scala version: 2.10.4
[WARNING]  org.scalamock:scalamock-core_2.10:3.1.4 requires scala version: 2.10.4
[WARNING]  com.twitter:chill_2.10:0.5.0 requires scala version: 2.10.4
[WARNING]  org.spark-project.akka:akka-remote_2.10:2.3.4-spark requires scala version: 2.10.4
[WARNING]  org.spark-project.akka:akka-actor_2.10:2.3.4-spark requires scala version: 2.10.4
[WARNING]  org.spark-project.akka:akka-slf4j_2.10:2.3.4-spark requires scala version: 2.10.4
[WARNING]  org.apache.spark:spark-core_2.10:1.3.0 requires scala version: 2.10.4
[WARNING]  org.json4s:json4s-jackson_2.10:3.2.10 requires scala version: 2.10.0
[WARNING] Multiple versions of scala libraries detected!
[INFO] <https://builds.apache.org/job/Phoenix-master/ws/phoenix-spark/src/main/scala>:-1:
info: compiling
[INFO] Compiling 6 source files to <https://builds.apache.org/job/Phoenix-master/ws/phoenix-spark/target/classes>
at 1428357226119
[WARNING] warning: Class org.joda.convert.FromString not found - continuing with a stub.
[WARNING] warning: Class org.joda.convert.ToString not found - continuing with a stub.
[WARNING] warning: Class org.joda.convert.ToString not found - continuing with a stub.
[WARNING] warning: Class org.joda.convert.FromString not found - continuing with a stub.
[WARNING] warning: Class org.joda.convert.ToString not found - continuing with a stub.
[WARNING] warning: Class org.joda.convert.FromString not found - continuing with a stub.
[WARNING] warning: Class org.joda.convert.FromString not found - continuing with a stub.
[WARNING] warning: there were 3 feature warning(s); re-run with -feature for details
[WARNING] 8 warnings found
[INFO] prepare-compile in 0 s
[INFO] compile in 8 s
[INFO] 
[INFO] --- maven-compiler-plugin:3.0:compile (default-compile) @ phoenix-spark ---
[INFO] Changes detected - recompiling the module!
[INFO] 
[INFO] --- maven-resources-plugin:2.6:testResources (default-testResources) @ phoenix-spark
---
[INFO] Using 'UTF-8' encoding to copy filtered resources.
[INFO] Copying 2 resources
[INFO] Copying 3 resources
[INFO] 
[INFO] --- scala-maven-plugin:3.2.0:testCompile (scala-test-compile) @ phoenix-spark ---
[WARNING]  Expected all dependencies to require Scala version: 2.10.4
[WARNING]  org.apache.phoenix:phoenix-spark:4.4.0-SNAPSHOT requires scala version: 2.10.4
[WARNING]  org.scalatest:scalatest_2.10:2.2.2 requires scala version: 2.10.4
[WARNING]  org.scalamock:scalamock-scalatest-support_2.10:3.1.4 requires scala version: 2.10.4
[WARNING]  org.scalamock:scalamock-core_2.10:3.1.4 requires scala version: 2.10.4
[WARNING]  com.twitter:chill_2.10:0.5.0 requires scala version: 2.10.4
[WARNING]  org.spark-project.akka:akka-remote_2.10:2.3.4-spark requires scala version: 2.10.4
[WARNING]  org.spark-project.akka:akka-actor_2.10:2.3.4-spark requires scala version: 2.10.4
[WARNING]  org.spark-project.akka:akka-slf4j_2.10:2.3.4-spark requires scala version: 2.10.4
[WARNING]  org.apache.spark:spark-core_2.10:1.3.0 requires scala version: 2.10.4
[WARNING]  org.json4s:json4s-jackson_2.10:3.2.10 requires scala version: 2.10.0
[WARNING] Multiple versions of scala libraries detected!
[INFO] <https://builds.apache.org/job/Phoenix-master/ws/phoenix-spark/src/test/scala>:-1:
info: compiling
[INFO] Compiling 1 source files to <https://builds.apache.org/job/Phoenix-master/ws/phoenix-spark/target/test-classes>
at 1428357235220
[WARNING] warning: Class org.apache.hadoop.mapred.MiniMRCluster not found - continuing with
a stub.
[WARNING] warning: Class org.joda.convert.FromString not found - continuing with a stub.
[WARNING] warning: Class org.joda.convert.ToString not found - continuing with a stub.
[WARNING] warning: Class org.joda.convert.ToString not found - continuing with a stub.
[WARNING] warning: Class org.joda.convert.FromString not found - continuing with a stub.
[WARNING] warning: Class org.joda.convert.ToString not found - continuing with a stub.
[WARNING] warning: Class org.joda.convert.FromString not found - continuing with a stub.
[WARNING] warning: Class org.joda.convert.FromString not found - continuing with a stub.
[WARNING] 8 warnings found
[INFO] prepare-compile in 0 s
[INFO] compile in 9 s
[INFO] 
[INFO] --- maven-compiler-plugin:3.0:testCompile (default-testCompile) @ phoenix-spark ---
[INFO] Changes detected - recompiling the module!
[INFO] 
[INFO] --- maven-surefire-plugin:2.18:test (default-test) @ phoenix-spark ---
[INFO] Surefire report directory: <https://builds.apache.org/job/Phoenix-master/ws/phoenix-spark/target/surefire-reports>

-------------------------------------------------------
 T E S T S
-------------------------------------------------------

Results :




Tests run: 0, Failures: 0, Errors: 0, Skipped: 0

[INFO] 
[INFO] --- scalatest-maven-plugin:1.0:test (test) @ phoenix-spark ---
Error occurred during initialization of VM
Could not reserve enough space for object heap
Error: Could not create the Java Virtual Machine.
Error: A fatal exception has occurred. Program will exit.
[INFO] ------------------------------------------------------------------------
[INFO] Reactor Summary:
[INFO] 
[INFO] Apache Phoenix .................................... SUCCESS [1.730s]
[INFO] Phoenix Core ...................................... SUCCESS [23:37.260s]
[INFO] Phoenix - Flume ................................... SUCCESS [1:00.271s]
[INFO] Phoenix - Pig ..................................... SUCCESS [2:19.740s]
[INFO] Phoenix Assembly .................................. SUCCESS [35.686s]
[INFO] Phoenix - Pherf ................................... SUCCESS [28.999s]
[INFO] Phoenix - Spark ................................... FAILURE [43.414s]
[INFO] ------------------------------------------------------------------------
[INFO] BUILD FAILURE
[INFO] ------------------------------------------------------------------------
[INFO] Total time: 28:47.569s
[INFO] Finished at: Mon Apr 06 21:54:05 UTC 2015
[INFO] Final Memory: 85M/1052M
[INFO] ------------------------------------------------------------------------
[ERROR] Failed to execute goal org.scalatest:scalatest-maven-plugin:1.0:test (test) on project
phoenix-spark: There are test failures -> [Help 1]
[ERROR] 
[ERROR] To see the full stack trace of the errors, re-run Maven with the -e switch.
[ERROR] Re-run Maven using the -X switch to enable full debug logging.
[ERROR] 
[ERROR] For more information about the errors and possible solutions, please read the following
articles:
[ERROR] [Help 1] http://cwiki.apache.org/confluence/display/MAVEN/MojoFailureException
[ERROR] 
[ERROR] After correcting the problems, you can resume the build with the command
[ERROR]   mvn <goals> -rf :phoenix-spark
Build step 'Invoke top-level Maven targets' marked build as failure
Archiving artifacts
Sending artifact delta relative to Phoenix | Master #661
Archived 1016 artifacts
Archive block size is 32768
Received 8470 blocks and 731979842 bytes
Compression is 27.5%
Took 5 min 48 sec
Updating PHOENIX-1794
Recording test results

Mime
View raw message