phoenix-commits mailing list archives

Site index · List index
Message view « Date » · « Thread »
Top « Date » · « Thread »
From Apache Jenkins Server <jenk...@builds.apache.org>
Subject Build failed in Jenkins: Phoenix | Master #735
Date Wed, 29 Apr 2015 20:41:16 GMT
See <https://builds.apache.org/job/Phoenix-master/735/changes>

Changes:

[rajeshbabu] PHOENIX-1856 Include min row key for each region in stats row -addendum(Ram)

------------------------------------------
[...truncated 617 lines...]
Tests run: 1, Failures: 0, Errors: 0, Skipped: 0, Time elapsed: 0.004 sec - in org.apache.phoenix.expression.RegexpSubstrFunctionTest
Running org.apache.phoenix.expression.ArithmeticOperationTest
Tests run: 6, Failures: 0, Errors: 0, Skipped: 0, Time elapsed: 0.013 sec - in org.apache.phoenix.expression.ArithmeticOperationTest
Running org.apache.phoenix.jdbc.PhoenixDriverTest
Tests run: 4, Failures: 0, Errors: 0, Skipped: 0, Time elapsed: 0.122 sec - in org.apache.phoenix.util.PhoenixEncodeDecodeTest
Running org.apache.phoenix.util.MetaDataUtilTest
Tests run: 3, Failures: 0, Errors: 0, Skipped: 0, Time elapsed: 0.009 sec - in org.apache.phoenix.util.MetaDataUtilTest
Running org.apache.phoenix.util.IndexUtilTest
Tests run: 2, Failures: 0, Errors: 0, Skipped: 0, Time elapsed: 0 sec - in org.apache.phoenix.util.IndexUtilTest
Running org.apache.phoenix.util.PhoenixContextExecutorTest
Tests run: 1, Failures: 0, Errors: 0, Skipped: 0, Time elapsed: 0.001 sec - in org.apache.phoenix.util.PhoenixContextExecutorTest
Running org.apache.phoenix.trace.TraceMetricsSourceTest
Tests run: 3, Failures: 0, Errors: 0, Skipped: 0, Time elapsed: 0.181 sec - in org.apache.phoenix.jdbc.PhoenixDriverTest
Running org.apache.phoenix.jdbc.PhoenixResultSetMetadataTest
Tests run: 3, Failures: 0, Errors: 0, Skipped: 0, Time elapsed: 0.179 sec - in org.apache.phoenix.trace.TraceMetricsSourceTest
Running org.apache.phoenix.cache.JodaTimezoneCacheTest
Tests run: 4, Failures: 0, Errors: 0, Skipped: 0, Time elapsed: 0.036 sec - in org.apache.phoenix.cache.JodaTimezoneCacheTest
Running org.apache.phoenix.compile.SelectStatementRewriterTest
Tests run: 1, Failures: 0, Errors: 0, Skipped: 0, Time elapsed: 0.095 sec - in org.apache.phoenix.jdbc.PhoenixResultSetMetadataTest
Running org.apache.phoenix.jdbc.PhoenixEmbeddedDriverTest
Tests run: 3, Failures: 0, Errors: 0, Skipped: 0, Time elapsed: 0.001 sec - in org.apache.phoenix.jdbc.PhoenixEmbeddedDriverTest
Running org.apache.phoenix.mapreduce.CsvToKeyValueMapperTest
Tests run: 5, Failures: 0, Errors: 0, Skipped: 0, Time elapsed: 0.176 sec - in org.apache.phoenix.compile.SelectStatementRewriterTest
Running org.apache.phoenix.compile.ViewCompilerTest
Tests run: 9, Failures: 0, Errors: 0, Skipped: 0, Time elapsed: 0.174 sec - in org.apache.phoenix.mapreduce.CsvToKeyValueMapperTest
Running org.apache.phoenix.mapreduce.util.ColumnInfoToStringEncoderDecoderTest
Tests run: 3, Failures: 0, Errors: 0, Skipped: 0, Time elapsed: 0.001 sec - in org.apache.phoenix.mapreduce.util.ColumnInfoToStringEncoderDecoderTest
Running org.apache.phoenix.mapreduce.CsvBulkLoadToolTest
Tests run: 8, Failures: 0, Errors: 0, Skipped: 0, Time elapsed: 0.01 sec - in org.apache.phoenix.mapreduce.CsvBulkLoadToolTest
Running org.apache.phoenix.mapreduce.CsvBulkImportUtilTest
Tests run: 2, Failures: 0, Errors: 0, Skipped: 0, Time elapsed: 0.057 sec - in org.apache.phoenix.mapreduce.CsvBulkImportUtilTest
Running org.apache.phoenix.util.csv.StringToArrayConverterTest
Tests run: 4, Failures: 0, Errors: 0, Skipped: 0, Time elapsed: 0.093 sec - in org.apache.phoenix.util.csv.StringToArrayConverterTest
Running org.apache.phoenix.util.ByteUtilTest
Tests run: 3, Failures: 0, Errors: 0, Skipped: 0, Time elapsed: 0.239 sec - in org.apache.phoenix.compile.ViewCompilerTest
Running org.apache.phoenix.compile.QueryOptimizerTest
Tests run: 3, Failures: 0, Errors: 0, Skipped: 0, Time elapsed: 0.094 sec - in org.apache.phoenix.util.ByteUtilTest
Running org.apache.phoenix.util.ScanUtilTest
Tests run: 20, Failures: 0, Errors: 0, Skipped: 0, Time elapsed: 0.01 sec - in org.apache.phoenix.util.ScanUtilTest
Running org.apache.phoenix.util.StringUtilTest
Tests run: 5, Failures: 0, Errors: 0, Skipped: 0, Time elapsed: 0 sec - in org.apache.phoenix.util.StringUtilTest
Running org.apache.phoenix.util.Base62EncoderTest
Tests run: 1, Failures: 0, Errors: 0, Skipped: 0, Time elapsed: 0.014 sec - in org.apache.phoenix.util.Base62EncoderTest
Running org.apache.phoenix.util.PropertiesUtilTest
Tests run: 2, Failures: 0, Errors: 0, Skipped: 0, Time elapsed: 0 sec - in org.apache.phoenix.util.PropertiesUtilTest
Running org.apache.phoenix.util.ColumnInfoTest
Tests run: 4, Failures: 0, Errors: 0, Skipped: 0, Time elapsed: 0 sec - in org.apache.phoenix.util.ColumnInfoTest
Running org.apache.phoenix.util.LogUtilTest
Tests run: 3, Failures: 0, Errors: 0, Skipped: 0, Time elapsed: 0.145 sec - in org.apache.phoenix.util.LogUtilTest
Running org.apache.phoenix.util.QueryUtilTest
Tests run: 6, Failures: 0, Errors: 0, Skipped: 0, Time elapsed: 0.014 sec - in org.apache.phoenix.util.QueryUtilTest
Running org.apache.phoenix.util.LikeExpressionTest
Tests run: 1, Failures: 0, Errors: 0, Skipped: 0, Time elapsed: 0 sec - in org.apache.phoenix.util.LikeExpressionTest
Running org.apache.phoenix.index.IndexMaintainerTest
Tests run: 23, Failures: 0, Errors: 0, Skipped: 0, Time elapsed: 0.415 sec - in org.apache.phoenix.index.IndexMaintainerTest
Running org.apache.phoenix.memory.MemoryManagerTest
Tests run: 37, Failures: 0, Errors: 0, Skipped: 0, Time elapsed: 0.969 sec - in org.apache.phoenix.compile.QueryOptimizerTest
Running org.apache.phoenix.compile.ScanRangesTest
Tests run: 34, Failures: 0, Errors: 0, Skipped: 0, Time elapsed: 0.028 sec - in org.apache.phoenix.compile.ScanRangesTest
Running org.apache.phoenix.compile.HavingCompilerTest
Tests run: 11, Failures: 0, Errors: 0, Skipped: 0, Time elapsed: 0.071 sec - in org.apache.phoenix.compile.HavingCompilerTest
Running org.apache.phoenix.compile.WhereCompilerTest
Tests run: 43, Failures: 0, Errors: 0, Skipped: 1, Time elapsed: 0.209 sec - in org.apache.phoenix.compile.WhereCompilerTest
Running org.apache.phoenix.compile.ScanRangesIntersectTest
Tests run: 1, Failures: 0, Errors: 0, Skipped: 0, Time elapsed: 0 sec - in org.apache.phoenix.compile.ScanRangesIntersectTest
Running org.apache.phoenix.parse.BuiltInFunctionInfoTest
Tests run: 3, Failures: 0, Errors: 0, Skipped: 0, Time elapsed: 0.002 sec - in org.apache.phoenix.parse.BuiltInFunctionInfoTest
Running org.apache.phoenix.hbase.index.write.TestIndexWriter
Tests run: 5, Failures: 0, Errors: 0, Skipped: 0, Time elapsed: 0.077 sec - in org.apache.phoenix.hbase.index.write.TestIndexWriter
Running org.apache.phoenix.hbase.index.write.TestCachingHTableFactory
Tests run: 1, Failures: 0, Errors: 0, Skipped: 0, Time elapsed: 0.014 sec - in org.apache.phoenix.hbase.index.write.TestCachingHTableFactory
Running org.apache.phoenix.hbase.index.write.TestWALRecoveryCaching
Tests run: 1, Failures: 0, Errors: 0, Skipped: 1, Time elapsed: 0.001 sec - in org.apache.phoenix.hbase.index.write.TestWALRecoveryCaching
Running org.apache.phoenix.hbase.index.covered.filter.TestNewerTimestampFilter
Tests run: 1, Failures: 0, Errors: 0, Skipped: 0, Time elapsed: 0.001 sec - in org.apache.phoenix.hbase.index.covered.filter.TestNewerTimestampFilter
Running org.apache.phoenix.hbase.index.covered.filter.TestFamilyOnlyFilter
Tests run: 3, Failures: 0, Errors: 0, Skipped: 0, Time elapsed: 0.005 sec - in org.apache.phoenix.hbase.index.covered.filter.TestFamilyOnlyFilter
Running org.apache.phoenix.hbase.index.covered.example.TestColumnTracker
Tests run: 3, Failures: 0, Errors: 0, Skipped: 0, Time elapsed: 0.001 sec - in org.apache.phoenix.hbase.index.covered.example.TestColumnTracker
Running org.apache.phoenix.hbase.index.covered.TestLocalTableState
Tests run: 3, Failures: 0, Errors: 0, Skipped: 0, Time elapsed: 0.129 sec - in org.apache.phoenix.hbase.index.covered.TestLocalTableState
Running org.apache.phoenix.hbase.index.util.TestIndexManagementUtil
Tests run: 3, Failures: 0, Errors: 0, Skipped: 0, Time elapsed: 0.011 sec - in org.apache.phoenix.hbase.index.util.TestIndexManagementUtil
Running org.apache.phoenix.schema.ValueBitSetTest
Tests run: 4, Failures: 0, Errors: 0, Skipped: 0, Time elapsed: 0.003 sec - in org.apache.phoenix.schema.ValueBitSetTest
Running org.apache.phoenix.schema.types.PVarcharArrayToStringTest
Tests run: 8, Failures: 0, Errors: 0, Skipped: 0, Time elapsed: 0.001 sec - in org.apache.phoenix.schema.types.PVarcharArrayToStringTest
Running org.apache.phoenix.schema.types.PrimitiveShortPhoenixArrayToStringTest
Tests run: 6, Failures: 0, Errors: 0, Skipped: 0, Time elapsed: 0 sec - in org.apache.phoenix.schema.types.PrimitiveShortPhoenixArrayToStringTest
Running org.apache.phoenix.schema.types.PDateArrayToStringTest
Tests run: 6, Failures: 0, Errors: 0, Skipped: 0, Time elapsed: 0.003 sec - in org.apache.phoenix.schema.types.PDateArrayToStringTest
Running org.apache.phoenix.schema.types.PDataTypeTest
Tests run: 26, Failures: 0, Errors: 0, Skipped: 0, Time elapsed: 0.045 sec - in org.apache.phoenix.schema.types.PDataTypeTest
Running org.apache.phoenix.schema.PMetaDataImplTest
Tests run: 1, Failures: 0, Errors: 0, Skipped: 0, Time elapsed: 0.003 sec - in org.apache.phoenix.schema.PMetaDataImplTest
Running org.apache.hadoop.hbase.ipc.PhoenixIndexRpcSchedulerTest
Tests run: 2, Failures: 0, Errors: 0, Skipped: 0, Time elapsed: 0.122 sec - in org.apache.hadoop.hbase.ipc.PhoenixIndexRpcSchedulerTest
Tests run: 5, Failures: 0, Errors: 0, Skipped: 1, Time elapsed: 6.007 sec - in org.apache.phoenix.memory.MemoryManagerTest
Running org.apache.phoenix.compile.WhereOptimizerTest
Tests run: 98, Failures: 0, Errors: 0, Skipped: 0, Time elapsed: 0.343 sec - in org.apache.phoenix.compile.WhereOptimizerTest
Running org.apache.phoenix.compile.LimitCompilerTest
Tests run: 6, Failures: 0, Errors: 0, Skipped: 0, Time elapsed: 0.058 sec - in org.apache.phoenix.compile.LimitCompilerTest
Running org.apache.phoenix.compile.QueryMetaDataTest
Tests run: 33, Failures: 0, Errors: 0, Skipped: 0, Time elapsed: 0.102 sec - in org.apache.phoenix.compile.QueryMetaDataTest
Running org.apache.phoenix.compile.JoinQueryCompilerTest
Tests run: 2, Failures: 0, Errors: 0, Skipped: 0, Time elapsed: 0.082 sec - in org.apache.phoenix.compile.JoinQueryCompilerTest
Running org.apache.phoenix.compile.TenantSpecificViewIndexCompileTest
Tests run: 3, Failures: 0, Errors: 0, Skipped: 0, Time elapsed: 0.102 sec - in org.apache.phoenix.compile.TenantSpecificViewIndexCompileTest
Running org.apache.phoenix.compile.StatementHintsCompilationTest
Tests run: 3, Failures: 0, Errors: 0, Skipped: 0, Time elapsed: 0.065 sec - in org.apache.phoenix.compile.StatementHintsCompilationTest
Running org.apache.phoenix.compile.QueryCompilerTest
Tests run: 100, Failures: 0, Errors: 3, Skipped: 0, Time elapsed: 0.312 sec <<< FAILURE!
- in org.apache.phoenix.compile.QueryCompilerTest
testRegex(org.apache.phoenix.compile.QueryCompilerTest)  Time elapsed: 0.002 sec  <<<
ERROR!
java.sql.SQLException: ERROR 6003 (42F03): User defined functions are configured to not be
allowed. To allow configure phoenix.functions.allowUserDefinedFunctions to true.
	at org.apache.phoenix.exception.SQLExceptionCode$Factory$1.newException(SQLExceptionCode.java:386)
	at org.apache.phoenix.exception.SQLExceptionInfo.buildException(SQLExceptionInfo.java:145)
	at org.apache.phoenix.jdbc.PhoenixStatement.throwIfUnallowedUserDefinedFunctions(PhoenixStatement.java:1504)
	at org.apache.phoenix.jdbc.PhoenixStatement.access$600(PhoenixStatement.java:166)
	at org.apache.phoenix.jdbc.PhoenixStatement$ExecutableSelectStatement.compilePlan(PhoenixStatement.java:354)
	at org.apache.phoenix.jdbc.PhoenixStatement$ExecutableSelectStatement.compilePlan(PhoenixStatement.java:338)
	at org.apache.phoenix.jdbc.PhoenixStatement$1.call(PhoenixStatement.java:246)
	at org.apache.phoenix.jdbc.PhoenixStatement$1.call(PhoenixStatement.java:241)
	at org.apache.phoenix.call.CallRunner.run(CallRunner.java:53)
	at org.apache.phoenix.jdbc.PhoenixStatement.executeQuery(PhoenixStatement.java:240)
	at org.apache.phoenix.jdbc.PhoenixStatement.executeQuery(PhoenixStatement.java:1223)
	at org.apache.phoenix.compile.QueryCompilerTest.testRegex(QueryCompilerTest.java:1583)

testNotKeyOrderedGroupByOptimization(org.apache.phoenix.compile.QueryCompilerTest)  Time elapsed:
0.004 sec  <<< ERROR!
java.sql.SQLException: ERROR 6003 (42F03): User defined functions are configured to not be
allowed. To allow configure phoenix.functions.allowUserDefinedFunctions to true.
	at org.apache.phoenix.exception.SQLExceptionCode$Factory$1.newException(SQLExceptionCode.java:386)
	at org.apache.phoenix.exception.SQLExceptionInfo.buildException(SQLExceptionInfo.java:145)
	at org.apache.phoenix.jdbc.PhoenixStatement.throwIfUnallowedUserDefinedFunctions(PhoenixStatement.java:1504)
	at org.apache.phoenix.jdbc.PhoenixStatement.access$600(PhoenixStatement.java:166)
	at org.apache.phoenix.jdbc.PhoenixStatement$ExecutableSelectStatement.compilePlan(PhoenixStatement.java:354)
	at org.apache.phoenix.jdbc.PhoenixStatement$ExecutableSelectStatement.compilePlan(PhoenixStatement.java:338)
	at org.apache.phoenix.jdbc.PhoenixStatement.compileQuery(PhoenixStatement.java:1196)
	at org.apache.phoenix.jdbc.PhoenixStatement.compileQuery(PhoenixStatement.java:1189)
	at org.apache.phoenix.compile.QueryCompilerTest.getQueryPlan(QueryCompilerTest.java:450)
	at org.apache.phoenix.compile.QueryCompilerTest.testNotKeyOrderedGroupByOptimization(QueryCompilerTest.java:651)

testRegexpSubstrSetScanKeys(org.apache.phoenix.compile.QueryCompilerTest)  Time elapsed: 0.001
sec  <<< ERROR!
java.sql.SQLException: ERROR 6003 (42F03): User defined functions are configured to not be
allowed. To allow configure phoenix.functions.allowUserDefinedFunctions to true.
	at org.apache.phoenix.exception.SQLExceptionCode$Factory$1.newException(SQLExceptionCode.java:386)
	at org.apache.phoenix.exception.SQLExceptionInfo.buildException(SQLExceptionInfo.java:145)
	at org.apache.phoenix.jdbc.PhoenixStatement.throwIfUnallowedUserDefinedFunctions(PhoenixStatement.java:1504)
	at org.apache.phoenix.jdbc.PhoenixStatement.access$600(PhoenixStatement.java:166)
	at org.apache.phoenix.jdbc.PhoenixStatement$ExecutableSelectStatement.compilePlan(PhoenixStatement.java:354)
	at org.apache.phoenix.jdbc.PhoenixStatement$ExecutableSelectStatement.compilePlan(PhoenixStatement.java:338)
	at org.apache.phoenix.jdbc.PhoenixStatement.compileQuery(PhoenixStatement.java:1196)
	at org.apache.phoenix.jdbc.PhoenixStatement.compileQuery(PhoenixStatement.java:1189)
	at org.apache.phoenix.compile.QueryCompilerTest.getQueryPlan(QueryCompilerTest.java:450)
	at org.apache.phoenix.compile.QueryCompilerTest.compileQuery(QueryCompilerTest.java:438)
	at org.apache.phoenix.compile.QueryCompilerTest.testRegexpSubstrSetScanKeys(QueryCompilerTest.java:864)

Running org.apache.phoenix.parse.QueryParserTest
Tests run: 58, Failures: 0, Errors: 0, Skipped: 0, Time elapsed: 0.028 sec - in org.apache.phoenix.parse.QueryParserTest
Running org.apache.phoenix.hbase.index.write.TestParalleWriterIndexCommitter
Tests run: 2, Failures: 0, Errors: 0, Skipped: 0, Time elapsed: 0.064 sec - in org.apache.phoenix.hbase.index.write.TestParalleWriterIndexCommitter
Running org.apache.phoenix.hbase.index.write.TestParalleIndexWriter
Tests run: 2, Failures: 0, Errors: 0, Skipped: 0, Time elapsed: 0.004 sec - in org.apache.phoenix.hbase.index.write.TestParalleIndexWriter
Running org.apache.phoenix.hbase.index.write.recovery.TestPerRegionIndexWriteCache
Tests run: 3, Failures: 0, Errors: 0, Skipped: 0, Time elapsed: 0.526 sec - in org.apache.phoenix.hbase.index.write.recovery.TestPerRegionIndexWriteCache
Running org.apache.phoenix.hbase.index.parallel.TestThreadPoolManager
Tests run: 3, Failures: 0, Errors: 0, Skipped: 0, Time elapsed: 0.005 sec - in org.apache.phoenix.hbase.index.parallel.TestThreadPoolManager
Running org.apache.phoenix.hbase.index.parallel.TestThreadPoolBuilder
Tests run: 2, Failures: 0, Errors: 0, Skipped: 0, Time elapsed: 0.001 sec - in org.apache.phoenix.hbase.index.parallel.TestThreadPoolBuilder
Running org.apache.phoenix.hbase.index.covered.filter.TestApplyAndFilterDeletesFilter
Tests run: 6, Failures: 0, Errors: 0, Skipped: 0, Time elapsed: 0.004 sec - in org.apache.phoenix.hbase.index.covered.filter.TestApplyAndFilterDeletesFilter
Running org.apache.phoenix.hbase.index.covered.example.TestCoveredColumnIndexCodec
Tests run: 3, Failures: 0, Errors: 0, Skipped: 0, Time elapsed: 0.027 sec - in org.apache.phoenix.hbase.index.covered.example.TestCoveredColumnIndexCodec
Running org.apache.phoenix.hbase.index.covered.update.TestIndexUpdateManager
Tests run: 2, Failures: 0, Errors: 0, Skipped: 0, Time elapsed: 0.002 sec - in org.apache.phoenix.hbase.index.covered.update.TestIndexUpdateManager
Running org.apache.phoenix.hbase.index.covered.data.TestIndexMemStore
Tests run: 2, Failures: 0, Errors: 0, Skipped: 0, Time elapsed: 0.002 sec - in org.apache.phoenix.hbase.index.covered.data.TestIndexMemStore
Running org.apache.phoenix.schema.SchemaUtilTest
Tests run: 6, Failures: 0, Errors: 0, Skipped: 0, Time elapsed: 0.001 sec - in org.apache.phoenix.schema.SchemaUtilTest
Running org.apache.phoenix.schema.SaltingUtilTest
Tests run: 2, Failures: 0, Errors: 0, Skipped: 0, Time elapsed: 0.001 sec - in org.apache.phoenix.schema.SaltingUtilTest
Running org.apache.phoenix.schema.RowKeySchemaTest
Tests run: 6, Failures: 0, Errors: 0, Skipped: 0, Time elapsed: 0.082 sec - in org.apache.phoenix.schema.RowKeySchemaTest
Running org.apache.phoenix.schema.types.PrimitiveIntPhoenixArrayToStringTest
Tests run: 6, Failures: 0, Errors: 0, Skipped: 0, Time elapsed: 0.001 sec - in org.apache.phoenix.schema.types.PrimitiveIntPhoenixArrayToStringTest
Running org.apache.phoenix.schema.types.PrimitiveFloatPhoenixArrayToStringTest
Tests run: 6, Failures: 0, Errors: 0, Skipped: 0, Time elapsed: 0.001 sec - in org.apache.phoenix.schema.types.PrimitiveFloatPhoenixArrayToStringTest
Running org.apache.phoenix.schema.types.PrimitiveBytePhoenixArrayToStringTest
Tests run: 6, Failures: 0, Errors: 0, Skipped: 0, Time elapsed: 0.001 sec - in org.apache.phoenix.schema.types.PrimitiveBytePhoenixArrayToStringTest
Running org.apache.phoenix.schema.types.PrimitiveLongPhoenixArrayToStringTest
Tests run: 6, Failures: 0, Errors: 0, Skipped: 0, Time elapsed: 0 sec - in org.apache.phoenix.schema.types.PrimitiveLongPhoenixArrayToStringTest
Running org.apache.phoenix.schema.SortOrderTest
Tests run: 8, Failures: 0, Errors: 0, Skipped: 0, Time elapsed: 0.002 sec - in org.apache.phoenix.schema.SortOrderTest
Running org.apache.phoenix.execute.MutationStateTest
Tests run: 1, Failures: 0, Errors: 0, Skipped: 0, Time elapsed: 0 sec - in org.apache.phoenix.execute.MutationStateTest
Running org.apache.hadoop.hbase.regionserver.PhoenixRpcSchedulerFactoryTest
Tests run: 2, Failures: 0, Errors: 0, Skipped: 0, Time elapsed: 0.012 sec - in org.apache.hadoop.hbase.regionserver.PhoenixRpcSchedulerFactoryTest

Results :


Tests in error: 
  QueryCompilerTest.testNotKeyOrderedGroupByOptimization:651->getQueryPlan:450 » SQL
  QueryCompilerTest.testRegex:1583 » SQL ERROR 6003 (42F03): User defined functi...
  QueryCompilerTest.testRegexpSubstrSetScanKeys:864->compileQuery:438->getQueryPlan:450
» SQL
  QueryPlanTest.testExplainPlan:179 » SQL ERROR 6003 (42F03): User defined funct...


Tests run: 1042, Failures: 0, Errors: 4, Skipped: 3

[INFO] ------------------------------------------------------------------------
[INFO] Reactor Summary:
[INFO] 
[INFO] Apache Phoenix .................................... SUCCESS [1.895s]
[INFO] Phoenix Core ...................................... FAILURE [39.597s]
[INFO] Phoenix - Flume ................................... SKIPPED
[INFO] Phoenix - Pig ..................................... SKIPPED
[INFO] Phoenix Query Server Client ....................... SKIPPED
[INFO] Phoenix Query Server .............................. SKIPPED
[INFO] Phoenix - Pherf ................................... SKIPPED
[INFO] Phoenix - Spark ................................... SKIPPED
[INFO] Phoenix Assembly .................................. SKIPPED
[INFO] ------------------------------------------------------------------------
[INFO] BUILD FAILURE
[INFO] ------------------------------------------------------------------------
[INFO] Total time: 42.008s
[INFO] Finished at: Wed Apr 29 20:38:57 UTC 2015
[INFO] Final Memory: 58M/853M
[INFO] ------------------------------------------------------------------------
[ERROR] Failed to execute goal org.apache.maven.plugins:maven-surefire-plugin:2.18:test (default-test)
on project phoenix-core: There are test failures.
[ERROR] 
[ERROR] Please refer to <https://builds.apache.org/job/Phoenix-master/ws/phoenix-core/target/surefire-reports>
for the individual test results.
[ERROR] -> [Help 1]
[ERROR] 
[ERROR] To see the full stack trace of the errors, re-run Maven with the -e switch.
[ERROR] Re-run Maven using the -X switch to enable full debug logging.
[ERROR] 
[ERROR] For more information about the errors and possible solutions, please read the following
articles:
[ERROR] [Help 1] http://cwiki.apache.org/confluence/display/MAVEN/MojoFailureException
[ERROR] 
[ERROR] After correcting the problems, you can resume the build with the command
[ERROR]   mvn <goals> -rf :phoenix-core
Build step 'Invoke top-level Maven targets' marked build as failure
Archiving artifacts
Sending artifact delta relative to Phoenix | Master #732
Archived 382 artifacts
Archive block size is 32768
Received 4561 blocks and 87650985 bytes
Compression is 63.0%
Took 2 min 15 sec
Updating PHOENIX-1856
Recording test results

Mime
View raw message