phoenix-commits mailing list archives

Site index · List index
Message view « Date » · « Thread »
Top « Date » · « Thread »
From Apache Jenkins Server <jenk...@builds.apache.org>
Subject Build failed in Jenkins: Phoenix | Master #704
Date Wed, 22 Apr 2015 05:53:30 GMT
See <https://builds.apache.org/job/Phoenix-master/704/changes>

Changes:

[samarth.jain] PHOENIX-1899 Performance regression for non-aggregate, unordered queries returning
0 or few records

------------------------------------------
[...truncated 1139 lines...]
Tests run: 25, Failures: 0, Errors: 0, Skipped: 0, Time elapsed: 55.178 sec - in org.apache.phoenix.end2end.InListIT
Running org.apache.phoenix.end2end.ModulusExpressionIT
Tests run: 20, Failures: 0, Errors: 0, Skipped: 0, Time elapsed: 135.088 sec - in org.apache.phoenix.end2end.index.LocalIndexIT
Running org.apache.phoenix.end2end.DecodeFunctionIT
Tests run: 11, Failures: 0, Errors: 0, Skipped: 0, Time elapsed: 4.81 sec - in org.apache.phoenix.end2end.ModulusExpressionIT
Running org.apache.phoenix.end2end.InstrFunctionIT
Tests run: 6, Failures: 0, Errors: 0, Skipped: 0, Time elapsed: 2.862 sec - in org.apache.phoenix.end2end.DecodeFunctionIT
Running org.apache.phoenix.end2end.MD5FunctionIT
Tests run: 20, Failures: 0, Errors: 0, Skipped: 0, Time elapsed: 37.526 sec - in org.apache.phoenix.end2end.DeleteIT
Tests run: 8, Failures: 0, Errors: 0, Skipped: 0, Time elapsed: 3.83 sec - in org.apache.phoenix.end2end.InstrFunctionIT
Running org.apache.phoenix.end2end.ExecuteStatementsIT
Running org.apache.phoenix.end2end.UpsertSelectAutoCommitIT
Tests run: 2, Failures: 0, Errors: 0, Skipped: 0, Time elapsed: 4.44 sec - in org.apache.phoenix.end2end.MD5FunctionIT
Running org.apache.phoenix.end2end.HashJoinIT
Tests run: 3, Failures: 0, Errors: 0, Skipped: 0, Time elapsed: 11.925 sec - in org.apache.phoenix.end2end.UpsertSelectAutoCommitIT
Running org.apache.phoenix.end2end.TenantSpecificViewIndexIT
Tests run: 2, Failures: 0, Errors: 0, Skipped: 0, Time elapsed: 13.135 sec - in org.apache.phoenix.end2end.ExecuteStatementsIT
Running org.apache.phoenix.end2end.CoalesceFunctionIT
Tests run: 10, Failures: 0, Errors: 0, Skipped: 0, Time elapsed: 7.472 sec - in org.apache.phoenix.end2end.CoalesceFunctionIT
Running org.apache.phoenix.end2end.TimezoneOffsetFunctionIT
Tests run: 7, Failures: 0, Errors: 0, Skipped: 0, Time elapsed: 5.195 sec - in org.apache.phoenix.end2end.TimezoneOffsetFunctionIT
Running org.apache.phoenix.end2end.SubqueryIT
Tests run: 7, Failures: 0, Errors: 0, Skipped: 0, Time elapsed: 17.883 sec - in org.apache.phoenix.end2end.TenantSpecificViewIndexIT
Running org.apache.phoenix.end2end.ArithmeticQueryIT
Tests run: 58, Failures: 0, Errors: 0, Skipped: 0, Time elapsed: 163.349 sec - in org.apache.phoenix.end2end.index.IndexExpressionIT
Running org.apache.phoenix.end2end.ReverseFunctionIT
Tests run: 105, Failures: 0, Errors: 0, Skipped: 0, Time elapsed: 280.275 sec - in org.apache.phoenix.end2end.SpooledSortMergeJoinIT
Running org.apache.phoenix.end2end.DateTimeIT
Tests run: 5, Failures: 0, Errors: 0, Skipped: 0, Time elapsed: 5.282 sec - in org.apache.phoenix.end2end.ReverseFunctionIT
Running org.apache.phoenix.end2end.RegexpSplitFunctionIT
Tests run: 11, Failures: 0, Errors: 0, Skipped: 0, Time elapsed: 8.022 sec - in org.apache.phoenix.end2end.RegexpSplitFunctionIT
Running org.apache.phoenix.end2end.FirstValueFunctionIT
Tests run: 19, Failures: 0, Errors: 0, Skipped: 0, Time elapsed: 17.177 sec - in org.apache.phoenix.end2end.DateTimeIT
Running org.apache.phoenix.end2end.QueryExecWithoutSCNIT
Tests run: 7, Failures: 0, Errors: 0, Skipped: 0, Time elapsed: 5.562 sec - in org.apache.phoenix.end2end.FirstValueFunctionIT
Running org.apache.phoenix.end2end.ConvertTimezoneFunctionIT
Tests run: 26, Failures: 0, Errors: 0, Skipped: 0, Time elapsed: 33.162 sec - in org.apache.phoenix.end2end.ArithmeticQueryIT
Running org.apache.phoenix.end2end.StatementHintsIT
Tests run: 1, Failures: 0, Errors: 0, Skipped: 0, Time elapsed: 2.727 sec - in org.apache.phoenix.end2end.QueryExecWithoutSCNIT
Running org.apache.phoenix.end2end.UpsertBigValuesIT
Tests run: 2, Failures: 0, Errors: 0, Skipped: 0, Time elapsed: 3.715 sec - in org.apache.phoenix.end2end.StatementHintsIT
Tests run: 7, Failures: 0, Errors: 0, Skipped: 0, Time elapsed: 5.186 sec - in org.apache.phoenix.end2end.ConvertTimezoneFunctionIT
Running org.apache.phoenix.end2end.salted.SaltedTableUpsertSelectIT
Running org.apache.phoenix.end2end.salted.SaltedTableVarLengthRowKeyIT
Tests run: 21, Failures: 0, Errors: 0, Skipped: 0, Time elapsed: 43.643 sec - in org.apache.phoenix.end2end.SubqueryIT
Running org.apache.phoenix.end2end.SortOrderFIT
Tests run: 1, Failures: 0, Errors: 0, Skipped: 0, Time elapsed: 3.175 sec - in org.apache.phoenix.end2end.salted.SaltedTableVarLengthRowKeyIT
Running org.apache.phoenix.end2end.QueryMoreIT
Tests run: 4, Failures: 0, Errors: 0, Skipped: 0, Time elapsed: 9.166 sec - in org.apache.phoenix.end2end.UpsertBigValuesIT
Running org.apache.phoenix.end2end.ReverseScanIT
Tests run: 30, Failures: 0, Errors: 0, Skipped: 0, Time elapsed: 9.176 sec - in org.apache.phoenix.end2end.SortOrderFIT
Running org.apache.phoenix.end2end.AlterSessionIT
Tests run: 2, Failures: 0, Errors: 0, Skipped: 0, Time elapsed: 3.761 sec - in org.apache.phoenix.end2end.ReverseScanIT
Running org.apache.phoenix.end2end.StoreNullsIT
Tests run: 5, Failures: 0, Errors: 0, Skipped: 0, Time elapsed: 11.267 sec - in org.apache.phoenix.end2end.salted.SaltedTableUpsertSelectIT
Running org.apache.phoenix.end2end.PhoenixRuntimeIT
Tests run: 2, Failures: 0, Errors: 0, Skipped: 0, Time elapsed: 2.949 sec - in org.apache.phoenix.end2end.AlterSessionIT
Running org.apache.phoenix.end2end.RegexpSubstrFunctionIT
Tests run: 2, Failures: 0, Errors: 0, Skipped: 0, Time elapsed: 1.92 sec - in org.apache.phoenix.end2end.RegexpSubstrFunctionIT
Running org.apache.phoenix.end2end.ServerExceptionIT
Tests run: 1, Failures: 0, Errors: 0, Skipped: 0, Time elapsed: 1.702 sec - in org.apache.phoenix.end2end.ServerExceptionIT
Running org.apache.phoenix.end2end.ArrayAppendFunctionIT
Tests run: 5, Failures: 0, Errors: 2, Skipped: 0, Time elapsed: 18.478 sec <<< FAILURE!
- in org.apache.phoenix.end2end.QueryMoreIT
testQueryMore1(org.apache.phoenix.end2end.QueryMoreIT)  Time elapsed: 4.177 sec  <<<
ERROR!
org.apache.phoenix.schema.TableNotFoundException: ERROR 1012 (42M03): Table undefined. tableName="HISTORY_TABLE_00Dxxxxxtenant1"
	at org.apache.phoenix.schema.PMetaDataImpl.getTable(PMetaDataImpl.java:241)
	at org.apache.phoenix.util.PhoenixRuntime.getTable(PhoenixRuntime.java:323)
	at org.apache.phoenix.util.PhoenixRuntime.encodeValues(PhoenixRuntime.java:849)
	at org.apache.phoenix.end2end.QueryMoreIT.getRecordsOutofCursorTable(QueryMoreIT.java:268)
	at org.apache.phoenix.end2end.QueryMoreIT.testQueryMore(QueryMoreIT.java:142)
	at org.apache.phoenix.end2end.QueryMoreIT.testQueryMore1(QueryMoreIT.java:50)

testQueryMore4(org.apache.phoenix.end2end.QueryMoreIT)  Time elapsed: 1.077 sec  <<<
ERROR!
org.apache.phoenix.schema.TableNotFoundException: ERROR 1012 (42M03): Table undefined. tableName="HISTORY_TABLE_00Dxxxxxtenant1"
	at org.apache.phoenix.schema.PMetaDataImpl.getTable(PMetaDataImpl.java:241)
	at org.apache.phoenix.util.PhoenixRuntime.getTable(PhoenixRuntime.java:323)
	at org.apache.phoenix.util.PhoenixRuntime.encodeValues(PhoenixRuntime.java:849)
	at org.apache.phoenix.end2end.QueryMoreIT.getRecordsOutofCursorTable(QueryMoreIT.java:268)
	at org.apache.phoenix.end2end.QueryMoreIT.testQueryMore(QueryMoreIT.java:142)
	at org.apache.phoenix.end2end.QueryMoreIT.testQueryMore4(QueryMoreIT.java:68)

Running org.apache.phoenix.end2end.AutoCommitIT
Tests run: 1, Failures: 0, Errors: 0, Skipped: 0, Time elapsed: 2.138 sec - in org.apache.phoenix.end2end.AutoCommitIT
Tests run: 2, Failures: 0, Errors: 0, Skipped: 0, Time elapsed: 14.627 sec - in org.apache.phoenix.end2end.PhoenixRuntimeIT
Running org.apache.phoenix.end2end.SortMergeJoinIT
Running org.apache.phoenix.end2end.StddevIT
Tests run: 35, Failures: 0, Errors: 0, Skipped: 0, Time elapsed: 11.98 sec - in org.apache.phoenix.end2end.ArrayAppendFunctionIT
Running org.apache.phoenix.end2end.SignFunctionEnd2EndIT
Tests run: 3, Failures: 0, Errors: 0, Skipped: 0, Time elapsed: 19.472 sec - in org.apache.phoenix.end2end.StoreNullsIT
Running org.apache.phoenix.end2end.LastValueFunctionIT
Tests run: 4, Failures: 0, Errors: 0, Skipped: 0, Time elapsed: 4.784 sec - in org.apache.phoenix.end2end.StddevIT
Running org.apache.phoenix.end2end.HashJoinLocalIndexIT
Tests run: 2, Failures: 0, Errors: 0, Skipped: 0, Time elapsed: 4.572 sec - in org.apache.phoenix.end2end.SignFunctionEnd2EndIT
Running org.apache.phoenix.end2end.RoundFloorCeilFunctionsEnd2EndIT
Tests run: 105, Failures: 0, Errors: 0, Skipped: 0, Time elapsed: 102.212 sec - in org.apache.phoenix.end2end.HashJoinIT
Running org.apache.phoenix.end2end.LpadFunctionIT
Tests run: 11, Failures: 0, Errors: 0, Skipped: 0, Time elapsed: 9.399 sec - in org.apache.phoenix.end2end.LastValueFunctionIT
Running org.apache.phoenix.iterate.RoundRobinResultIteratorIT
Tests run: 10, Failures: 0, Errors: 0, Skipped: 0, Time elapsed: 6.198 sec - in org.apache.phoenix.end2end.LpadFunctionIT
Tests run: 31, Failures: 0, Errors: 0, Skipped: 0, Time elapsed: 10.36 sec - in org.apache.phoenix.end2end.RoundFloorCeilFunctionsEnd2EndIT
Tests run: 1, Failures: 0, Errors: 0, Skipped: 0, Time elapsed: 14.876 sec - in org.apache.phoenix.end2end.HashJoinLocalIndexIT
Tests run: 7, Failures: 0, Errors: 0, Skipped: 0, Time elapsed: 47.886 sec - in org.apache.phoenix.iterate.RoundRobinResultIteratorIT
Tests run: 105, Failures: 0, Errors: 0, Skipped: 0, Time elapsed: 276.603 sec - in org.apache.phoenix.end2end.SortMergeJoinIT

Results :


Tests in error: 
  QueryMoreIT.testQueryMore1:50->testQueryMore:142->getRecordsOutofCursorTable:268 »
TableNotFound
  QueryMoreIT.testQueryMore4:68->testQueryMore:142->getRecordsOutofCursorTable:268 »
TableNotFound


Tests run: 915, Failures: 0, Errors: 2, Skipped: 0

[INFO] 
[INFO] --- maven-failsafe-plugin:2.18:integration-test (NeedTheirOwnClusterTests) @ phoenix-core
---
[INFO] Failsafe report directory: <https://builds.apache.org/job/Phoenix-master/ws/phoenix-core/target/failsafe-reports>
[INFO] parallel='none', perCoreThreadCount=true, threadCount=0, useUnlimitedThreads=false,
threadCountSuites=0, threadCountClasses=0, threadCountMethods=0, parallelOptimized=true

-------------------------------------------------------
 T E S T S
-------------------------------------------------------
Running org.apache.phoenix.hbase.index.balancer.IndexLoadBalancerIT
Running org.apache.phoenix.hbase.index.covered.example.FailWithoutRetriesIT
Running org.apache.phoenix.hbase.index.covered.example.EndToEndCoveredIndexingIT
Tests run: 1, Failures: 0, Errors: 0, Skipped: 0, Time elapsed: 9.163 sec - in org.apache.phoenix.hbase.index.covered.example.FailWithoutRetriesIT
Running org.apache.phoenix.rpc.PhoenixClientRpcIT
Running org.apache.phoenix.rpc.PhoenixServerRpcIT
Running org.apache.phoenix.hbase.index.covered.example.EndtoEndIndexingWithCompressionIT
Tests run: 2, Failures: 0, Errors: 0, Skipped: 0, Time elapsed: 8.408 sec - in org.apache.phoenix.rpc.PhoenixClientRpcIT
Running org.apache.phoenix.hbase.index.covered.EndToEndCoveredColumnsIndexBuilderIT
Tests run: 2, Failures: 0, Errors: 0, Skipped: 0, Time elapsed: 18.568 sec - in org.apache.phoenix.rpc.PhoenixServerRpcIT
Running org.apache.phoenix.hbase.index.FailForUnsupportedHBaseVersionsIT
Tests run: 2, Failures: 0, Errors: 0, Skipped: 0, Time elapsed: 9.421 sec - in org.apache.phoenix.hbase.index.covered.EndToEndCoveredColumnsIndexBuilderIT
Tests run: 2, Failures: 0, Errors: 0, Skipped: 0, Time elapsed: 16.685 sec - in org.apache.phoenix.hbase.index.FailForUnsupportedHBaseVersionsIT
Running org.apache.phoenix.end2end.SpillableGroupByIT
Tests run: 11, Failures: 0, Errors: 0, Skipped: 0, Time elapsed: 48.623 sec - in org.apache.phoenix.hbase.index.covered.example.EndToEndCoveredIndexingIT
Running org.apache.phoenix.end2end.KeyOnlyIT
Tests run: 1, Failures: 0, Errors: 0, Skipped: 0, Time elapsed: 11.725 sec - in org.apache.phoenix.end2end.SpillableGroupByIT
Tests run: 11, Failures: 0, Errors: 0, Skipped: 0, Time elapsed: 49.652 sec - in org.apache.phoenix.hbase.index.covered.example.EndtoEndIndexingWithCompressionIT
Running org.apache.phoenix.end2end.ParallelIteratorsIT
Tests run: 3, Failures: 0, Errors: 0, Skipped: 0, Time elapsed: 12.35 sec - in org.apache.phoenix.end2end.KeyOnlyIT
Running org.apache.phoenix.end2end.index.MutableIndexFailureIT
Running org.apache.phoenix.end2end.TenantSpecificTablesDDLIT
Running org.apache.phoenix.end2end.index.MutableIndexReplicationIT
Tests run: 2, Failures: 0, Errors: 0, Skipped: 0, Time elapsed: 19.05 sec - in org.apache.phoenix.end2end.ParallelIteratorsIT
Tests run: 1, Failures: 0, Errors: 0, Skipped: 0, Time elapsed: 18.471 sec - in org.apache.phoenix.end2end.index.MutableIndexReplicationIT
Running org.apache.phoenix.end2end.index.DropIndexDuringUpsertIT
Tests run: 1, Failures: 0, Errors: 0, Skipped: 1, Time elapsed: 0 sec - in org.apache.phoenix.end2end.index.DropIndexDuringUpsertIT
Tests run: 9, Failures: 0, Errors: 0, Skipped: 0, Time elapsed: 102.993 sec - in org.apache.phoenix.hbase.index.balancer.IndexLoadBalancerIT
Running org.apache.phoenix.end2end.index.ImmutableIndexWithStatsIT
Tests run: 1, Failures: 0, Errors: 0, Skipped: 0, Time elapsed: 8.588 sec - in org.apache.phoenix.end2end.index.ImmutableIndexWithStatsIT
Running org.apache.phoenix.end2end.ContextClassloaderIT
Running org.apache.phoenix.end2end.AlterTableIT
Tests run: 18, Failures: 0, Errors: 0, Skipped: 0, Time elapsed: 52.205 sec - in org.apache.phoenix.end2end.TenantSpecificTablesDDLIT
Tests run: 3, Failures: 0, Errors: 0, Skipped: 0, Time elapsed: 11.312 sec - in org.apache.phoenix.end2end.ContextClassloaderIT
Running org.apache.phoenix.end2end.ViewIT
Running org.apache.phoenix.end2end.QueryWithLimitIT
Tests run: 2, Failures: 0, Errors: 0, Skipped: 0, Time elapsed: 13.393 sec - in org.apache.phoenix.end2end.QueryWithLimitIT
Running org.apache.phoenix.end2end.StatsCollectorIT
Running org.apache.phoenix.end2end.StatsCollectorWithSplitsAndMultiCFIT
Tests run: 15, Failures: 0, Errors: 0, Skipped: 0, Time elapsed: 27.793 sec - in org.apache.phoenix.end2end.ViewIT
Running org.apache.phoenix.end2end.CountDistinctCompressionIT
Tests run: 1, Failures: 0, Errors: 0, Skipped: 0, Time elapsed: 9.654 sec - in org.apache.phoenix.end2end.CountDistinctCompressionIT
Tests run: 2, Failures: 0, Errors: 0, Skipped: 0, Time elapsed: 32.776 sec - in org.apache.phoenix.end2end.StatsCollectorWithSplitsAndMultiCFIT
Running org.apache.phoenix.end2end.SaltedViewIT
Running org.apache.phoenix.end2end.TenantSpecificTablesDMLIT
Tests run: 4, Failures: 0, Errors: 0, Skipped: 0, Time elapsed: 58.687 sec - in org.apache.phoenix.end2end.StatsCollectorIT
Tests run: 2, Failures: 0, Errors: 0, Skipped: 0, Time elapsed: 12.408 sec - in org.apache.phoenix.end2end.SaltedViewIT
Tests run: 3, Failures: 0, Errors: 0, Skipped: 0, Time elapsed: 143.209 sec - in org.apache.phoenix.end2end.index.MutableIndexFailureIT
Running org.apache.phoenix.end2end.QueryTimeoutIT
Running org.apache.phoenix.end2end.UnionAllIT
Running org.apache.phoenix.end2end.MultiCfQueryExecIT
Tests run: 16, Failures: 0, Errors: 0, Skipped: 0, Time elapsed: 29.507 sec - in org.apache.phoenix.end2end.TenantSpecificTablesDMLIT
Tests run: 7, Failures: 0, Errors: 0, Skipped: 0, Time elapsed: 12.478 sec - in org.apache.phoenix.end2end.MultiCfQueryExecIT
Tests run: 1, Failures: 0, Errors: 0, Skipped: 0, Time elapsed: 18.98 sec - in org.apache.phoenix.end2end.QueryTimeoutIT
Tests run: 11, Failures: 0, Errors: 0, Skipped: 0, Time elapsed: 22.204 sec - in org.apache.phoenix.end2end.UnionAllIT
Running org.apache.hadoop.hbase.regionserver.wal.WALReplayWithIndexWritesAndCompressedWALIT
Running org.apache.phoenix.execute.PartialCommitIT
Tests run: 6, Failures: 1, Errors: 0, Skipped: 0, Time elapsed: 9.326 sec <<< FAILURE!
- in org.apache.phoenix.execute.PartialCommitIT
testDeleteFailure(org.apache.phoenix.execute.PartialCommitIT)  Time elapsed: 0.015 sec  <<<
FAILURE!
java.lang.AssertionError: Expected at least one statement in the list to fail
	at org.junit.Assert.fail(Assert.java:88)
	at org.apache.phoenix.execute.PartialCommitIT.testPartialCommit(PartialCommitIT.java:228)
	at org.apache.phoenix.execute.PartialCommitIT.testDeleteFailure(PartialCommitIT.java:177)

Running org.apache.hadoop.hbase.regionserver.wal.WALReplayWithIndexWritesAndUncompressedWALInHBase_094_9_IT
Tests run: 1, Failures: 0, Errors: 0, Skipped: 0, Time elapsed: 13.217 sec - in org.apache.hadoop.hbase.regionserver.wal.WALReplayWithIndexWritesAndCompressedWALIT
Running org.apache.phoenix.mapreduce.IndexToolIT
Tests run: 1, Failures: 0, Errors: 0, Skipped: 0, Time elapsed: 13.062 sec - in org.apache.hadoop.hbase.regionserver.wal.WALReplayWithIndexWritesAndUncompressedWALInHBase_094_9_IT
Running org.apache.phoenix.mapreduce.CsvBulkLoadToolIT
Tests run: 51, Failures: 0, Errors: 0, Skipped: 0, Time elapsed: 280.731 sec - in org.apache.phoenix.end2end.AlterTableIT
Tests run: 5, Failures: 0, Errors: 0, Skipped: 0, Time elapsed: 212.444 sec - in org.apache.phoenix.mapreduce.IndexToolIT
Tests run: 6, Failures: 0, Errors: 0, Skipped: 0, Time elapsed: 255.307 sec - in org.apache.phoenix.mapreduce.CsvBulkLoadToolIT

Results :

Failed tests: 
  PartialCommitIT.testDeleteFailure:177->testPartialCommit:228 Expected at least one statement
in the list to fail



Tests run: 204, Failures: 1, Errors: 0, Skipped: 1

[INFO] 
[INFO] --- maven-failsafe-plugin:2.18:verify (ClientManagedTimeTests) @ phoenix-core ---
[INFO] Failsafe report directory: <https://builds.apache.org/job/Phoenix-master/ws/phoenix-core/target/failsafe-reports>
[INFO] ------------------------------------------------------------------------
[INFO] Reactor Summary:
[INFO] 
[INFO] Apache Phoenix .................................... SUCCESS [1.958s]
[INFO] Phoenix Core ...................................... FAILURE [26:24.846s]
[INFO] Phoenix - Flume ................................... SKIPPED
[INFO] Phoenix - Pig ..................................... SKIPPED
[INFO] Phoenix Query Server Client ....................... SKIPPED
[INFO] Phoenix Query Server .............................. SKIPPED
[INFO] Phoenix - Spark ................................... SKIPPED
[INFO] Phoenix Assembly .................................. SKIPPED
[INFO] Phoenix - Pherf ................................... SKIPPED
[INFO] ------------------------------------------------------------------------
[INFO] BUILD FAILURE
[INFO] ------------------------------------------------------------------------
[INFO] Total time: 26:27.324s
[INFO] Finished at: Wed Apr 22 05:49:40 UTC 2015
[INFO] Final Memory: 54M/1206M
[INFO] ------------------------------------------------------------------------
[ERROR] Failed to execute goal org.apache.maven.plugins:maven-failsafe-plugin:2.18:verify
(ClientManagedTimeTests) on project phoenix-core: There are test failures.
[ERROR] 
[ERROR] Please refer to <https://builds.apache.org/job/Phoenix-master/ws/phoenix-core/target/failsafe-reports>
for the individual test results.
[ERROR] -> [Help 1]
[ERROR] 
[ERROR] To see the full stack trace of the errors, re-run Maven with the -e switch.
[ERROR] Re-run Maven using the -X switch to enable full debug logging.
[ERROR] 
[ERROR] For more information about the errors and possible solutions, please read the following
articles:
[ERROR] [Help 1] http://cwiki.apache.org/confluence/display/MAVEN/MojoFailureException
[ERROR] 
[ERROR] After correcting the problems, you can resume the build with the command
[ERROR]   mvn <goals> -rf :phoenix-core
Build step 'Invoke top-level Maven targets' marked build as failure
Archiving artifacts
Sending artifact delta relative to Phoenix | Master #701
Archived 1056 artifacts
Archive block size is 32768
Received 17809 blocks and 468720873 bytes
Compression is 55.5%
Took 3 min 43 sec
Updating PHOENIX-1899
Recording test results

Mime
View raw message