phoenix-commits mailing list archives

Site index · List index
Message view « Date » · « Thread »
Top « Date » · « Thread »
From Apache Jenkins Server <jenk...@builds.apache.org>
Subject Build failed in Jenkins: Phoenix | 4.x-HBase-0.98 #624
Date Sun, 05 Apr 2015 08:29:07 GMT
See <https://builds.apache.org/job/Phoenix-4.0/624/changes>

Changes:

[ravimagham] PHOENIX-1071 Add phoenix-spark for Spark integration

------------------------------------------
[...truncated 773 lines...]
[INFO] Wrote classpath file '<https://builds.apache.org/job/Phoenix-4.0/ws/phoenix-pig/target/classes/mrapp-generated-classpath'.>
[INFO] [resources:testResources {execution: default-testResources}]
[INFO] Using 'UTF-8' encoding to copy filtered resources.
[INFO] skip non existing resourceDirectory <https://builds.apache.org/job/Phoenix-4.0/ws/phoenix-pig/src/test/resources>
[INFO] skip non existing resourceDirectory <https://builds.apache.org/job/Phoenix-4.0/ws/phoenix-pig/src/it/resources>
[INFO] Copying 3 resources
[INFO] [compiler:testCompile {execution: default-testCompile}]
[INFO] Changes detected - recompiling the module!
[INFO] Compiling 6 source files to <https://builds.apache.org/job/Phoenix-4.0/ws/phoenix-pig/target/test-classes>
[INFO] [surefire:test {execution: default-test}]
[INFO] Surefire report directory: <https://builds.apache.org/job/Phoenix-4.0/ws/phoenix-pig/target/surefire-reports>

-------------------------------------------------------
 T E S T S
-------------------------------------------------------
Running org.apache.phoenix.pig.util.QuerySchemaParserFunctionTest
Tests run: 4, Failures: 0, Errors: 0, Skipped: 0, Time elapsed: 1.877 sec - in org.apache.phoenix.pig.util.QuerySchemaParserFunctionTest
Running org.apache.phoenix.pig.util.TableSchemaParserFunctionTest
Tests run: 3, Failures: 0, Errors: 0, Skipped: 0, Time elapsed: 0.004 sec - in org.apache.phoenix.pig.util.TableSchemaParserFunctionTest
Running org.apache.phoenix.pig.util.SqlQueryToColumnInfoFunctionTest
Tests run: 1, Failures: 0, Errors: 0, Skipped: 0, Time elapsed: 0.209 sec - in org.apache.phoenix.pig.util.SqlQueryToColumnInfoFunctionTest
Running org.apache.phoenix.pig.util.PhoenixPigSchemaUtilTest
Tests run: 2, Failures: 0, Errors: 0, Skipped: 0, Time elapsed: 0.036 sec - in org.apache.phoenix.pig.util.PhoenixPigSchemaUtilTest

Results :




Tests run: 10, Failures: 0, Errors: 0, Skipped: 0

[INFO] [source:jar-no-fork {execution: attach-sources}]
[INFO] Building jar: <https://builds.apache.org/job/Phoenix-4.0/624/artifact/phoenix-pig/target/phoenix-pig-4.4.0-HBase-0.98-SNAPSHOT-sources.jar>
[INFO] [jar:test-jar {execution: default}]
[INFO] Building jar: <https://builds.apache.org/job/Phoenix-4.0/624/artifact/phoenix-pig/target/phoenix-pig-4.4.0-HBase-0.98-SNAPSHOT-tests.jar>
[INFO] [jar:jar {execution: default-jar}]
[INFO] Building jar: <https://builds.apache.org/job/Phoenix-4.0/624/artifact/phoenix-pig/target/phoenix-pig-4.4.0-HBase-0.98-SNAPSHOT.jar>
[INFO] [failsafe:integration-test {execution: ClientManagedTimeTests}]
[INFO] Failsafe report directory: <https://builds.apache.org/job/Phoenix-4.0/ws/phoenix-pig/target/failsafe-reports>
[INFO] parallel='none', perCoreThreadCount=true, threadCount=0, useUnlimitedThreads=false,
threadCountSuites=0, threadCountClasses=0, threadCountMethods=0, parallelOptimized=true

-------------------------------------------------------
 T E S T S
-------------------------------------------------------

Results :




Tests run: 0, Failures: 0, Errors: 0, Skipped: 0

[INFO] [failsafe:integration-test {execution: HBaseManagedTimeTests}]
[INFO] Failsafe report directory: <https://builds.apache.org/job/Phoenix-4.0/ws/phoenix-pig/target/failsafe-reports>
[INFO] parallel='none', perCoreThreadCount=true, threadCount=0, useUnlimitedThreads=false,
threadCountSuites=0, threadCountClasses=0, threadCountMethods=0, parallelOptimized=true

-------------------------------------------------------
 T E S T S
-------------------------------------------------------
Running org.apache.phoenix.pig.PhoenixHBaseStorerIT
Tests run: 4, Failures: 0, Errors: 0, Skipped: 0, Time elapsed: 13.696 sec - in org.apache.phoenix.pig.PhoenixHBaseStorerIT

Results :




Tests run: 4, Failures: 0, Errors: 0, Skipped: 0

[INFO] [failsafe:integration-test {execution: NeedTheirOwnClusterTests}]
[INFO] Failsafe report directory: <https://builds.apache.org/job/Phoenix-4.0/ws/phoenix-pig/target/failsafe-reports>
[INFO] parallel='none', perCoreThreadCount=true, threadCount=0, useUnlimitedThreads=false,
threadCountSuites=0, threadCountClasses=0, threadCountMethods=0, parallelOptimized=true

-------------------------------------------------------
 T E S T S
-------------------------------------------------------
Running org.apache.phoenix.pig.PhoenixHBaseLoaderIT
Tests run: 12, Failures: 0, Errors: 0, Skipped: 0, Time elapsed: 40.474 sec - in org.apache.phoenix.pig.PhoenixHBaseLoaderIT

Results :




Tests run: 12, Failures: 0, Errors: 0, Skipped: 0

[INFO] [failsafe:verify {execution: ClientManagedTimeTests}]
[INFO] Failsafe report directory: <https://builds.apache.org/job/Phoenix-4.0/ws/phoenix-pig/target/failsafe-reports>
[INFO] [failsafe:verify {execution: HBaseManagedTimeTests}]
[INFO] Failsafe report directory: <https://builds.apache.org/job/Phoenix-4.0/ws/phoenix-pig/target/failsafe-reports>
[INFO] [failsafe:verify {execution: NeedTheirOwnClusterTests}]
[INFO] Failsafe report directory: <https://builds.apache.org/job/Phoenix-4.0/ws/phoenix-pig/target/failsafe-reports>
[INFO] [install:install {execution: default-install}]
[INFO] Installing <https://builds.apache.org/job/Phoenix-4.0/624/artifact/phoenix-pig/target/phoenix-pig-4.4.0-HBase-0.98-SNAPSHOT.jar>
to /home/jenkins/.m2/repository/org/apache/phoenix/phoenix-pig/4.4.0-HBase-0.98-SNAPSHOT/phoenix-pig-4.4.0-HBase-0.98-SNAPSHOT.jar
[INFO] Installing <https://builds.apache.org/job/Phoenix-4.0/624/artifact/phoenix-pig/target/phoenix-pig-4.4.0-HBase-0.98-SNAPSHOT-sources.jar>
to /home/jenkins/.m2/repository/org/apache/phoenix/phoenix-pig/4.4.0-HBase-0.98-SNAPSHOT/phoenix-pig-4.4.0-HBase-0.98-SNAPSHOT-sources.jar
[INFO] Installing <https://builds.apache.org/job/Phoenix-4.0/624/artifact/phoenix-pig/target/phoenix-pig-4.4.0-HBase-0.98-SNAPSHOT-tests.jar>
to /home/jenkins/.m2/repository/org/apache/phoenix/phoenix-pig/4.4.0-HBase-0.98-SNAPSHOT/phoenix-pig-4.4.0-HBase-0.98-SNAPSHOT-tests.jar
[INFO] ------------------------------------------------------------------------
[INFO] Building Phoenix Assembly
[INFO]    task-segment: [clean, install]
[INFO] ------------------------------------------------------------------------
[INFO] [clean:clean {execution: default-clean}]
[INFO] Deleting <https://builds.apache.org/job/Phoenix-4.0/ws/phoenix-assembly/target>
[INFO] [remote-resources:process {execution: default}]
[INFO] [source:jar-no-fork {execution: attach-sources}]
[INFO] [jar:test-jar {execution: default}]
[WARNING] JAR will be empty - no content was marked for inclusion!
[INFO] Building jar: <https://builds.apache.org/job/Phoenix-4.0/624/artifact/phoenix-assembly/target/phoenix-assembly-4.4.0-HBase-0.98-SNAPSHOT-tests.jar>
[INFO] [site:attach-descriptor {execution: default-attach-descriptor}]
[INFO] [assembly:single {execution: client}]
[INFO] Reading assembly descriptor: src/build/client.xml
[WARNING] Cannot include project artifact: org.apache.phoenix:phoenix-assembly:pom:4.4.0-HBase-0.98-SNAPSHOT;
it doesn't have an associated file or directory.
[WARNING] Cannot include project artifact: org.apache.phoenix:phoenix-assembly:pom:4.4.0-HBase-0.98-SNAPSHOT;
it doesn't have an associated file or directory.
[WARNING] Cannot include project artifact: org.apache.phoenix:phoenix-assembly:pom:4.4.0-HBase-0.98-SNAPSHOT;
it doesn't have an associated file or directory.
[WARNING] Cannot include project artifact: org.apache.phoenix:phoenix-assembly:pom:4.4.0-HBase-0.98-SNAPSHOT;
it doesn't have an associated file or directory.
[WARNING] Cannot include project artifact: org.apache.phoenix:phoenix-assembly:pom:4.4.0-HBase-0.98-SNAPSHOT;
it doesn't have an associated file or directory.
[INFO] Building jar: <https://builds.apache.org/job/Phoenix-4.0/624/artifact/phoenix-assembly/target/phoenix-4.4.0-HBase-0.98-SNAPSHOT-client.jar>
[INFO] [assembly:single {execution: package-to-tar}]
[INFO] Reading assembly descriptor: src/build/package-to-tar-all.xml
[WARNING] Cannot include project artifact: org.apache.phoenix:phoenix-assembly:pom:4.4.0-HBase-0.98-SNAPSHOT;
it doesn't have an associated file or directory.
[WARNING] Cannot include project artifact: org.apache.phoenix:phoenix-assembly:pom:4.4.0-HBase-0.98-SNAPSHOT;
it doesn't have an associated file or directory.
[WARNING] Cannot include project artifact: org.apache.phoenix:phoenix-assembly:pom:4.4.0-HBase-0.98-SNAPSHOT;
it doesn't have an associated file or directory.
[INFO] Building tar: <https://builds.apache.org/job/Phoenix-4.0/ws/phoenix-assembly/target/phoenix-4.4.0-HBase-0.98-SNAPSHOT.tar.gz>
[INFO] [assembly:single {execution: package-to-source-tar}]
[INFO] Reading assembly descriptor: src/build/src.xml
[INFO] Processing sources for module project: org.apache.phoenix:phoenix-core:jar:4.4.0-HBase-0.98-SNAPSHOT
[INFO] Processing sources for module project: org.apache.phoenix:phoenix-flume:jar:4.4.0-HBase-0.98-SNAPSHOT
[INFO] Processing sources for module project: org.apache.phoenix:phoenix-pig:jar:4.4.0-HBase-0.98-SNAPSHOT
[INFO] Processing sources for module project: org.apache.phoenix:phoenix-assembly:pom:4.4.0-HBase-0.98-SNAPSHOT
[INFO] Processing sources for module project: org.apache.phoenix:pherf:jar:4.4.0-HBase-0.98-SNAPSHOT
[INFO] Processing sources for module project: org.apache.phoenix:phoenix-spark:jar:4.4.0-HBase-0.98-SNAPSHOT
[INFO] Building tar: <https://builds.apache.org/job/Phoenix-4.0/ws/phoenix-assembly/target/phoenix-4.4.0-HBase-0.98-SNAPSHOT-source.tar.gz>
[INFO] [assembly:single {execution: client-minimal}]
[INFO] Reading assembly descriptor: src/build/client-without-hbase.xml
[INFO] Reading assembly descriptor: src/build/client-minimal.xml
[INFO] Reading assembly descriptor: src/build/server.xml
[INFO] Reading assembly descriptor: src/build/server-without-antlr.xml
[WARNING] Cannot include project artifact: org.apache.phoenix:phoenix-assembly:pom:4.4.0-HBase-0.98-SNAPSHOT;
it doesn't have an associated file or directory.
[WARNING] Cannot include project artifact: org.apache.phoenix:phoenix-assembly:pom:4.4.0-HBase-0.98-SNAPSHOT;
it doesn't have an associated file or directory.
[WARNING] Cannot include project artifact: org.apache.phoenix:phoenix-assembly:pom:4.4.0-HBase-0.98-SNAPSHOT;
it doesn't have an associated file or directory.
[INFO] Building jar: <https://builds.apache.org/job/Phoenix-4.0/624/artifact/phoenix-assembly/target/phoenix-4.4.0-HBase-0.98-SNAPSHOT-client-without-hbase.jar>
[WARNING] Cannot include project artifact: org.apache.phoenix:phoenix-assembly:pom:4.4.0-HBase-0.98-SNAPSHOT;
it doesn't have an associated file or directory.
[WARNING] Cannot include project artifact: org.apache.phoenix:phoenix-assembly:pom:4.4.0-HBase-0.98-SNAPSHOT;
it doesn't have an associated file or directory.
[INFO] Building jar: <https://builds.apache.org/job/Phoenix-4.0/624/artifact/phoenix-assembly/target/phoenix-4.4.0-HBase-0.98-SNAPSHOT-client-minimal.jar>
[WARNING] Cannot include project artifact: org.apache.phoenix:phoenix-assembly:pom:4.4.0-HBase-0.98-SNAPSHOT;
it doesn't have an associated file or directory.
[WARNING] Cannot include project artifact: org.apache.phoenix:phoenix-assembly:pom:4.4.0-HBase-0.98-SNAPSHOT;
it doesn't have an associated file or directory.
[INFO] Building jar: <https://builds.apache.org/job/Phoenix-4.0/624/artifact/phoenix-assembly/target/phoenix-4.4.0-HBase-0.98-SNAPSHOT-server.jar>
[WARNING] Cannot include project artifact: org.apache.phoenix:phoenix-assembly:pom:4.4.0-HBase-0.98-SNAPSHOT;
it doesn't have an associated file or directory.
[INFO] Building jar: <https://builds.apache.org/job/Phoenix-4.0/624/artifact/phoenix-assembly/target/phoenix-4.4.0-HBase-0.98-SNAPSHOT-server-without-antlr.jar>
[INFO] [install:install {execution: default-install}]
[INFO] Installing <https://builds.apache.org/job/Phoenix-4.0/ws/phoenix-assembly/pom.xml>
to /home/jenkins/.m2/repository/org/apache/phoenix/phoenix-assembly/4.4.0-HBase-0.98-SNAPSHOT/phoenix-assembly-4.4.0-HBase-0.98-SNAPSHOT.pom
[INFO] Installing <https://builds.apache.org/job/Phoenix-4.0/624/artifact/phoenix-assembly/target/phoenix-assembly-4.4.0-HBase-0.98-SNAPSHOT-tests.jar>
to /home/jenkins/.m2/repository/org/apache/phoenix/phoenix-assembly/4.4.0-HBase-0.98-SNAPSHOT/phoenix-assembly-4.4.0-HBase-0.98-SNAPSHOT-tests.jar
[INFO] ------------------------------------------------------------------------
[INFO] Building Phoenix - Pherf
[INFO]    task-segment: [clean, install]
[INFO] ------------------------------------------------------------------------
[INFO] [clean:clean {execution: default-clean}]
[INFO] Deleting <https://builds.apache.org/job/Phoenix-4.0/ws/phoenix-pherf/target>
[INFO] [remote-resources:process {execution: default}]
[INFO] artifact junit:junit-dep: checking for updates from apache release
[INFO] artifact junit:junit-dep: checking for updates from conjars.org
[INFO] artifact junit:junit-dep: checking for updates from apache snapshot
[INFO] artifact junit:junit-dep: checking for updates from sonatype-nexus-snapshots
[INFO] artifact junit:junit-dep: checking for updates from central
[INFO] artifact junit:junit: checking for updates from apache release
[INFO] artifact junit:junit: checking for updates from conjars.org
[INFO] artifact junit:junit: checking for updates from apache snapshot
[INFO] artifact junit:junit: checking for updates from sonatype-nexus-snapshots
[INFO] artifact junit:junit: checking for updates from central
[INFO] artifact commons-io:commons-io: checking for updates from apache release
[WARNING] *** CHECKSUM FAILED - Checksum failed on download: local = 'e96bfd44508acb01f4e0162035f888350c7056d0';
remote = '5044b77776e4092a757f96fec6cff9c421a8b233' - RETRYING
[WARNING] *** CHECKSUM FAILED - Checksum failed on download: local = 'e96bfd44508acb01f4e0162035f888350c7056d0';
remote = '5044b77776e4092a757f96fec6cff9c421a8b233' - IGNORING
[INFO] artifact commons-io:commons-io: checking for updates from conjars.org
[INFO] artifact commons-io:commons-io: checking for updates from apache snapshot
[INFO] artifact commons-io:commons-io: checking for updates from sonatype-nexus-snapshots
[INFO] artifact commons-io:commons-io: checking for updates from central
[INFO] snapshot commons-io:commons-io:2.5-SNAPSHOT: checking for updates from apache release
[INFO] snapshot commons-io:commons-io:2.5-SNAPSHOT: checking for updates from conjars.org
[INFO] snapshot commons-io:commons-io:2.5-SNAPSHOT: checking for updates from apache snapshot
[WARNING] *** CHECKSUM FAILED - Checksum failed on download: local = '26df079b3d1b2743ec8b8041d41531471c2dccc6';
remote = 'ec6be22614d44cf754c4e35ec889823ce69a2e34' - RETRYING
[WARNING] *** CHECKSUM FAILED - Checksum failed on download: local = '26df079b3d1b2743ec8b8041d41531471c2dccc6';
remote = 'ec6be22614d44cf754c4e35ec889823ce69a2e34' - IGNORING
[INFO] snapshot commons-io:commons-io:2.5-SNAPSHOT: checking for updates from sonatype-nexus-snapshots
[INFO] snapshot commons-io:commons-io:2.5-SNAPSHOT: checking for updates from apache.snapshots
[INFO] [resources:resources {execution: default-resources}]
[INFO] Using 'UTF-8' encoding to copy filtered resources.
[INFO] Copying 3 resources
[INFO] Copying 3 resources
[INFO] Copying 3 resources
[INFO] [compiler:compile {execution: default-compile}]
[INFO] Changes detected - recompiling the module!
[INFO] Compiling 61 source files to <https://builds.apache.org/job/Phoenix-4.0/ws/phoenix-pherf/target/classes>
[WARNING] <https://builds.apache.org/job/Phoenix-4.0/ws/phoenix-pherf/src/main/java/org/apache/phoenix/pherf/jmx/monitors/ThreadMonitor.java>:
Some input files use unchecked or unsafe operations.
[WARNING] <https://builds.apache.org/job/Phoenix-4.0/ws/phoenix-pherf/src/main/java/org/apache/phoenix/pherf/jmx/monitors/ThreadMonitor.java>:
Recompile with -Xlint:unchecked for details.
[INFO] [resources:testResources {execution: default-testResources}]
[INFO] Using 'UTF-8' encoding to copy filtered resources.
[INFO] Copying 4 resources
[INFO] Copying 4 resources
[INFO] Copying 4 resources
[INFO] Copying 4 resources
[INFO] Copying 3 resources
[INFO] [compiler:testCompile {execution: default-testCompile}]
[INFO] Changes detected - recompiling the module!
[INFO] Compiling 11 source files to <https://builds.apache.org/job/Phoenix-4.0/ws/phoenix-pherf/target/test-classes>
[WARNING] <https://builds.apache.org/job/Phoenix-4.0/ws/phoenix-pherf/src/test/java/org/apache/phoenix/pherf/DataLoaderTest.java>:
<https://builds.apache.org/job/Phoenix-4.0/ws/phoenix-pherf/src/test/java/org/apache/phoenix/pherf/DataLoaderTest.java>
uses or overrides a deprecated API.
[WARNING] <https://builds.apache.org/job/Phoenix-4.0/ws/phoenix-pherf/src/test/java/org/apache/phoenix/pherf/DataLoaderTest.java>:
Recompile with -Xlint:deprecation for details.
[WARNING] <https://builds.apache.org/job/Phoenix-4.0/ws/phoenix-pherf/src/test/java/org/apache/phoenix/pherf/ResultTest.java>:
Some input files use unchecked or unsafe operations.
[WARNING] <https://builds.apache.org/job/Phoenix-4.0/ws/phoenix-pherf/src/test/java/org/apache/phoenix/pherf/ResultTest.java>:
Recompile with -Xlint:unchecked for details.
[INFO] [surefire:test {execution: default-test}]
[INFO] Tests are skipped.
[INFO] [source:jar-no-fork {execution: attach-sources}]
[INFO] Building jar: <https://builds.apache.org/job/Phoenix-4.0/624/artifact/phoenix-pherf/target/pherf-4.4.0-HBase-0.98-SNAPSHOT-sources.jar>
[INFO] [jar:test-jar {execution: default}]
[INFO] Building jar: <https://builds.apache.org/job/Phoenix-4.0/624/artifact/phoenix-pherf/target/pherf-4.4.0-HBase-0.98-SNAPSHOT-tests.jar>
[INFO] [jar:jar {execution: default-jar}]
[INFO] Building jar: <https://builds.apache.org/job/Phoenix-4.0/624/artifact/phoenix-pherf/target/pherf-4.4.0-HBase-0.98-SNAPSHOT.jar>
[INFO] [assembly:single {execution: make-dependency-jar}]
[INFO] Building jar: <https://builds.apache.org/job/Phoenix-4.0/624/artifact/phoenix-pherf/target/pherf-4.4.0-HBase-0.98-SNAPSHOT-jar-with-dependencies.jar>
[INFO] [assembly:single {execution: make-assembly}]
[INFO] Reading assembly descriptor: src/main/assembly/cluster.xml
[INFO] Building zip: <https://builds.apache.org/job/Phoenix-4.0/ws/phoenix-pherf/target/pherf-4.4.0-HBase-0.98-SNAPSHOT-cluster.zip>
[INFO] [install:install {execution: default-install}]
[INFO] Installing <https://builds.apache.org/job/Phoenix-4.0/624/artifact/phoenix-pherf/target/pherf-4.4.0-HBase-0.98-SNAPSHOT.jar>
to /home/jenkins/.m2/repository/org/apache/phoenix/pherf/4.4.0-HBase-0.98-SNAPSHOT/pherf-4.4.0-HBase-0.98-SNAPSHOT.jar
[INFO] Installing <https://builds.apache.org/job/Phoenix-4.0/624/artifact/phoenix-pherf/target/pherf-4.4.0-HBase-0.98-SNAPSHOT-sources.jar>
to /home/jenkins/.m2/repository/org/apache/phoenix/pherf/4.4.0-HBase-0.98-SNAPSHOT/pherf-4.4.0-HBase-0.98-SNAPSHOT-sources.jar
[INFO] Installing <https://builds.apache.org/job/Phoenix-4.0/624/artifact/phoenix-pherf/target/pherf-4.4.0-HBase-0.98-SNAPSHOT-tests.jar>
to /home/jenkins/.m2/repository/org/apache/phoenix/pherf/4.4.0-HBase-0.98-SNAPSHOT/pherf-4.4.0-HBase-0.98-SNAPSHOT-tests.jar
[INFO] Installing <https://builds.apache.org/job/Phoenix-4.0/624/artifact/phoenix-pherf/target/pherf-4.4.0-HBase-0.98-SNAPSHOT-jar-with-dependencies.jar>
to /home/jenkins/.m2/repository/org/apache/phoenix/pherf/4.4.0-HBase-0.98-SNAPSHOT/pherf-4.4.0-HBase-0.98-SNAPSHOT-jar-with-dependencies.jar
[INFO] Installing <https://builds.apache.org/job/Phoenix-4.0/ws/phoenix-pherf/target/pherf-4.4.0-HBase-0.98-SNAPSHOT-cluster.zip>
to /home/jenkins/.m2/repository/org/apache/phoenix/pherf/4.4.0-HBase-0.98-SNAPSHOT/pherf-4.4.0-HBase-0.98-SNAPSHOT-cluster.zip
[INFO] ------------------------------------------------------------------------
[INFO] Building Phoenix - Spark
[INFO]    task-segment: [clean, install]
[INFO] ------------------------------------------------------------------------
[INFO] ------------------------------------------------------------------------
[ERROR] BUILD ERROR
[INFO] ------------------------------------------------------------------------
[INFO] Error resolving version for 'net.alchim31.maven:scala-maven-plugin': Plugin requires
Maven version 3.0.4
[INFO] ------------------------------------------------------------------------
[INFO] For more information, run Maven with the -e switch
[INFO] ------------------------------------------------------------------------
[INFO] Total time: 27 minutes 19 seconds
[INFO] Finished at: Sun Apr 05 08:20:58 UTC 2015
[INFO] Final Memory: 170M/1112M
[INFO] ------------------------------------------------------------------------
Build step 'Invoke top-level Maven targets' marked build as failure
Archiving artifacts
Sending artifact delta relative to Phoenix | 4.x-HBase-0.98 #623
Archived 1009 artifacts
Archive block size is 32768
Received 13416 blocks and 467935842 bytes
Compression is 48.4%
Took 6 min 25 sec
Recording test results

Mime
View raw message