phoenix-commits mailing list archives

Site index · List index
Message view « Date » · « Thread »
Top « Date » · « Thread »
From Apache Jenkins Server <jenk...@builds.apache.org>
Subject Build failed in Jenkins: Phoenix | 4.x-HBase-0.98 #603
Date Tue, 24 Mar 2015 23:34:31 GMT
See <https://builds.apache.org/job/Phoenix-4.0/603/changes>

Changes:

[thomas] PHOENIX-1684 Functional Index using REGEXP_SUBSTR doesn't work correctly

------------------------------------------
[...truncated 506 lines...]
Tests run: 3, Failures: 0, Errors: 0, Skipped: 0, Time elapsed: 9.262 sec - in org.apache.phoenix.end2end.UpsertSelectAutoCommitIT
Running org.apache.phoenix.end2end.ModulusExpressionIT
Tests run: 1, Failures: 0, Errors: 0, Skipped: 0, Time elapsed: 1.679 sec - in org.apache.phoenix.end2end.ServerExceptionIT
Running org.apache.phoenix.end2end.SubqueryUsingSortMergeJoinIT
Tests run: 11, Failures: 0, Errors: 0, Skipped: 0, Time elapsed: 4.102 sec - in org.apache.phoenix.end2end.ModulusExpressionIT
Running org.apache.phoenix.end2end.BinaryRowKeyIT
Tests run: 3, Failures: 0, Errors: 0, Skipped: 0, Time elapsed: 2.066 sec - in org.apache.phoenix.end2end.BinaryRowKeyIT
Running org.apache.phoenix.end2end.ReadOnlyIT
Tests run: 58, Failures: 8, Errors: 0, Skipped: 0, Time elapsed: 135.71 sec <<< FAILURE!
- in org.apache.phoenix.end2end.index.IndexExpressionIT
testGroupByCountMutableIndex(org.apache.phoenix.end2end.index.IndexExpressionIT)  Time elapsed:
0.253 sec  <<< FAILURE!
org.junit.ComparisonFailure: expected:<... ROWS BY [TO_BIGINT([(A.INT_COL1 + B.INT_COL2)])]
CLIENT MERGE SORT> but was:<... ROWS BY [TO_BIGINT(["(A.INT_COL1 + B.INT_COL2)"])]
CLIENT MERGE SORT>
	at org.junit.Assert.assertEquals(Assert.java:115)
	at org.junit.Assert.assertEquals(Assert.java:144)
	at org.apache.phoenix.end2end.index.IndexExpressionIT.helpTestGroupByCount(IndexExpressionIT.java:484)
	at org.apache.phoenix.end2end.index.IndexExpressionIT.testGroupByCountMutableIndex(IndexExpressionIT.java:456)

testSelectDistinctImmutableIndex(org.apache.phoenix.end2end.index.IndexExpressionIT)  Time
elapsed: 0.251 sec  <<< FAILURE!
org.junit.ComparisonFailure: expected:<... ROWS BY [TO_BIGINT([(A.INT_COL1 + 1)])]
CLIENT MERGE SORT> but was:<... ROWS BY [TO_BIGINT(["(A.INT_COL1 + 1)"])]
CLIENT MERGE SORT>
	at org.junit.Assert.assertEquals(Assert.java:115)
	at org.junit.Assert.assertEquals(Assert.java:144)
	at org.apache.phoenix.end2end.index.IndexExpressionIT.helpTestSelectDistinct(IndexExpressionIT.java:535)
	at org.apache.phoenix.end2end.index.IndexExpressionIT.testSelectDistinctImmutableIndex(IndexExpressionIT.java:499)

testSelectDistinctImmutableIndexLocal(org.apache.phoenix.end2end.index.IndexExpressionIT)
 Time elapsed: 0.252 sec  <<< FAILURE!
org.junit.ComparisonFailure: expected:<... ROWS BY [TO_BIGINT([(A.INT_COL1 + 1)])]
CLIENT MERGE SORT> but was:<... ROWS BY [TO_BIGINT(["(A.INT_COL1 + 1)"])]
CLIENT MERGE SORT>
	at org.junit.Assert.assertEquals(Assert.java:115)
	at org.junit.Assert.assertEquals(Assert.java:144)
	at org.apache.phoenix.end2end.index.IndexExpressionIT.helpTestSelectDistinct(IndexExpressionIT.java:535)
	at org.apache.phoenix.end2end.index.IndexExpressionIT.testSelectDistinctImmutableIndexLocal(IndexExpressionIT.java:504)

testSelectDistinctMutableIndex(org.apache.phoenix.end2end.index.IndexExpressionIT)  Time elapsed:
5.698 sec  <<< FAILURE!
org.junit.ComparisonFailure: expected:<... ROWS BY [TO_BIGINT([(A.INT_COL1 + 1)])]
CLIENT MERGE SORT> but was:<... ROWS BY [TO_BIGINT(["(A.INT_COL1 + 1)"])]
CLIENT MERGE SORT>
	at org.junit.Assert.assertEquals(Assert.java:115)
	at org.junit.Assert.assertEquals(Assert.java:144)
	at org.apache.phoenix.end2end.index.IndexExpressionIT.helpTestSelectDistinct(IndexExpressionIT.java:535)
	at org.apache.phoenix.end2end.index.IndexExpressionIT.testSelectDistinctMutableIndex(IndexExpressionIT.java:509)

testGroupByCountImmutableLocalIndex(org.apache.phoenix.end2end.index.IndexExpressionIT)  Time
elapsed: 0.27 sec  <<< FAILURE!
org.junit.ComparisonFailure: expected:<... ROWS BY [TO_BIGINT([(A.INT_COL1 + B.INT_COL2)])]
CLIENT MERGE SORT> but was:<... ROWS BY [TO_BIGINT(["(A.INT_COL1 + B.INT_COL2)"])]
CLIENT MERGE SORT>
	at org.junit.Assert.assertEquals(Assert.java:115)
	at org.junit.Assert.assertEquals(Assert.java:144)
	at org.apache.phoenix.end2end.index.IndexExpressionIT.helpTestGroupByCount(IndexExpressionIT.java:484)
	at org.apache.phoenix.end2end.index.IndexExpressionIT.testGroupByCountImmutableLocalIndex(IndexExpressionIT.java:451)

testSelectDistinctMutableLocalIndex(org.apache.phoenix.end2end.index.IndexExpressionIT)  Time
elapsed: 0.262 sec  <<< FAILURE!
org.junit.ComparisonFailure: expected:<... ROWS BY [TO_BIGINT([(A.INT_COL1 + 1)])]
CLIENT MERGE SORT> but was:<... ROWS BY [TO_BIGINT(["(A.INT_COL1 + 1)"])]
CLIENT MERGE SORT>
	at org.junit.Assert.assertEquals(Assert.java:115)
	at org.junit.Assert.assertEquals(Assert.java:144)
	at org.apache.phoenix.end2end.index.IndexExpressionIT.helpTestSelectDistinct(IndexExpressionIT.java:535)
	at org.apache.phoenix.end2end.index.IndexExpressionIT.testSelectDistinctMutableLocalIndex(IndexExpressionIT.java:514)

testGroupByCountImmutableIndex(org.apache.phoenix.end2end.index.IndexExpressionIT)  Time elapsed:
0.261 sec  <<< FAILURE!
org.junit.ComparisonFailure: expected:<... ROWS BY [TO_BIGINT([(A.INT_COL1 + B.INT_COL2)])]
CLIENT MERGE SORT> but was:<... ROWS BY [TO_BIGINT(["(A.INT_COL1 + B.INT_COL2)"])]
CLIENT MERGE SORT>
	at org.junit.Assert.assertEquals(Assert.java:115)
	at org.junit.Assert.assertEquals(Assert.java:144)
	at org.apache.phoenix.end2end.index.IndexExpressionIT.helpTestGroupByCount(IndexExpressionIT.java:484)
	at org.apache.phoenix.end2end.index.IndexExpressionIT.testGroupByCountImmutableIndex(IndexExpressionIT.java:446)

testGroupByCountMutableLocalIndex(org.apache.phoenix.end2end.index.IndexExpressionIT)  Time
elapsed: 0.246 sec  <<< FAILURE!
org.junit.ComparisonFailure: expected:<... ROWS BY [TO_BIGINT([(A.INT_COL1 + B.INT_COL2)])]
CLIENT MERGE SORT> but was:<... ROWS BY [TO_BIGINT(["(A.INT_COL1 + B.INT_COL2)"])]
CLIENT MERGE SORT>
	at org.junit.Assert.assertEquals(Assert.java:115)
	at org.junit.Assert.assertEquals(Assert.java:144)
	at org.apache.phoenix.end2end.index.IndexExpressionIT.helpTestGroupByCount(IndexExpressionIT.java:484)
	at org.apache.phoenix.end2end.index.IndexExpressionIT.testGroupByCountMutableLocalIndex(IndexExpressionIT.java:461)

Running org.apache.phoenix.end2end.DeleteIT
Tests run: 1, Failures: 0, Errors: 0, Skipped: 0, Time elapsed: 7.189 sec - in org.apache.phoenix.end2end.ReadOnlyIT
Running org.apache.phoenix.end2end.HashJoinLocalIndexIT
Tests run: 1, Failures: 0, Errors: 0, Skipped: 0, Time elapsed: 13.996 sec - in org.apache.phoenix.end2end.HashJoinLocalIndexIT
Running org.apache.phoenix.end2end.StatementHintsIT
Tests run: 2, Failures: 0, Errors: 0, Skipped: 0, Time elapsed: 1.905 sec - in org.apache.phoenix.end2end.StatementHintsIT
Running org.apache.phoenix.end2end.DecodeFunctionIT
Tests run: 21, Failures: 0, Errors: 0, Skipped: 0, Time elapsed: 40.131 sec - in org.apache.phoenix.end2end.SubqueryIT
Running org.apache.phoenix.end2end.TimezoneOffsetFunctionIT
Tests run: 6, Failures: 0, Errors: 0, Skipped: 0, Time elapsed: 2.297 sec - in org.apache.phoenix.end2end.DecodeFunctionIT
Running org.apache.phoenix.end2end.SpooledSortMergeJoinIT
Tests run: 15, Failures: 0, Errors: 0, Skipped: 0, Time elapsed: 32.206 sec - in org.apache.phoenix.end2end.SubqueryUsingSortMergeJoinIT
Running org.apache.phoenix.end2end.ArithmeticQueryIT
Tests run: 105, Failures: 0, Errors: 0, Skipped: 0, Time elapsed: 98.513 sec - in org.apache.phoenix.end2end.HashJoinIT
Running org.apache.phoenix.end2end.SpooledTmpFileDeleteIT
Tests run: 20, Failures: 0, Errors: 0, Skipped: 0, Time elapsed: 26.846 sec - in org.apache.phoenix.end2end.DeleteIT
Running org.apache.phoenix.end2end.FirstValueFunctionIT
Tests run: 7, Failures: 0, Errors: 0, Skipped: 0, Time elapsed: 4.409 sec - in org.apache.phoenix.end2end.TimezoneOffsetFunctionIT
Tests run: 7, Failures: 0, Errors: 0, Skipped: 0, Time elapsed: 2.526 sec - in org.apache.phoenix.end2end.FirstValueFunctionIT
Running org.apache.phoenix.end2end.RegexpSubstrFunctionIT
Tests run: 1, Failures: 0, Errors: 0, Skipped: 0, Time elapsed: 2.745 sec - in org.apache.phoenix.end2end.SpooledTmpFileDeleteIT
Running org.apache.phoenix.end2end.PhoenixRuntimeIT
Running org.apache.phoenix.end2end.QueryExecWithoutSCNIT
Tests run: 2, Failures: 0, Errors: 0, Skipped: 0, Time elapsed: 2.338 sec - in org.apache.phoenix.end2end.RegexpSubstrFunctionIT
Running org.apache.phoenix.end2end.InListIT
Tests run: 1, Failures: 0, Errors: 0, Skipped: 0, Time elapsed: 2.756 sec - in org.apache.phoenix.end2end.QueryExecWithoutSCNIT
Running org.apache.phoenix.end2end.PhoenixMetricsIT
Tests run: 4, Failures: 0, Errors: 0, Skipped: 0, Time elapsed: 4.003 sec - in org.apache.phoenix.end2end.PhoenixMetricsIT
Running org.apache.phoenix.end2end.SortMergeJoinIT
Tests run: 21, Failures: 0, Errors: 0, Skipped: 0, Time elapsed: 15.566 sec - in org.apache.phoenix.end2end.ArithmeticQueryIT
Tests run: 2, Failures: 0, Errors: 0, Skipped: 0, Time elapsed: 12.06 sec - in org.apache.phoenix.end2end.PhoenixRuntimeIT
Running org.apache.phoenix.end2end.StoreNullsIT
Tests run: 3, Failures: 0, Errors: 0, Skipped: 0, Time elapsed: 15.201 sec - in org.apache.phoenix.end2end.StoreNullsIT
Tests run: 25, Failures: 0, Errors: 0, Skipped: 0, Time elapsed: 49.937 sec - in org.apache.phoenix.end2end.InListIT
Tests run: 105, Failures: 0, Errors: 0, Skipped: 0, Time elapsed: 101.856 sec - in org.apache.phoenix.end2end.SpooledSortMergeJoinIT
Tests run: 105, Failures: 0, Errors: 0, Skipped: 0, Time elapsed: 96.959 sec - in org.apache.phoenix.end2end.SortMergeJoinIT

Results :

Failed tests: 
  IndexExpressionIT.testGroupByCountImmutableIndex:446->helpTestGroupByCount:484 expected:<...
ROWS BY [TO_BIGINT([(A.INT_COL1 + B.INT_COL2)])]
CLIENT MERGE SORT> but was:<... ROWS BY [TO_BIGINT(["(A.INT_COL1 + B.INT_COL2)"])]
CLIENT MERGE SORT>
  IndexExpressionIT.testGroupByCountImmutableLocalIndex:451->helpTestGroupByCount:484 expected:<...
ROWS BY [TO_BIGINT([(A.INT_COL1 + B.INT_COL2)])]
CLIENT MERGE SORT> but was:<... ROWS BY [TO_BIGINT(["(A.INT_COL1 + B.INT_COL2)"])]
CLIENT MERGE SORT>
  IndexExpressionIT.testGroupByCountMutableIndex:456->helpTestGroupByCount:484 expected:<...
ROWS BY [TO_BIGINT([(A.INT_COL1 + B.INT_COL2)])]
CLIENT MERGE SORT> but was:<... ROWS BY [TO_BIGINT(["(A.INT_COL1 + B.INT_COL2)"])]
CLIENT MERGE SORT>
  IndexExpressionIT.testGroupByCountMutableLocalIndex:461->helpTestGroupByCount:484 expected:<...
ROWS BY [TO_BIGINT([(A.INT_COL1 + B.INT_COL2)])]
CLIENT MERGE SORT> but was:<... ROWS BY [TO_BIGINT(["(A.INT_COL1 + B.INT_COL2)"])]
CLIENT MERGE SORT>
  IndexExpressionIT.testSelectDistinctImmutableIndex:499->helpTestSelectDistinct:535 expected:<...
ROWS BY [TO_BIGINT([(A.INT_COL1 + 1)])]
CLIENT MERGE SORT> but was:<... ROWS BY [TO_BIGINT(["(A.INT_COL1 + 1)"])]
CLIENT MERGE SORT>
  IndexExpressionIT.testSelectDistinctImmutableIndexLocal:504->helpTestSelectDistinct:535
expected:<... ROWS BY [TO_BIGINT([(A.INT_COL1 + 1)])]
CLIENT MERGE SORT> but was:<... ROWS BY [TO_BIGINT(["(A.INT_COL1 + 1)"])]
CLIENT MERGE SORT>
  IndexExpressionIT.testSelectDistinctMutableIndex:509->helpTestSelectDistinct:535 expected:<...
ROWS BY [TO_BIGINT([(A.INT_COL1 + 1)])]
CLIENT MERGE SORT> but was:<... ROWS BY [TO_BIGINT(["(A.INT_COL1 + 1)"])]
CLIENT MERGE SORT>
  IndexExpressionIT.testSelectDistinctMutableLocalIndex:514->helpTestSelectDistinct:535
expected:<... ROWS BY [TO_BIGINT([(A.INT_COL1 + 1)])]
CLIENT MERGE SORT> but was:<... ROWS BY [TO_BIGINT(["(A.INT_COL1 + 1)"])]
CLIENT MERGE SORT>



Tests run: 837, Failures: 8, Errors: 0, Skipped: 0

[INFO] [failsafe:integration-test {execution: NeedTheirOwnClusterTests}]
[INFO] Failsafe report directory: <https://builds.apache.org/job/Phoenix-4.0/ws/phoenix-core/target/failsafe-reports>
[INFO] parallel='none', perCoreThreadCount=true, threadCount=0, useUnlimitedThreads=false,
threadCountSuites=0, threadCountClasses=0, threadCountMethods=0, parallelOptimized=true

-------------------------------------------------------
 T E S T S
-------------------------------------------------------
Running org.apache.hadoop.hbase.regionserver.wal.WALReplayWithIndexWritesAndUncompressedWALInHBase_094_9_IT
Running org.apache.hadoop.hbase.regionserver.wal.WALReplayWithIndexWritesAndCompressedWALIT
Running org.apache.phoenix.hbase.index.covered.example.EndToEndCoveredIndexingIT
Running org.apache.phoenix.hbase.index.covered.EndToEndCoveredColumnsIndexBuilderIT
Running org.apache.phoenix.hbase.index.covered.example.EndtoEndIndexingWithCompressionIT
Tests run: 1, Failures: 0, Errors: 0, Skipped: 0, Time elapsed: 17.158 sec - in org.apache.hadoop.hbase.regionserver.wal.WALReplayWithIndexWritesAndCompressedWALIT
Tests run: 2, Failures: 0, Errors: 0, Skipped: 0, Time elapsed: 7.803 sec - in org.apache.phoenix.hbase.index.covered.EndToEndCoveredColumnsIndexBuilderIT
Running org.apache.phoenix.hbase.index.FailForUnsupportedHBaseVersionsIT
Tests run: 1, Failures: 0, Errors: 0, Skipped: 0, Time elapsed: 17.28 sec - in org.apache.hadoop.hbase.regionserver.wal.WALReplayWithIndexWritesAndUncompressedWALInHBase_094_9_IT
Running org.apache.phoenix.hbase.index.covered.example.FailWithoutRetriesIT
Running org.apache.phoenix.hbase.index.balancer.IndexLoadBalancerIT
Tests run: 2, Failures: 0, Errors: 0, Skipped: 0, Time elapsed: 15.673 sec - in org.apache.phoenix.hbase.index.FailForUnsupportedHBaseVersionsIT
Tests run: 1, Failures: 0, Errors: 0, Skipped: 0, Time elapsed: 8.979 sec - in org.apache.phoenix.hbase.index.covered.example.FailWithoutRetriesIT
Running org.apache.phoenix.end2end.index.ImmutableIndexWithStatsIT
Running org.apache.phoenix.end2end.index.MutableIndexReplicationIT
Tests run: 11, Failures: 0, Errors: 0, Skipped: 0, Time elapsed: 48.6 sec - in org.apache.phoenix.hbase.index.covered.example.EndToEndCoveredIndexingIT
Running org.apache.phoenix.end2end.index.MutableIndexFailureIT
Tests run: 1, Failures: 0, Errors: 0, Skipped: 0, Time elapsed: 6.439 sec - in org.apache.phoenix.end2end.index.ImmutableIndexWithStatsIT
Running org.apache.phoenix.end2end.index.IndexQosIT
Tests run: 11, Failures: 0, Errors: 0, Skipped: 0, Time elapsed: 50.734 sec - in org.apache.phoenix.hbase.index.covered.example.EndtoEndIndexingWithCompressionIT
Running org.apache.phoenix.end2end.index.DropIndexDuringUpsertIT
Tests run: 1, Failures: 0, Errors: 0, Skipped: 1, Time elapsed: 0.001 sec - in org.apache.phoenix.end2end.index.DropIndexDuringUpsertIT
Tests run: 1, Failures: 0, Errors: 0, Skipped: 0, Time elapsed: 17.949 sec - in org.apache.phoenix.end2end.index.MutableIndexReplicationIT
Running org.apache.phoenix.end2end.StatsCollectorIT
Tests run: 1, Failures: 0, Errors: 0, Skipped: 0, Time elapsed: 24.64 sec - in org.apache.phoenix.end2end.index.IndexQosIT
Running org.apache.phoenix.end2end.StatsCollectorWithSplitsAndMultiCFIT
Running org.apache.phoenix.end2end.TenantSpecificTablesDDLIT
Tests run: 2, Failures: 0, Errors: 0, Skipped: 0, Time elapsed: 32.128 sec - in org.apache.phoenix.end2end.StatsCollectorWithSplitsAndMultiCFIT
Tests run: 4, Failures: 0, Errors: 0, Skipped: 0, Time elapsed: 49.993 sec - in org.apache.phoenix.end2end.StatsCollectorIT
Tests run: 18, Failures: 0, Errors: 0, Skipped: 0, Time elapsed: 29.138 sec - in org.apache.phoenix.end2end.TenantSpecificTablesDDLIT
Tests run: 9, Failures: 0, Errors: 0, Skipped: 0, Time elapsed: 108.121 sec - in org.apache.phoenix.hbase.index.balancer.IndexLoadBalancerIT
Running org.apache.phoenix.end2end.CountDistinctCompressionIT
Running org.apache.phoenix.end2end.SpillableGroupByIT
Running org.apache.phoenix.end2end.KeyOnlyIT
Tests run: 1, Failures: 0, Errors: 0, Skipped: 0, Time elapsed: 9.557 sec - in org.apache.phoenix.end2end.CountDistinctCompressionIT
Running org.apache.phoenix.end2end.ViewIT
Tests run: 1, Failures: 0, Errors: 0, Skipped: 0, Time elapsed: 9.391 sec - in org.apache.phoenix.end2end.SpillableGroupByIT
Tests run: 3, Failures: 0, Errors: 0, Skipped: 0, Time elapsed: 10.435 sec - in org.apache.phoenix.end2end.KeyOnlyIT
Running org.apache.phoenix.end2end.MultiCfQueryExecIT
Running org.apache.phoenix.end2end.ContextClassloaderIT
Running org.apache.phoenix.end2end.QueryWithLimitIT
Tests run: 15, Failures: 0, Errors: 0, Skipped: 0, Time elapsed: 20.198 sec - in org.apache.phoenix.end2end.ViewIT
Tests run: 7, Failures: 0, Errors: 0, Skipped: 0, Time elapsed: 11.228 sec - in org.apache.phoenix.end2end.MultiCfQueryExecIT
Tests run: 3, Failures: 0, Errors: 0, Skipped: 0, Time elapsed: 9.236 sec - in org.apache.phoenix.end2end.ContextClassloaderIT
Tests run: 2, Failures: 0, Errors: 0, Skipped: 0, Time elapsed: 11.319 sec - in org.apache.phoenix.end2end.QueryWithLimitIT
Running org.apache.phoenix.end2end.ParallelIteratorsIT
Running org.apache.phoenix.end2end.TenantSpecificTablesDMLIT
Running org.apache.phoenix.end2end.AlterTableIT
Running org.apache.phoenix.end2end.SaltedViewIT
Tests run: 2, Failures: 0, Errors: 0, Skipped: 0, Time elapsed: 12.235 sec - in org.apache.phoenix.end2end.ParallelIteratorsIT
Tests run: 16, Failures: 0, Errors: 0, Skipped: 0, Time elapsed: 12.113 sec - in org.apache.phoenix.end2end.TenantSpecificTablesDMLIT
Tests run: 2, Failures: 0, Errors: 0, Skipped: 0, Time elapsed: 11.656 sec - in org.apache.phoenix.end2end.SaltedViewIT
Tests run: 3, Failures: 0, Errors: 0, Skipped: 0, Time elapsed: 147.12 sec - in org.apache.phoenix.end2end.index.MutableIndexFailureIT
Running org.apache.phoenix.mapreduce.IndexToolIT
Running org.apache.phoenix.end2end.QueryTimeoutIT
Tests run: 1, Failures: 0, Errors: 0, Skipped: 0, Time elapsed: 9.088 sec - in org.apache.phoenix.end2end.QueryTimeoutIT
Running org.apache.phoenix.mapreduce.CsvBulkLoadToolIT
Tests run: 5, Failures: 0, Errors: 0, Skipped: 0, Time elapsed: 202.965 sec - in org.apache.phoenix.mapreduce.IndexToolIT
Tests run: 51, Failures: 0, Errors: 0, Skipped: 0, Time elapsed: 240.622 sec - in org.apache.phoenix.end2end.AlterTableIT
Tests run: 6, Failures: 0, Errors: 0, Skipped: 0, Time elapsed: 247.782 sec - in org.apache.phoenix.mapreduce.CsvBulkLoadToolIT

Results :




Tests run: 184, Failures: 0, Errors: 0, Skipped: 1

[INFO] [failsafe:verify {execution: ClientManagedTimeTests}]
[INFO] Failsafe report directory: <https://builds.apache.org/job/Phoenix-4.0/ws/phoenix-core/target/failsafe-reports>
[INFO] ------------------------------------------------------------------------
[ERROR] BUILD FAILURE
[INFO] ------------------------------------------------------------------------
[INFO] There are test failures.

Please refer to <https://builds.apache.org/job/Phoenix-4.0/ws/phoenix-core/target/failsafe-reports>
for the individual test results.
[INFO] ------------------------------------------------------------------------
[INFO] For more information, run Maven with the -e switch
[INFO] ------------------------------------------------------------------------
[INFO] Total time: 17 minutes 51 seconds
[INFO] Finished at: Tue Mar 24 23:29:46 UTC 2015
[INFO] Final Memory: 103M/1034M
[INFO] ------------------------------------------------------------------------
Build step 'Invoke top-level Maven targets' marked build as failure
Archiving artifacts
Sending artifact delta relative to Phoenix | 4.x-HBase-0.98 #601
Archived 984 artifacts
Archive block size is 32768
Received 13797 blocks and 430115584 bytes
Compression is 51.2%
Took 3 min 20 sec
Recording test results

Mime
View raw message