phoenix-commits mailing list archives

Site index · List index
Message view « Date » · « Thread »
Top « Date » · « Thread »
From Apache Jenkins Server <jenk...@builds.apache.org>
Subject Build failed in Jenkins: Phoenix | Master #625
Date Thu, 19 Mar 2015 01:36:45 GMT
See <https://builds.apache.org/job/Phoenix-master/625/changes>

Changes:

[enis] PHOENIX-1747 Add maven eclipse generated files to .gitignore

------------------------------------------
[...truncated 505 lines...]
Running org.apache.phoenix.end2end.HashJoinIT
Tests run: 20, Failures: 0, Errors: 0, Skipped: 0, Time elapsed: 35.835 sec - in org.apache.phoenix.end2end.DeleteIT
Running org.apache.phoenix.end2end.ReadOnlyIT
Tests run: 1, Failures: 0, Errors: 0, Skipped: 0, Time elapsed: 8.843 sec - in org.apache.phoenix.end2end.ReadOnlyIT
Running org.apache.phoenix.end2end.MD5FunctionIT
Tests run: 2, Failures: 0, Errors: 0, Skipped: 0, Time elapsed: 5.798 sec - in org.apache.phoenix.end2end.MD5FunctionIT
Running org.apache.phoenix.end2end.HashJoinLocalIndexIT
Tests run: 54, Failures: 0, Errors: 0, Skipped: 0, Time elapsed: 167.011 sec - in org.apache.phoenix.end2end.index.IndexExpressionIT
Running org.apache.phoenix.end2end.StoreNullsIT
Tests run: 1, Failures: 0, Errors: 0, Skipped: 0, Time elapsed: 22.34 sec - in org.apache.phoenix.end2end.HashJoinLocalIndexIT
Running org.apache.phoenix.end2end.ArithmeticQueryIT
Tests run: 3, Failures: 0, Errors: 0, Skipped: 0, Time elapsed: 18.39 sec - in org.apache.phoenix.end2end.StoreNullsIT
Tests run: 20, Failures: 0, Errors: 0, Skipped: 0, Time elapsed: 176.122 sec - in org.apache.phoenix.end2end.index.LocalIndexIT
Running org.apache.phoenix.end2end.DecodeFunctionIT
Running org.apache.phoenix.end2end.ExecuteStatementsIT
Tests run: 6, Failures: 0, Errors: 0, Skipped: 0, Time elapsed: 3.896 sec - in org.apache.phoenix.end2end.DecodeFunctionIT
Running org.apache.phoenix.end2end.SpooledTmpFileDeleteIT
Tests run: 1, Failures: 0, Errors: 0, Skipped: 0, Time elapsed: 3.614 sec - in org.apache.phoenix.end2end.SpooledTmpFileDeleteIT
Running org.apache.phoenix.end2end.ServerExceptionIT
Tests run: 1, Failures: 0, Errors: 0, Skipped: 0, Time elapsed: 3.717 sec - in org.apache.phoenix.end2end.ServerExceptionIT
Running org.apache.phoenix.end2end.ToDateFunctionIT
Tests run: 21, Failures: 0, Errors: 0, Skipped: 0, Time elapsed: 22.968 sec - in org.apache.phoenix.end2end.ArithmeticQueryIT
Running org.apache.phoenix.end2end.CSVCommonsLoaderIT
Tests run: 8, Failures: 0, Errors: 0, Skipped: 0, Time elapsed: 2.563 sec - in org.apache.phoenix.end2end.ToDateFunctionIT
Running org.apache.phoenix.end2end.MappingTableDataTypeIT
Tests run: 2, Failures: 0, Errors: 0, Skipped: 0, Time elapsed: 19.804 sec - in org.apache.phoenix.end2end.ExecuteStatementsIT
Running org.apache.phoenix.end2end.TenantSpecificViewIndexIT
Tests run: 1, Failures: 0, Errors: 0, Skipped: 0, Time elapsed: 9.533 sec - in org.apache.phoenix.end2end.MappingTableDataTypeIT
Running org.apache.phoenix.end2end.InListIT
Tests run: 15, Failures: 0, Errors: 0, Skipped: 0, Time elapsed: 26.48 sec - in org.apache.phoenix.end2end.CSVCommonsLoaderIT
Tests run: 7, Failures: 0, Errors: 0, Skipped: 0, Time elapsed: 19.956 sec - in org.apache.phoenix.end2end.TenantSpecificViewIndexIT
Running org.apache.phoenix.end2end.StatementHintsIT
Running org.apache.phoenix.end2end.TenantSpecificViewIndexSaltedIT
Tests run: 2, Failures: 0, Errors: 0, Skipped: 0, Time elapsed: 3.848 sec - in org.apache.phoenix.end2end.StatementHintsIT
Running org.apache.phoenix.end2end.TimezoneOffsetFunctionIT
Tests run: 7, Failures: 0, Errors: 0, Skipped: 0, Time elapsed: 8.729 sec - in org.apache.phoenix.end2end.TimezoneOffsetFunctionIT
Running org.apache.phoenix.end2end.QueryExecWithoutSCNIT
Tests run: 4, Failures: 0, Errors: 0, Skipped: 0, Time elapsed: 15.873 sec - in org.apache.phoenix.end2end.TenantSpecificViewIndexSaltedIT
Running org.apache.phoenix.end2end.LpadFunctionIT
Tests run: 1, Failures: 0, Errors: 0, Skipped: 0, Time elapsed: 6.119 sec - in org.apache.phoenix.end2end.QueryExecWithoutSCNIT
Running org.apache.phoenix.end2end.PhoenixMetricsIT
Tests run: 4, Failures: 1, Errors: 0, Skipped: 0, Time elapsed: 9.135 sec <<< FAILURE!
- in org.apache.phoenix.end2end.PhoenixMetricsIT
testPhoenixMetricsForQueries(org.apache.phoenix.end2end.PhoenixMetricsIT)  Time elapsed: 3.428
sec  <<< FAILURE!
java.lang.AssertionError: null
	at org.junit.Assert.fail(Assert.java:86)
	at org.junit.Assert.assertTrue(Assert.java:41)
	at org.junit.Assert.assertTrue(Assert.java:52)
	at org.apache.phoenix.end2end.PhoenixMetricsIT.testPhoenixMetricsForQueries(PhoenixMetricsIT.java:80)

Running org.apache.phoenix.end2end.CoalesceFunctionIT
Tests run: 10, Failures: 0, Errors: 0, Skipped: 0, Time elapsed: 18.84 sec - in org.apache.phoenix.end2end.LpadFunctionIT
Running org.apache.phoenix.end2end.EvaluationOfORIT
Tests run: 1, Failures: 0, Errors: 0, Skipped: 0, Time elapsed: 3.373 sec - in org.apache.phoenix.end2end.EvaluationOfORIT
Running org.apache.phoenix.end2end.LastValueFunctionIT
Tests run: 10, Failures: 0, Errors: 0, Skipped: 0, Time elapsed: 10.293 sec - in org.apache.phoenix.end2end.CoalesceFunctionIT
Running org.apache.phoenix.end2end.SkipScanAfterManualSplitIT
Tests run: 11, Failures: 0, Errors: 0, Skipped: 0, Time elapsed: 8.422 sec - in org.apache.phoenix.end2end.LastValueFunctionIT
Running org.apache.phoenix.end2end.salted.SaltedTableVarLengthRowKeyIT
Tests run: 1, Failures: 0, Errors: 0, Skipped: 0, Time elapsed: 3.477 sec - in org.apache.phoenix.end2end.salted.SaltedTableVarLengthRowKeyIT
Running org.apache.phoenix.end2end.salted.SaltedTableUpsertSelectIT
Tests run: 5, Failures: 0, Errors: 0, Skipped: 0, Time elapsed: 13.144 sec - in org.apache.phoenix.end2end.salted.SaltedTableUpsertSelectIT
Running org.apache.phoenix.end2end.DynamicFamilyIT
Tests run: 4, Failures: 0, Errors: 0, Skipped: 0, Time elapsed: 8.215 sec - in org.apache.phoenix.end2end.DynamicFamilyIT
Running org.apache.phoenix.end2end.MinMaxAggregateFunctionIT
Tests run: 1, Failures: 0, Errors: 0, Skipped: 0, Time elapsed: 4.853 sec - in org.apache.phoenix.end2end.MinMaxAggregateFunctionIT
Running org.apache.phoenix.end2end.SubqueryIT
Tests run: 3, Failures: 0, Errors: 0, Skipped: 0, Time elapsed: 38.156 sec - in org.apache.phoenix.end2end.SkipScanAfterManualSplitIT
Running org.apache.phoenix.end2end.YearMonthSecondFunctionIT
Tests run: 3, Failures: 0, Errors: 0, Skipped: 0, Time elapsed: 3.652 sec - in org.apache.phoenix.end2end.YearMonthSecondFunctionIT
Running org.apache.phoenix.end2end.ReverseScanIT
Tests run: 2, Failures: 0, Errors: 0, Skipped: 0, Time elapsed: 4.178 sec - in org.apache.phoenix.end2end.ReverseScanIT
Running org.apache.phoenix.end2end.SortMergeJoinIT
Tests run: 25, Failures: 0, Errors: 0, Skipped: 0, Time elapsed: 112.8 sec - in org.apache.phoenix.end2end.InListIT
Running org.apache.phoenix.end2end.SignFunctionEnd2EndIT
Tests run: 2, Failures: 0, Errors: 0, Skipped: 0, Time elapsed: 7.211 sec - in org.apache.phoenix.end2end.SignFunctionEnd2EndIT
Running org.apache.phoenix.end2end.QueryMoreIT
Tests run: 5, Failures: 0, Errors: 0, Skipped: 0, Time elapsed: 26.12 sec - in org.apache.phoenix.end2end.QueryMoreIT
Running org.apache.phoenix.end2end.ConvertTimezoneFunctionIT
Tests run: 105, Failures: 0, Errors: 0, Skipped: 0, Time elapsed: 226.55 sec - in org.apache.phoenix.end2end.HashJoinIT
Running org.apache.phoenix.trace.PhoenixTraceReaderIT
Tests run: 2, Failures: 0, Errors: 0, Skipped: 0, Time elapsed: 1.482 sec - in org.apache.phoenix.trace.PhoenixTraceReaderIT
Running org.apache.phoenix.trace.PhoenixTracingEndToEndIT
Tests run: 6, Failures: 0, Errors: 0, Skipped: 0, Time elapsed: 5.42 sec - in org.apache.phoenix.end2end.ConvertTimezoneFunctionIT
Running org.apache.phoenix.trace.PhoenixTableMetricsWriterIT
Tests run: 2, Failures: 0, Errors: 0, Skipped: 0, Time elapsed: 1.007 sec - in org.apache.phoenix.trace.PhoenixTableMetricsWriterIT
Tests run: 21, Failures: 0, Errors: 0, Skipped: 0, Time elapsed: 90.619 sec - in org.apache.phoenix.end2end.SubqueryIT
Tests run: 6, Failures: 0, Errors: 0, Skipped: 0, Time elapsed: 86.079 sec - in org.apache.phoenix.trace.PhoenixTracingEndToEndIT
Tests run: 105, Failures: 0, Errors: 0, Skipped: 0, Time elapsed: 364.181 sec - in org.apache.phoenix.end2end.SpooledSortMergeJoinIT
Tests run: 105, Failures: 0, Errors: 0, Skipped: 0, Time elapsed: 199.09 sec - in org.apache.phoenix.end2end.SortMergeJoinIT

Results :

Failed tests: 
  PhoenixMetricsIT.testPhoenixMetricsForQueries:80 null



Tests run: 831, Failures: 1, Errors: 0, Skipped: 0

[INFO] 
[INFO] --- maven-failsafe-plugin:2.18:integration-test (NeedTheirOwnClusterTests) @ phoenix-core
---
[INFO] Failsafe report directory: <https://builds.apache.org/job/Phoenix-master/ws/phoenix-core/target/failsafe-reports>
[INFO] parallel='none', perCoreThreadCount=true, threadCount=0, useUnlimitedThreads=false,
threadCountSuites=0, threadCountClasses=0, threadCountMethods=0, parallelOptimized=true

-------------------------------------------------------
 T E S T S
-------------------------------------------------------
Running org.apache.phoenix.end2end.index.MutableIndexFailureIT
Running org.apache.phoenix.end2end.index.ImmutableIndexWithStatsIT
Running org.apache.phoenix.end2end.ViewIT
Running org.apache.phoenix.end2end.TenantSpecificTablesDMLIT
Tests run: 1, Failures: 0, Errors: 0, Skipped: 0, Time elapsed: 5.921 sec - in org.apache.phoenix.end2end.index.ImmutableIndexWithStatsIT
Running org.apache.phoenix.end2end.index.DropIndexDuringUpsertIT
Tests run: 1, Failures: 0, Errors: 0, Skipped: 1, Time elapsed: 0.001 sec - in org.apache.phoenix.end2end.index.DropIndexDuringUpsertIT
Running org.apache.phoenix.end2end.index.MutableIndexReplicationIT
Running org.apache.phoenix.end2end.QueryTimeoutIT
Tests run: 1, Failures: 0, Errors: 0, Skipped: 0, Time elapsed: 21.149 sec - in org.apache.phoenix.end2end.index.MutableIndexReplicationIT
Tests run: 16, Failures: 0, Errors: 0, Skipped: 0, Time elapsed: 33.199 sec - in org.apache.phoenix.end2end.TenantSpecificTablesDMLIT
Tests run: 15, Failures: 0, Errors: 0, Skipped: 0, Time elapsed: 45.436 sec - in org.apache.phoenix.end2end.ViewIT
Running org.apache.phoenix.end2end.QueryWithLimitIT
Tests run: 1, Failures: 0, Errors: 0, Skipped: 0, Time elapsed: 27.605 sec - in org.apache.phoenix.end2end.QueryTimeoutIT
Running org.apache.phoenix.end2end.StatsCollectorIT
Running org.apache.phoenix.end2end.KeyOnlyIT
Tests run: 2, Failures: 0, Errors: 0, Skipped: 0, Time elapsed: 16.458 sec - in org.apache.phoenix.end2end.QueryWithLimitIT
Running org.apache.phoenix.end2end.ContextClassloaderIT
Tests run: 3, Failures: 0, Errors: 0, Skipped: 0, Time elapsed: 17.738 sec - in org.apache.phoenix.end2end.KeyOnlyIT
Tests run: 3, Failures: 0, Errors: 0, Skipped: 0, Time elapsed: 3.808 sec - in org.apache.phoenix.end2end.ContextClassloaderIT
Running org.apache.phoenix.end2end.MultiCfQueryExecIT
Running org.apache.phoenix.end2end.SaltedViewIT
Tests run: 7, Failures: 0, Errors: 0, Skipped: 0, Time elapsed: 16.832 sec - in org.apache.phoenix.end2end.MultiCfQueryExecIT
Tests run: 4, Failures: 0, Errors: 0, Skipped: 0, Time elapsed: 55.873 sec - in org.apache.phoenix.end2end.StatsCollectorIT
Tests run: 2, Failures: 0, Errors: 0, Skipped: 0, Time elapsed: 18.12 sec - in org.apache.phoenix.end2end.SaltedViewIT
Running org.apache.phoenix.end2end.TenantSpecificTablesDDLIT
Running org.apache.phoenix.end2end.CountDistinctCompressionIT
Running org.apache.phoenix.end2end.SpillableGroupByIT
Tests run: 1, Failures: 0, Errors: 0, Skipped: 0, Time elapsed: 8.376 sec - in org.apache.phoenix.end2end.CountDistinctCompressionIT
Tests run: 1, Failures: 0, Errors: 0, Skipped: 0, Time elapsed: 7.554 sec - in org.apache.phoenix.end2end.SpillableGroupByIT
Running org.apache.phoenix.end2end.StatsCollectorWithSplitsAndMultiCFIT
Tests run: 18, Failures: 0, Errors: 0, Skipped: 0, Time elapsed: 37.205 sec - in org.apache.phoenix.end2end.TenantSpecificTablesDDLIT
Running org.apache.phoenix.end2end.ParallelIteratorsIT
Tests run: 3, Failures: 0, Errors: 0, Skipped: 0, Time elapsed: 195.986 sec - in org.apache.phoenix.end2end.index.MutableIndexFailureIT
Running org.apache.phoenix.mapreduce.IndexToolIT
Tests run: 2, Failures: 0, Errors: 0, Skipped: 0, Time elapsed: 17.057 sec - in org.apache.phoenix.end2end.ParallelIteratorsIT
Running org.apache.phoenix.hbase.index.FailForUnsupportedHBaseVersionsIT
Tests run: 2, Failures: 0, Errors: 0, Skipped: 0, Time elapsed: 26.625 sec - in org.apache.phoenix.end2end.StatsCollectorWithSplitsAndMultiCFIT
Running org.apache.phoenix.hbase.index.covered.example.EndToEndCoveredIndexingIT
Tests run: 2, Failures: 0, Errors: 0, Skipped: 0, Time elapsed: 17.007 sec - in org.apache.phoenix.hbase.index.FailForUnsupportedHBaseVersionsIT
Running org.apache.phoenix.hbase.index.covered.example.EndtoEndIndexingWithCompressionIT
Running org.apache.phoenix.mapreduce.CsvBulkLoadToolIT
Tests run: 11, Failures: 0, Errors: 0, Skipped: 0, Time elapsed: 58.756 sec - in org.apache.phoenix.hbase.index.covered.example.EndToEndCoveredIndexingIT
Running org.apache.phoenix.hbase.index.covered.example.FailWithoutRetriesIT
Tests run: 11, Failures: 0, Errors: 0, Skipped: 0, Time elapsed: 58.312 sec - in org.apache.phoenix.hbase.index.covered.example.EndtoEndIndexingWithCompressionIT
Tests run: 1, Failures: 0, Errors: 0, Skipped: 0, Time elapsed: 6.898 sec - in org.apache.phoenix.hbase.index.covered.example.FailWithoutRetriesIT
Running org.apache.phoenix.hbase.index.covered.EndToEndCoveredColumnsIndexBuilderIT
Running org.apache.phoenix.hbase.index.balancer.IndexLoadBalancerIT
Tests run: 2, Failures: 0, Errors: 0, Skipped: 0, Time elapsed: 7.247 sec - in org.apache.phoenix.hbase.index.covered.EndToEndCoveredColumnsIndexBuilderIT
Running org.apache.hadoop.hbase.regionserver.wal.WALReplayWithIndexWritesAndCompressedWALIT
Tests run: 1, Failures: 0, Errors: 0, Skipped: 0, Time elapsed: 16.636 sec - in org.apache.hadoop.hbase.regionserver.wal.WALReplayWithIndexWritesAndCompressedWALIT
Running org.apache.hadoop.hbase.regionserver.wal.WALReplayWithIndexWritesAndUncompressedWALInHBase_094_9_IT
Tests run: 1, Failures: 0, Errors: 0, Skipped: 0, Time elapsed: 18.1 sec - in org.apache.hadoop.hbase.regionserver.wal.WALReplayWithIndexWritesAndUncompressedWALInHBase_094_9_IT
Running org.apache.phoenix.end2end.AlterTableIT
Tests run: 1, Failures: 0, Errors: 1, Skipped: 0, Time elapsed: 0.027 sec <<< FAILURE!
- in org.apache.phoenix.end2end.AlterTableIT
org.apache.phoenix.end2end.AlterTableIT  Time elapsed: 0.027 sec  <<< ERROR!
java.sql.SQLTimeoutException: Operation timed out
	at org.apache.phoenix.exception.SQLExceptionCode$14.newException(SQLExceptionCode.java:314)
	at org.apache.phoenix.exception.SQLExceptionInfo.buildException(SQLExceptionInfo.java:133)
	at org.apache.phoenix.iterate.BaseResultIterators.getIterators(BaseResultIterators.java:585)
	at org.apache.phoenix.iterate.ConcatResultIterator.getIterators(ConcatResultIterator.java:50)
	at org.apache.phoenix.iterate.ConcatResultIterator.currentIterator(ConcatResultIterator.java:97)
	at org.apache.phoenix.iterate.ConcatResultIterator.next(ConcatResultIterator.java:117)
	at org.apache.phoenix.iterate.BaseGroupedAggregatingResultIterator.next(BaseGroupedAggregatingResultIterator.java:64)
	at org.apache.phoenix.iterate.UngroupedAggregatingResultIterator.next(UngroupedAggregatingResultIterator.java:39)
	at org.apache.phoenix.compile.PostDDLCompiler$1.execute(PostDDLCompiler.java:211)
	at org.apache.phoenix.query.ConnectionQueryServicesImpl.updateData(ConnectionQueryServicesImpl.java:1991)
	at org.apache.phoenix.query.DelegateConnectionQueryServices.updateData(DelegateConnectionQueryServices.java:142)
	at org.apache.phoenix.schema.MetaDataClient.createTable(MetaDataClient.java:609)
	at org.apache.phoenix.compile.CreateTableCompiler$2.execute(CreateTableCompiler.java:177)
	at org.apache.phoenix.jdbc.PhoenixStatement$2.call(PhoenixStatement.java:292)
	at org.apache.phoenix.jdbc.PhoenixStatement$2.call(PhoenixStatement.java:284)
	at org.apache.phoenix.call.CallRunner.run(CallRunner.java:53)
	at org.apache.phoenix.jdbc.PhoenixStatement.executeMutation(PhoenixStatement.java:282)
	at org.apache.phoenix.jdbc.PhoenixStatement.executeUpdate(PhoenixStatement.java:1082)
	at org.apache.phoenix.query.ConnectionQueryServicesImpl$11.call(ConnectionQueryServicesImpl.java:1841)
	at org.apache.phoenix.query.ConnectionQueryServicesImpl$11.call(ConnectionQueryServicesImpl.java:1810)
	at org.apache.phoenix.util.PhoenixContextExecutor.call(PhoenixContextExecutor.java:77)
	at org.apache.phoenix.query.ConnectionQueryServicesImpl.init(ConnectionQueryServicesImpl.java:1810)
	at org.apache.phoenix.end2end.ConnectionQueryServicesTestImpl.init(ConnectionQueryServicesTestImpl.java:45)
	at org.apache.phoenix.jdbc.PhoenixTestDriver.getConnectionQueryServices(PhoenixTestDriver.java:96)
	at org.apache.phoenix.jdbc.PhoenixEmbeddedDriver.connect(PhoenixEmbeddedDriver.java:126)
	at org.apache.phoenix.jdbc.PhoenixTestDriver.connect(PhoenixTestDriver.java:83)
	at org.apache.phoenix.query.BaseTest.initAndRegisterDriver(BaseTest.java:664)
	at org.apache.phoenix.query.BaseTest.setUpTestDriver(BaseTest.java:536)
	at org.apache.phoenix.end2end.AlterTableIT.doSetup(AlterTableIT.java:85)

Tests run: 9, Failures: 0, Errors: 0, Skipped: 0, Time elapsed: 133.618 sec - in org.apache.phoenix.hbase.index.balancer.IndexLoadBalancerIT
Tests run: 5, Failures: 0, Errors: 0, Skipped: 0, Time elapsed: 250.945 sec - in org.apache.phoenix.mapreduce.IndexToolIT
Tests run: 6, Failures: 0, Errors: 0, Skipped: 0, Time elapsed: 292.689 sec - in org.apache.phoenix.mapreduce.CsvBulkLoadToolIT

Results :


Tests in error: 
  AlterTableIT.doSetup:85->BaseTest.setUpTestDriver:536->BaseTest.initAndRegisterDriver:664
ยป SQLTimeout


Tests run: 133, Failures: 0, Errors: 1, Skipped: 1

[INFO] 
[INFO] --- maven-failsafe-plugin:2.18:verify (ClientManagedTimeTests) @ phoenix-core ---
[INFO] Failsafe report directory: <https://builds.apache.org/job/Phoenix-master/ws/phoenix-core/target/failsafe-reports>
[INFO] ------------------------------------------------------------------------
[INFO] Reactor Summary:
[INFO] 
[INFO] Apache Phoenix .................................... SUCCESS [3.146s]
[INFO] Phoenix Core ...................................... FAILURE [24:49.087s]
[INFO] Phoenix - Flume ................................... SKIPPED
[INFO] Phoenix - Pig ..................................... SKIPPED
[INFO] Phoenix Assembly .................................. SKIPPED
[INFO] Phoenix - Pherf ................................... SKIPPED
[INFO] ------------------------------------------------------------------------
[INFO] BUILD FAILURE
[INFO] ------------------------------------------------------------------------
[INFO] Total time: 24:53.132s
[INFO] Finished at: Thu Mar 19 01:33:19 UTC 2015
[INFO] Final Memory: 50M/1131M
[INFO] ------------------------------------------------------------------------
[ERROR] Failed to execute goal org.apache.maven.plugins:maven-failsafe-plugin:2.18:verify
(ClientManagedTimeTests) on project phoenix-core: There are test failures.
[ERROR] 
[ERROR] Please refer to <https://builds.apache.org/job/Phoenix-master/ws/phoenix-core/target/failsafe-reports>
for the individual test results.
[ERROR] -> [Help 1]
[ERROR] 
[ERROR] To see the full stack trace of the errors, re-run Maven with the -e switch.
[ERROR] Re-run Maven using the -X switch to enable full debug logging.
[ERROR] 
[ERROR] For more information about the errors and possible solutions, please read the following
articles:
[ERROR] [Help 1] http://cwiki.apache.org/confluence/display/MAVEN/MojoFailureException
[ERROR] 
[ERROR] After correcting the problems, you can resume the build with the command
[ERROR]   mvn <goals> -rf :phoenix-core
Build step 'Invoke top-level Maven targets' marked build as failure
Archiving artifacts
Sending artifact delta relative to Phoenix | Master #624
Archived 1028 artifacts
Archive block size is 32768
Received 13747 blocks and 449016870 bytes
Compression is 50.1%
Took 3 min 13 sec
Updating PHOENIX-1747
Recording test results

Mime
View raw message