phoenix-commits mailing list archives

Site index · List index
Message view « Date » · « Thread »
Top « Date » · « Thread »
From Apache Jenkins Server <jenk...@builds.apache.org>
Subject Build failed in Jenkins: Phoenix | 4.x-HBase-0.98 #602
Date Tue, 24 Mar 2015 19:47:08 GMT
See <https://builds.apache.org/job/Phoenix-4.0/602/changes>

Changes:

[gabrielr] PHOENIX-1653 Support separate clusters for MR jobs

------------------------------------------
[...truncated 442 lines...]
Running org.apache.phoenix.end2end.QueryMoreIT
Tests run: 3, Failures: 0, Errors: 0, Skipped: 0, Time elapsed: 10.069 sec - in org.apache.phoenix.end2end.UpsertSelectAutoCommitIT
Running org.apache.phoenix.end2end.BinaryRowKeyIT
Tests run: 3, Failures: 0, Errors: 0, Skipped: 0, Time elapsed: 2.503 sec - in org.apache.phoenix.end2end.BinaryRowKeyIT
Running org.apache.phoenix.end2end.TenantSpecificViewIndexIT
Tests run: 5, Failures: 0, Errors: 0, Skipped: 0, Time elapsed: 14.368 sec - in org.apache.phoenix.end2end.QueryMoreIT
Running org.apache.phoenix.end2end.MappingTableDataTypeIT
Tests run: 1, Failures: 0, Errors: 0, Skipped: 0, Time elapsed: 6.779 sec - in org.apache.phoenix.end2end.MappingTableDataTypeIT
Running org.apache.phoenix.end2end.salted.SaltedTableVarLengthRowKeyIT
Tests run: 7, Failures: 0, Errors: 0, Skipped: 0, Time elapsed: 11.744 sec - in org.apache.phoenix.end2end.TenantSpecificViewIndexIT
Running org.apache.phoenix.end2end.salted.SaltedTableUpsertSelectIT
Tests run: 1, Failures: 0, Errors: 0, Skipped: 0, Time elapsed: 2.214 sec - in org.apache.phoenix.end2end.salted.SaltedTableVarLengthRowKeyIT
Running org.apache.phoenix.end2end.SpooledSortMergeJoinIT
Tests run: 5, Failures: 0, Errors: 0, Skipped: 0, Time elapsed: 8.137 sec - in org.apache.phoenix.end2end.salted.SaltedTableUpsertSelectIT
Running org.apache.phoenix.end2end.SkipScanAfterManualSplitIT
Tests run: 6, Failures: 0, Errors: 0, Skipped: 0, Time elapsed: 92.8 sec - in org.apache.phoenix.trace.PhoenixTracingEndToEndIT
Running org.apache.phoenix.end2end.StoreNullsIT
Tests run: 105, Failures: 0, Errors: 0, Skipped: 0, Time elapsed: 99.564 sec - in org.apache.phoenix.end2end.HashJoinIT
Running org.apache.phoenix.end2end.PhoenixRuntimeIT
Tests run: 3, Failures: 0, Errors: 0, Skipped: 0, Time elapsed: 24.17 sec - in org.apache.phoenix.end2end.SkipScanAfterManualSplitIT
Running org.apache.phoenix.end2end.RegexpSplitFunctionIT
Tests run: 11, Failures: 0, Errors: 0, Skipped: 0, Time elapsed: 3.049 sec - in org.apache.phoenix.end2end.RegexpSplitFunctionIT
Running org.apache.phoenix.end2end.StddevIT
Tests run: 4, Failures: 0, Errors: 0, Skipped: 0, Time elapsed: 2.781 sec - in org.apache.phoenix.end2end.StddevIT
Running org.apache.phoenix.end2end.SubqueryIT
Tests run: 3, Failures: 0, Errors: 0, Skipped: 0, Time elapsed: 14.771 sec - in org.apache.phoenix.end2end.StoreNullsIT
Running org.apache.phoenix.end2end.CoalesceFunctionIT
Tests run: 2, Failures: 0, Errors: 0, Skipped: 0, Time elapsed: 12.908 sec - in org.apache.phoenix.end2end.PhoenixRuntimeIT
Running org.apache.phoenix.end2end.index.GlobalIndexOptimizationIT
Tests run: 105, Failures: 0, Errors: 0, Skipped: 0, Time elapsed: 96.428 sec - in org.apache.phoenix.end2end.SortMergeJoinIT
Running org.apache.phoenix.end2end.index.LocalIndexIT
Tests run: 10, Failures: 0, Errors: 0, Skipped: 0, Time elapsed: 8.082 sec - in org.apache.phoenix.end2end.CoalesceFunctionIT
Running org.apache.phoenix.end2end.index.GlobalMutableIndexIT
Tests run: 6, Failures: 0, Errors: 0, Skipped: 0, Time elapsed: 29.271 sec - in org.apache.phoenix.end2end.index.GlobalIndexOptimizationIT
Running org.apache.phoenix.end2end.index.SaltedIndexIT
Tests run: 21, Failures: 0, Errors: 0, Skipped: 0, Time elapsed: 41.373 sec - in org.apache.phoenix.end2end.SubqueryIT
Running org.apache.phoenix.end2end.index.IndexMetadataIT
Tests run: 3, Failures: 0, Errors: 0, Skipped: 0, Time elapsed: 13.467 sec - in org.apache.phoenix.end2end.index.SaltedIndexIT
Running org.apache.phoenix.end2end.index.IndexExpressionIT
Tests run: 105, Failures: 0, Errors: 0, Skipped: 0, Time elapsed: 98.197 sec - in org.apache.phoenix.end2end.SpooledSortMergeJoinIT
Running org.apache.phoenix.end2end.index.DropViewIT
Tests run: 1, Failures: 0, Errors: 0, Skipped: 0, Time elapsed: 6.691 sec - in org.apache.phoenix.end2end.index.DropViewIT
Running org.apache.phoenix.end2end.index.LocalMutableIndexIT
Tests run: 15, Failures: 0, Errors: 0, Skipped: 0, Time elapsed: 62.524 sec - in org.apache.phoenix.end2end.index.GlobalMutableIndexIT
Running org.apache.phoenix.end2end.index.ViewIndexIT
Tests run: 6, Failures: 0, Errors: 0, Skipped: 0, Time elapsed: 32.772 sec - in org.apache.phoenix.end2end.index.IndexMetadataIT
Running org.apache.phoenix.end2end.index.ImmutableIndexIT
Tests run: 1, Failures: 0, Errors: 0, Skipped: 0, Time elapsed: 3.818 sec - in org.apache.phoenix.end2end.index.ViewIndexIT
Running org.apache.phoenix.end2end.ServerExceptionIT
Tests run: 1, Failures: 0, Errors: 0, Skipped: 0, Time elapsed: 2.214 sec - in org.apache.phoenix.end2end.ServerExceptionIT
Running org.apache.phoenix.end2end.CSVCommonsLoaderIT
Tests run: 15, Failures: 0, Errors: 0, Skipped: 0, Time elapsed: 13.49 sec - in org.apache.phoenix.end2end.CSVCommonsLoaderIT
Running org.apache.phoenix.end2end.ReverseFunctionIT
Tests run: 5, Failures: 0, Errors: 0, Skipped: 0, Time elapsed: 2.735 sec - in org.apache.phoenix.end2end.ReverseFunctionIT
Running org.apache.phoenix.end2end.AutoCommitIT
Tests run: 1, Failures: 0, Errors: 0, Skipped: 0, Time elapsed: 2.208 sec - in org.apache.phoenix.end2end.AutoCommitIT
Running org.apache.phoenix.end2end.YearMonthSecondFunctionIT
Tests run: 3, Failures: 0, Errors: 0, Skipped: 0, Time elapsed: 2.034 sec - in org.apache.phoenix.end2end.YearMonthSecondFunctionIT
Running org.apache.phoenix.end2end.TenantSpecificViewIndexSaltedIT
Tests run: 13, Failures: 0, Errors: 0, Skipped: 0, Time elapsed: 25.609 sec - in org.apache.phoenix.end2end.index.ImmutableIndexIT
Running org.apache.phoenix.end2end.SpooledTmpFileDeleteIT
Tests run: 1, Failures: 0, Errors: 0, Skipped: 0, Time elapsed: 2.757 sec - in org.apache.phoenix.end2end.SpooledTmpFileDeleteIT
Running org.apache.phoenix.end2end.DecodeFunctionIT
Tests run: 6, Failures: 0, Errors: 0, Skipped: 0, Time elapsed: 2.946 sec - in org.apache.phoenix.end2end.DecodeFunctionIT
Running org.apache.phoenix.end2end.ModulusExpressionIT
Tests run: 4, Failures: 0, Errors: 0, Skipped: 0, Time elapsed: 8.011 sec - in org.apache.phoenix.end2end.TenantSpecificViewIndexSaltedIT
Running org.apache.phoenix.end2end.LastValueFunctionIT
Tests run: 11, Failures: 0, Errors: 0, Skipped: 0, Time elapsed: 4.719 sec - in org.apache.phoenix.end2end.ModulusExpressionIT
Running org.apache.phoenix.end2end.FirstValueFunctionIT
Tests run: 11, Failures: 0, Errors: 0, Skipped: 0, Time elapsed: 4.939 sec - in org.apache.phoenix.end2end.LastValueFunctionIT
Running org.apache.phoenix.end2end.PhoenixMetricsIT
Tests run: 7, Failures: 0, Errors: 0, Skipped: 0, Time elapsed: 2.602 sec - in org.apache.phoenix.end2end.FirstValueFunctionIT
Running org.apache.phoenix.end2end.DisableLocalIndexIT
Tests run: 4, Failures: 0, Errors: 0, Skipped: 0, Time elapsed: 4.989 sec - in org.apache.phoenix.end2end.PhoenixMetricsIT
Running org.apache.phoenix.end2end.HashJoinLocalIndexIT
Tests run: 1, Failures: 0, Errors: 0, Skipped: 0, Time elapsed: 4.791 sec - in org.apache.phoenix.end2end.DisableLocalIndexIT
Running org.apache.phoenix.end2end.UpsertBigValuesIT
Tests run: 4, Failures: 0, Errors: 0, Skipped: 0, Time elapsed: 8.186 sec - in org.apache.phoenix.end2end.UpsertBigValuesIT
Running org.apache.phoenix.end2end.MD5FunctionIT
Tests run: 15, Failures: 0, Errors: 0, Skipped: 0, Time elapsed: 59.757 sec - in org.apache.phoenix.end2end.index.LocalMutableIndexIT
Running org.apache.phoenix.end2end.LpadFunctionIT
Tests run: 20, Failures: 0, Errors: 0, Skipped: 0, Time elapsed: 124.531 sec - in org.apache.phoenix.end2end.index.LocalIndexIT
Running org.apache.phoenix.end2end.SignFunctionEnd2EndIT
Tests run: 1, Failures: 0, Errors: 0, Skipped: 0, Time elapsed: 13.04 sec - in org.apache.phoenix.end2end.HashJoinLocalIndexIT
Tests run: 2, Failures: 0, Errors: 0, Skipped: 0, Time elapsed: 3.814 sec - in org.apache.phoenix.end2end.MD5FunctionIT
Running org.apache.phoenix.end2end.QueryExecWithoutSCNIT
Running org.apache.phoenix.end2end.DynamicFamilyIT
Tests run: 1, Failures: 0, Errors: 0, Skipped: 0, Time elapsed: 2.273 sec - in org.apache.phoenix.end2end.QueryExecWithoutSCNIT
Running org.apache.phoenix.end2end.RoundFloorCeilFunctionsEnd2EndIT
Tests run: 2, Failures: 0, Errors: 0, Skipped: 0, Time elapsed: 3.745 sec - in org.apache.phoenix.end2end.SignFunctionEnd2EndIT
Tests run: 10, Failures: 0, Errors: 0, Skipped: 0, Time elapsed: 6.35 sec - in org.apache.phoenix.end2end.LpadFunctionIT
Running org.apache.phoenix.end2end.DeleteIT
Running org.apache.phoenix.end2end.InListIT
Tests run: 4, Failures: 0, Errors: 0, Skipped: 0, Time elapsed: 5.107 sec - in org.apache.phoenix.end2end.DynamicFamilyIT
Running org.apache.phoenix.end2end.EvaluationOfORIT
Tests run: 1, Failures: 0, Errors: 0, Skipped: 0, Time elapsed: 1.824 sec - in org.apache.phoenix.end2end.EvaluationOfORIT
Running org.apache.phoenix.end2end.ReverseScanIT
Tests run: 30, Failures: 0, Errors: 0, Skipped: 0, Time elapsed: 5.934 sec - in org.apache.phoenix.end2end.RoundFloorCeilFunctionsEnd2EndIT
Running org.apache.phoenix.end2end.NthValueFunctionIT
Tests run: 2, Failures: 0, Errors: 0, Skipped: 0, Time elapsed: 2.578 sec - in org.apache.phoenix.end2end.ReverseScanIT
Running org.apache.phoenix.end2end.ReadOnlyIT
Tests run: 11, Failures: 0, Errors: 0, Skipped: 0, Time elapsed: 5.378 sec - in org.apache.phoenix.end2end.NthValueFunctionIT
Running org.apache.phoenix.end2end.ExecuteStatementsIT
Tests run: 1, Failures: 0, Errors: 0, Skipped: 0, Time elapsed: 6.767 sec - in org.apache.phoenix.end2end.ReadOnlyIT
Tests run: 2, Failures: 0, Errors: 0, Skipped: 0, Time elapsed: 14.172 sec - in org.apache.phoenix.end2end.ExecuteStatementsIT
Tests run: 20, Failures: 0, Errors: 0, Skipped: 0, Time elapsed: 27.197 sec - in org.apache.phoenix.end2end.DeleteIT
Tests run: 54, Failures: 0, Errors: 0, Skipped: 0, Time elapsed: 132.566 sec - in org.apache.phoenix.end2end.index.IndexExpressionIT
Tests run: 25, Failures: 0, Errors: 0, Skipped: 0, Time elapsed: 53.644 sec - in org.apache.phoenix.end2end.InListIT

Results :




Tests run: 833, Failures: 0, Errors: 0, Skipped: 0

[INFO] [failsafe:integration-test {execution: NeedTheirOwnClusterTests}]
[INFO] Failsafe report directory: <https://builds.apache.org/job/Phoenix-4.0/ws/phoenix-core/target/failsafe-reports>
[INFO] parallel='none', perCoreThreadCount=true, threadCount=0, useUnlimitedThreads=false,
threadCountSuites=0, threadCountClasses=0, threadCountMethods=0, parallelOptimized=true

-------------------------------------------------------
 T E S T S
-------------------------------------------------------
Running org.apache.phoenix.mapreduce.IndexToolIT
Running org.apache.phoenix.end2end.MultiCfQueryExecIT
Running org.apache.phoenix.end2end.ViewIT
Running org.apache.phoenix.end2end.StatsCollectorIT
Tests run: 7, Failures: 0, Errors: 0, Skipped: 0, Time elapsed: 17.752 sec - in org.apache.phoenix.end2end.MultiCfQueryExecIT
Running org.apache.phoenix.mapreduce.CsvBulkLoadToolIT
Tests run: 15, Failures: 0, Errors: 0, Skipped: 0, Time elapsed: 26.977 sec - in org.apache.phoenix.end2end.ViewIT
Running org.apache.phoenix.end2end.AlterTableIT
Running org.apache.phoenix.end2end.SaltedViewIT
Tests run: 4, Failures: 0, Errors: 0, Skipped: 0, Time elapsed: 47.311 sec - in org.apache.phoenix.end2end.StatsCollectorIT
Running org.apache.phoenix.end2end.index.IndexQosIT
Tests run: 2, Failures: 0, Errors: 0, Skipped: 0, Time elapsed: 9.177 sec - in org.apache.phoenix.end2end.SaltedViewIT
Running org.apache.phoenix.end2end.index.ImmutableIndexWithStatsIT
Tests run: 1, Failures: 0, Errors: 0, Skipped: 0, Time elapsed: 25.28 sec - in org.apache.phoenix.end2end.index.IndexQosIT
Tests run: 1, Failures: 0, Errors: 0, Skipped: 0, Time elapsed: 8.751 sec - in org.apache.phoenix.end2end.index.ImmutableIndexWithStatsIT
Running org.apache.phoenix.end2end.index.MutableIndexFailureIT
Running org.apache.phoenix.end2end.index.MutableIndexReplicationIT
Tests run: 1, Failures: 0, Errors: 0, Skipped: 0, Time elapsed: 18.451 sec - in org.apache.phoenix.end2end.index.MutableIndexReplicationIT
Running org.apache.phoenix.end2end.index.DropIndexDuringUpsertIT
Tests run: 1, Failures: 0, Errors: 0, Skipped: 1, Time elapsed: 0.001 sec - in org.apache.phoenix.end2end.index.DropIndexDuringUpsertIT
Running org.apache.phoenix.end2end.SpillableGroupByIT
Tests run: 1, Failures: 0, Errors: 0, Skipped: 0, Time elapsed: 8.602 sec - in org.apache.phoenix.end2end.SpillableGroupByIT
Tests run: 5, Failures: 0, Errors: 0, Skipped: 0, Time elapsed: 222.07 sec - in org.apache.phoenix.mapreduce.IndexToolIT
Tests run: 3, Failures: 0, Errors: 0, Skipped: 0, Time elapsed: 148.246 sec - in org.apache.phoenix.end2end.index.MutableIndexFailureIT
Running org.apache.phoenix.end2end.KeyOnlyIT
Running org.apache.phoenix.end2end.TenantSpecificTablesDDLIT
Tests run: 3, Failures: 0, Errors: 0, Skipped: 0, Time elapsed: 10.319 sec - in org.apache.phoenix.end2end.KeyOnlyIT
Running org.apache.phoenix.end2end.TenantSpecificTablesDMLIT
Tests run: 16, Failures: 0, Errors: 0, Skipped: 0, Time elapsed: 12.22 sec - in org.apache.phoenix.end2end.TenantSpecificTablesDMLIT
Tests run: 18, Failures: 0, Errors: 0, Skipped: 0, Time elapsed: 28.948 sec - in org.apache.phoenix.end2end.TenantSpecificTablesDDLIT
Tests run: 51, Failures: 0, Errors: 0, Skipped: 0, Time elapsed: 249.266 sec - in org.apache.phoenix.end2end.AlterTableIT
Running org.apache.phoenix.end2end.ContextClassloaderIT
Tests run: 6, Failures: 0, Errors: 0, Skipped: 0, Time elapsed: 263.883 sec - in org.apache.phoenix.mapreduce.CsvBulkLoadToolIT
Running org.apache.phoenix.end2end.QueryTimeoutIT
Tests run: 3, Failures: 0, Errors: 0, Skipped: 0, Time elapsed: 8.352 sec - in org.apache.phoenix.end2end.ContextClassloaderIT
Running org.apache.phoenix.end2end.QueryWithLimitIT
Running org.apache.phoenix.end2end.StatsCollectorWithSplitsAndMultiCFIT
Tests run: 1, Failures: 0, Errors: 0, Skipped: 0, Time elapsed: 17.725 sec - in org.apache.phoenix.end2end.QueryTimeoutIT
Tests run: 2, Failures: 0, Errors: 0, Skipped: 0, Time elapsed: 11.134 sec - in org.apache.phoenix.end2end.QueryWithLimitIT
Running org.apache.phoenix.end2end.ParallelIteratorsIT
Running org.apache.phoenix.hbase.index.covered.EndToEndCoveredColumnsIndexBuilderIT
Running org.apache.phoenix.hbase.index.covered.example.EndtoEndIndexingWithCompressionIT
Tests run: 2, Failures: 0, Errors: 0, Skipped: 0, Time elapsed: 8.812 sec - in org.apache.phoenix.hbase.index.covered.EndToEndCoveredColumnsIndexBuilderIT
Tests run: 2, Failures: 0, Errors: 0, Skipped: 0, Time elapsed: 9.741 sec - in org.apache.phoenix.end2end.ParallelIteratorsIT
Running org.apache.phoenix.hbase.index.covered.example.EndToEndCoveredIndexingIT
Running org.apache.phoenix.hbase.index.covered.example.FailWithoutRetriesIT
Tests run: 2, Failures: 0, Errors: 0, Skipped: 0, Time elapsed: 30.581 sec - in org.apache.phoenix.end2end.StatsCollectorWithSplitsAndMultiCFIT
Tests run: 1, Failures: 0, Errors: 0, Skipped: 0, Time elapsed: 8.581 sec - in org.apache.phoenix.hbase.index.covered.example.FailWithoutRetriesIT
Running org.apache.phoenix.hbase.index.FailForUnsupportedHBaseVersionsIT
Running org.apache.phoenix.hbase.index.balancer.IndexLoadBalancerIT
Tests run: 2, Failures: 0, Errors: 0, Skipped: 0, Time elapsed: 15.419 sec - in org.apache.phoenix.hbase.index.FailForUnsupportedHBaseVersionsIT
Running org.apache.hadoop.hbase.regionserver.wal.WALReplayWithIndexWritesAndCompressedWALIT
Tests run: 11, Failures: 0, Errors: 0, Skipped: 0, Time elapsed: 48.568 sec - in org.apache.phoenix.hbase.index.covered.example.EndtoEndIndexingWithCompressionIT
Running org.apache.hadoop.hbase.regionserver.wal.WALReplayWithIndexWritesAndUncompressedWALInHBase_094_9_IT
Tests run: 1, Failures: 0, Errors: 0, Skipped: 0, Time elapsed: 14.684 sec - in org.apache.hadoop.hbase.regionserver.wal.WALReplayWithIndexWritesAndCompressedWALIT
Tests run: 11, Failures: 0, Errors: 0, Skipped: 0, Time elapsed: 49.06 sec - in org.apache.phoenix.hbase.index.covered.example.EndToEndCoveredIndexingIT
Tests run: 1, Failures: 0, Errors: 0, Skipped: 0, Time elapsed: 14.81 sec - in org.apache.hadoop.hbase.regionserver.wal.WALReplayWithIndexWritesAndUncompressedWALInHBase_094_9_IT
Running org.apache.phoenix.end2end.CountDistinctCompressionIT
Tests run: 1, Failures: 0, Errors: 1, Skipped: 0, Time elapsed: 0.008 sec <<< FAILURE!
- in org.apache.phoenix.end2end.CountDistinctCompressionIT
org.apache.phoenix.end2end.CountDistinctCompressionIT  Time elapsed: 0.008 sec  <<<
ERROR!
java.sql.SQLTimeoutException: Operation timed out
	at org.apache.phoenix.exception.SQLExceptionCode$14.newException(SQLExceptionCode.java:314)
	at org.apache.phoenix.exception.SQLExceptionInfo.buildException(SQLExceptionInfo.java:133)
	at org.apache.phoenix.iterate.BaseResultIterators.getIterators(BaseResultIterators.java:585)
	at org.apache.phoenix.iterate.ConcatResultIterator.getIterators(ConcatResultIterator.java:50)
	at org.apache.phoenix.iterate.ConcatResultIterator.currentIterator(ConcatResultIterator.java:97)
	at org.apache.phoenix.iterate.ConcatResultIterator.next(ConcatResultIterator.java:117)
	at org.apache.phoenix.iterate.BaseGroupedAggregatingResultIterator.next(BaseGroupedAggregatingResultIterator.java:64)
	at org.apache.phoenix.iterate.UngroupedAggregatingResultIterator.next(UngroupedAggregatingResultIterator.java:39)
	at org.apache.phoenix.compile.PostDDLCompiler$1.execute(PostDDLCompiler.java:211)
	at org.apache.phoenix.query.ConnectionQueryServicesImpl.updateData(ConnectionQueryServicesImpl.java:1991)
	at org.apache.phoenix.query.DelegateConnectionQueryServices.updateData(DelegateConnectionQueryServices.java:142)
	at org.apache.phoenix.schema.MetaDataClient.createTable(MetaDataClient.java:610)
	at org.apache.phoenix.compile.CreateTableCompiler$2.execute(CreateTableCompiler.java:177)
	at org.apache.phoenix.jdbc.PhoenixStatement$2.call(PhoenixStatement.java:293)
	at org.apache.phoenix.jdbc.PhoenixStatement$2.call(PhoenixStatement.java:285)
	at org.apache.phoenix.call.CallRunner.run(CallRunner.java:53)
	at org.apache.phoenix.jdbc.PhoenixStatement.executeMutation(PhoenixStatement.java:283)
	at org.apache.phoenix.jdbc.PhoenixStatement.executeUpdate(PhoenixStatement.java:1083)
	at org.apache.phoenix.query.ConnectionQueryServicesImpl$11.call(ConnectionQueryServicesImpl.java:1841)
	at org.apache.phoenix.query.ConnectionQueryServicesImpl$11.call(ConnectionQueryServicesImpl.java:1810)
	at org.apache.phoenix.util.PhoenixContextExecutor.call(PhoenixContextExecutor.java:77)
	at org.apache.phoenix.query.ConnectionQueryServicesImpl.init(ConnectionQueryServicesImpl.java:1810)
	at org.apache.phoenix.end2end.ConnectionQueryServicesTestImpl.init(ConnectionQueryServicesTestImpl.java:45)
	at org.apache.phoenix.jdbc.PhoenixTestDriver.getConnectionQueryServices(PhoenixTestDriver.java:96)
	at org.apache.phoenix.jdbc.PhoenixEmbeddedDriver.connect(PhoenixEmbeddedDriver.java:126)
	at org.apache.phoenix.jdbc.PhoenixTestDriver.connect(PhoenixTestDriver.java:83)
	at org.apache.phoenix.query.BaseTest.initAndRegisterDriver(BaseTest.java:664)
	at org.apache.phoenix.query.BaseTest.setUpTestDriver(BaseTest.java:536)
	at org.apache.phoenix.end2end.CountDistinctCompressionIT.doSetup(CountDistinctCompressionIT.java:48)

Tests run: 9, Failures: 0, Errors: 0, Skipped: 0, Time elapsed: 111.85 sec - in org.apache.phoenix.hbase.index.balancer.IndexLoadBalancerIT

Results :


Tests in error: 
  CountDistinctCompressionIT.doSetup:48->BaseTest.setUpTestDriver:536->BaseTest.initAndRegisterDriver:664
ยป SQLTimeout


Tests run: 184, Failures: 0, Errors: 1, Skipped: 1

[INFO] [failsafe:verify {execution: ClientManagedTimeTests}]
[INFO] Failsafe report directory: <https://builds.apache.org/job/Phoenix-4.0/ws/phoenix-core/target/failsafe-reports>
[INFO] ------------------------------------------------------------------------
[ERROR] BUILD FAILURE
[INFO] ------------------------------------------------------------------------
[INFO] There are test failures.

Please refer to <https://builds.apache.org/job/Phoenix-4.0/ws/phoenix-core/target/failsafe-reports>
for the individual test results.
[INFO] ------------------------------------------------------------------------
[INFO] For more information, run Maven with the -e switch
[INFO] ------------------------------------------------------------------------
[INFO] Total time: 18 minutes 
[INFO] Finished at: Tue Mar 24 19:43:15 UTC 2015
[INFO] Final Memory: 102M/1215M
[INFO] ------------------------------------------------------------------------
Build step 'Invoke top-level Maven targets' marked build as failure
Archiving artifacts
Sending artifact delta relative to Phoenix | 4.x-HBase-0.98 #601
Archived 1003 artifacts
Archive block size is 32768
Received 12200 blocks and 457139457 bytes
Compression is 46.7%
Took 3 min 42 sec
Recording test results

Mime
View raw message