phoenix-commits mailing list archives

Site index · List index
Message view « Date » · « Thread »
Top « Date » · « Thread »
From Apache Jenkins Server <jenk...@builds.apache.org>
Subject Build failed in Jenkins: Phoenix | 4.3 #59
Date Sat, 28 Mar 2015 01:30:59 GMT
See <https://builds.apache.org/job/Phoenix-4.3/59/>

------------------------------------------
[...truncated 442 lines...]
Tests run: 1, Failures: 0, Errors: 0, Skipped: 0, Time elapsed: 1.717 sec - in org.apache.phoenix.end2end.ServerExceptionIT
Running org.apache.phoenix.end2end.ArithmeticQueryIT
Tests run: 5, Failures: 0, Errors: 0, Skipped: 0, Time elapsed: 7.735 sec - in org.apache.phoenix.end2end.salted.SaltedTableUpsertSelectIT
Running org.apache.phoenix.end2end.DynamicFamilyIT
Tests run: 4, Failures: 0, Errors: 0, Skipped: 0, Time elapsed: 5.11 sec - in org.apache.phoenix.end2end.DynamicFamilyIT
Running org.apache.phoenix.end2end.StatementHintsIT
Tests run: 2, Failures: 0, Errors: 0, Skipped: 0, Time elapsed: 2.387 sec - in org.apache.phoenix.end2end.StatementHintsIT
Running org.apache.phoenix.end2end.ToDateFunctionIT
Tests run: 10, Failures: 0, Errors: 0, Skipped: 0, Time elapsed: 2.617 sec - in org.apache.phoenix.end2end.ToDateFunctionIT
Running org.apache.phoenix.end2end.MappingTableDataTypeIT
Tests run: 15, Failures: 0, Errors: 0, Skipped: 0, Time elapsed: 33.899 sec - in org.apache.phoenix.end2end.SubqueryUsingSortMergeJoinIT
Running org.apache.phoenix.end2end.LastValueFunctionIT
Tests run: 23, Failures: 0, Errors: 0, Skipped: 0, Time elapsed: 18.628 sec - in org.apache.phoenix.end2end.ArithmeticQueryIT
Running org.apache.phoenix.end2end.MD5FunctionIT
Tests run: 2, Failures: 0, Errors: 0, Skipped: 0, Time elapsed: 3.249 sec - in org.apache.phoenix.end2end.MD5FunctionIT
Running org.apache.phoenix.end2end.UpsertSelectAutoCommitIT
Tests run: 1, Failures: 0, Errors: 0, Skipped: 0, Time elapsed: 7.3 sec - in org.apache.phoenix.end2end.MappingTableDataTypeIT
Running org.apache.phoenix.end2end.index.SaltedIndexIT
Tests run: 11, Failures: 0, Errors: 0, Skipped: 0, Time elapsed: 5.918 sec - in org.apache.phoenix.end2end.LastValueFunctionIT
Running org.apache.phoenix.end2end.index.DropViewIT
Tests run: 3, Failures: 0, Errors: 0, Skipped: 0, Time elapsed: 8.922 sec - in org.apache.phoenix.end2end.UpsertSelectAutoCommitIT
Running org.apache.phoenix.end2end.index.GlobalIndexOptimizationIT
Tests run: 1, Failures: 0, Errors: 0, Skipped: 0, Time elapsed: 8.096 sec - in org.apache.phoenix.end2end.index.DropViewIT
Running org.apache.phoenix.end2end.index.LocalIndexIT
Tests run: 3, Failures: 0, Errors: 0, Skipped: 0, Time elapsed: 14.072 sec - in org.apache.phoenix.end2end.index.SaltedIndexIT
Running org.apache.phoenix.end2end.index.IndexExpressionIT
Tests run: 25, Failures: 0, Errors: 0, Skipped: 0, Time elapsed: 51.994 sec - in org.apache.phoenix.end2end.InListIT
Running org.apache.phoenix.end2end.index.ViewIndexIT
Tests run: 1, Failures: 0, Errors: 0, Skipped: 0, Time elapsed: 3.17 sec - in org.apache.phoenix.end2end.index.ViewIndexIT
Running org.apache.phoenix.end2end.index.LocalMutableIndexIT
Tests run: 6, Failures: 0, Errors: 0, Skipped: 0, Time elapsed: 29.309 sec - in org.apache.phoenix.end2end.index.GlobalIndexOptimizationIT
Running org.apache.phoenix.end2end.index.ImmutableIndexIT
Tests run: 13, Failures: 0, Errors: 0, Skipped: 0, Time elapsed: 25.205 sec - in org.apache.phoenix.end2end.index.ImmutableIndexIT
Running org.apache.phoenix.end2end.index.IndexMetadataIT
Tests run: 105, Failures: 0, Errors: 0, Skipped: 0, Time elapsed: 98.091 sec - in org.apache.phoenix.end2end.SpooledSortMergeJoinIT
Running org.apache.phoenix.end2end.index.GlobalMutableIndexIT
Tests run: 15, Failures: 0, Errors: 0, Skipped: 0, Time elapsed: 53.395 sec - in org.apache.phoenix.end2end.index.LocalMutableIndexIT
Running org.apache.phoenix.end2end.CSVCommonsLoaderIT
Tests run: 6, Failures: 0, Errors: 0, Skipped: 0, Time elapsed: 31.287 sec - in org.apache.phoenix.end2end.index.IndexMetadataIT
Running org.apache.phoenix.end2end.LpadFunctionIT
Tests run: 15, Failures: 0, Errors: 0, Skipped: 0, Time elapsed: 13.86 sec - in org.apache.phoenix.end2end.CSVCommonsLoaderIT
Running org.apache.phoenix.end2end.MinMaxAggregateFunctionIT
Tests run: 10, Failures: 0, Errors: 0, Skipped: 0, Time elapsed: 5.602 sec - in org.apache.phoenix.end2end.LpadFunctionIT
Running org.apache.phoenix.end2end.TimezoneOffsetFunctionIT
Tests run: 1, Failures: 0, Errors: 0, Skipped: 0, Time elapsed: 2.213 sec - in org.apache.phoenix.end2end.MinMaxAggregateFunctionIT
Running org.apache.phoenix.end2end.RegexpSubstrFunctionIT
Tests run: 2, Failures: 0, Errors: 0, Skipped: 0, Time elapsed: 1.877 sec - in org.apache.phoenix.end2end.RegexpSubstrFunctionIT
Running org.apache.phoenix.end2end.BinaryRowKeyIT
Tests run: 7, Failures: 0, Errors: 0, Skipped: 0, Time elapsed: 4.934 sec - in org.apache.phoenix.end2end.TimezoneOffsetFunctionIT
Tests run: 3, Failures: 0, Errors: 0, Skipped: 0, Time elapsed: 2.526 sec - in org.apache.phoenix.end2end.BinaryRowKeyIT
Running org.apache.phoenix.end2end.SortMergeJoinIT
Running org.apache.phoenix.end2end.DecodeFunctionIT
Tests run: 6, Failures: 0, Errors: 0, Skipped: 0, Time elapsed: 2.345 sec - in org.apache.phoenix.end2end.DecodeFunctionIT
Running org.apache.phoenix.end2end.DisableLocalIndexIT
Tests run: 1, Failures: 0, Errors: 0, Skipped: 0, Time elapsed: 3.741 sec - in org.apache.phoenix.end2end.DisableLocalIndexIT
Running org.apache.phoenix.end2end.SortOrderFIT
Tests run: 15, Failures: 0, Errors: 0, Skipped: 0, Time elapsed: 52.425 sec - in org.apache.phoenix.end2end.index.GlobalMutableIndexIT
Running org.apache.phoenix.end2end.HashJoinIT
Tests run: 30, Failures: 0, Errors: 0, Skipped: 0, Time elapsed: 6.189 sec - in org.apache.phoenix.end2end.SortOrderFIT
Running org.apache.phoenix.end2end.HashJoinLocalIndexIT
Tests run: 20, Failures: 0, Errors: 0, Skipped: 0, Time elapsed: 117.019 sec - in org.apache.phoenix.end2end.index.LocalIndexIT
Running org.apache.phoenix.end2end.ModulusExpressionIT
Tests run: 1, Failures: 0, Errors: 0, Skipped: 0, Time elapsed: 11.486 sec - in org.apache.phoenix.end2end.HashJoinLocalIndexIT
Running org.apache.phoenix.end2end.StoreNullsIT
Tests run: 11, Failures: 0, Errors: 0, Skipped: 0, Time elapsed: 5.219 sec - in org.apache.phoenix.end2end.ModulusExpressionIT
Running org.apache.phoenix.end2end.EvaluationOfORIT
Tests run: 1, Failures: 0, Errors: 0, Skipped: 0, Time elapsed: 2.296 sec - in org.apache.phoenix.end2end.EvaluationOfORIT
Running org.apache.phoenix.end2end.ExecuteStatementsIT
Tests run: 58, Failures: 0, Errors: 0, Skipped: 0, Time elapsed: 127.99 sec - in org.apache.phoenix.end2end.index.IndexExpressionIT
Running org.apache.phoenix.end2end.ConvertTimezoneFunctionIT
Tests run: 3, Failures: 0, Errors: 0, Skipped: 0, Time elapsed: 14.734 sec - in org.apache.phoenix.end2end.StoreNullsIT
Running org.apache.phoenix.end2end.StddevIT
Tests run: 6, Failures: 0, Errors: 0, Skipped: 0, Time elapsed: 2.3 sec - in org.apache.phoenix.end2end.ConvertTimezoneFunctionIT
Running org.apache.phoenix.end2end.TenantSpecificViewIndexSaltedIT
Tests run: 4, Failures: 0, Errors: 0, Skipped: 0, Time elapsed: 2.82 sec - in org.apache.phoenix.end2end.StddevIT
Tests run: 2, Failures: 0, Errors: 0, Skipped: 0, Time elapsed: 13.399 sec - in org.apache.phoenix.end2end.ExecuteStatementsIT
Running org.apache.phoenix.end2end.FirstValueFunctionIT
Running org.apache.phoenix.end2end.SkipScanAfterManualSplitIT
Tests run: 7, Failures: 0, Errors: 0, Skipped: 0, Time elapsed: 2.69 sec - in org.apache.phoenix.end2end.FirstValueFunctionIT
Running org.apache.phoenix.end2end.TenantSpecificViewIndexIT
Tests run: 4, Failures: 0, Errors: 0, Skipped: 0, Time elapsed: 8.401 sec - in org.apache.phoenix.end2end.TenantSpecificViewIndexSaltedIT
Running org.apache.phoenix.end2end.SpooledTmpFileDeleteIT
Tests run: 1, Failures: 0, Errors: 0, Skipped: 0, Time elapsed: 2.713 sec - in org.apache.phoenix.end2end.SpooledTmpFileDeleteIT
Running org.apache.phoenix.end2end.SkipScanQueryIT
Tests run: 7, Failures: 0, Errors: 0, Skipped: 0, Time elapsed: 11.553 sec - in org.apache.phoenix.end2end.TenantSpecificViewIndexIT
Running org.apache.phoenix.end2end.QueryExecWithoutSCNIT
Tests run: 1, Failures: 0, Errors: 0, Skipped: 0, Time elapsed: 2.298 sec - in org.apache.phoenix.end2end.QueryExecWithoutSCNIT
Running org.apache.phoenix.end2end.SubqueryIT
Tests run: 9, Failures: 0, Errors: 0, Skipped: 0, Time elapsed: 12.449 sec - in org.apache.phoenix.end2end.SkipScanQueryIT
Running org.apache.phoenix.trace.PhoenixTracingEndToEndIT
Tests run: 3, Failures: 0, Errors: 0, Skipped: 0, Time elapsed: 23.596 sec - in org.apache.phoenix.end2end.SkipScanAfterManualSplitIT
Running org.apache.phoenix.trace.PhoenixTraceReaderIT
Tests run: 2, Failures: 0, Errors: 0, Skipped: 0, Time elapsed: 0.522 sec - in org.apache.phoenix.trace.PhoenixTraceReaderIT
Running org.apache.phoenix.trace.PhoenixTableMetricsWriterIT
Tests run: 2, Failures: 0, Errors: 0, Skipped: 0, Time elapsed: 0.329 sec - in org.apache.phoenix.trace.PhoenixTableMetricsWriterIT
Tests run: 105, Failures: 0, Errors: 0, Skipped: 0, Time elapsed: 91.142 sec - in org.apache.phoenix.end2end.SortMergeJoinIT
Tests run: 21, Failures: 0, Errors: 0, Skipped: 0, Time elapsed: 37.557 sec - in org.apache.phoenix.end2end.SubqueryIT
Tests run: 105, Failures: 0, Errors: 0, Skipped: 0, Time elapsed: 103.079 sec - in org.apache.phoenix.end2end.HashJoinIT
Tests run: 6, Failures: 0, Errors: 0, Skipped: 0, Time elapsed: 89.795 sec - in org.apache.phoenix.trace.PhoenixTracingEndToEndIT

Results :




Tests run: 834, Failures: 0, Errors: 0, Skipped: 0

[INFO] [failsafe:integration-test {execution: NeedTheirOwnClusterTests}]
[INFO] Failsafe report directory: <https://builds.apache.org/job/Phoenix-4.3/ws/phoenix-core/target/failsafe-reports>
[INFO] parallel='none', perCoreThreadCount=true, threadCount=0, useUnlimitedThreads=false,
threadCountSuites=0, threadCountClasses=0, threadCountMethods=0, parallelOptimized=true

-------------------------------------------------------
 T E S T S
-------------------------------------------------------
Running org.apache.phoenix.rpc.PhoenixServerRpcIT
Running org.apache.phoenix.rpc.PhoenixClientRpcIT
Running org.apache.phoenix.end2end.MultiCfQueryExecIT
Running org.apache.phoenix.end2end.ViewIT
Tests run: 2, Failures: 0, Errors: 0, Skipped: 0, Time elapsed: 3.197 sec - in org.apache.phoenix.rpc.PhoenixClientRpcIT
Running org.apache.phoenix.end2end.SaltedViewIT
Tests run: 2, Failures: 0, Errors: 0, Skipped: 0, Time elapsed: 7.647 sec - in org.apache.phoenix.rpc.PhoenixServerRpcIT
Running org.apache.phoenix.end2end.StatsCollectorIT
Tests run: 7, Failures: 0, Errors: 0, Skipped: 0, Time elapsed: 17.416 sec - in org.apache.phoenix.end2end.MultiCfQueryExecIT
Tests run: 2, Failures: 2, Errors: 0, Skipped: 0, Time elapsed: 14.321 sec <<< FAILURE!
- in org.apache.phoenix.end2end.SaltedViewIT
testSaltedUpdatableViewWithIndex(org.apache.phoenix.end2end.SaltedViewIT)  Time elapsed: 4.061
sec  <<< FAILURE!
java.lang.AssertionError: expected:<8> but was:<3>
	at org.junit.Assert.fail(Assert.java:88)
	at org.junit.Assert.failNotEquals(Assert.java:834)
	at org.junit.Assert.assertEquals(Assert.java:645)
	at org.junit.Assert.assertEquals(Assert.java:631)
	at org.apache.phoenix.end2end.BaseViewIT.testUpdatableViewIndex(BaseViewIT.java:120)
	at org.apache.phoenix.end2end.BaseViewIT.testUpdatableViewWithIndex(BaseViewIT.java:53)
	at org.apache.phoenix.end2end.SaltedViewIT.testSaltedUpdatableViewWithIndex(SaltedViewIT.java:34)

testSaltedUpdatableViewWithLocalIndex(org.apache.phoenix.end2end.SaltedViewIT)  Time elapsed:
3.244 sec  <<< FAILURE!
java.lang.AssertionError: expected:<8> but was:<3>
	at org.junit.Assert.fail(Assert.java:88)
	at org.junit.Assert.failNotEquals(Assert.java:834)
	at org.junit.Assert.assertEquals(Assert.java:645)
	at org.junit.Assert.assertEquals(Assert.java:631)
	at org.apache.phoenix.end2end.BaseViewIT.testUpdatableViewIndex(BaseViewIT.java:120)
	at org.apache.phoenix.end2end.BaseViewIT.testUpdatableViewWithIndex(BaseViewIT.java:53)
	at org.apache.phoenix.end2end.SaltedViewIT.testSaltedUpdatableViewWithLocalIndex(SaltedViewIT.java:39)

Running org.apache.phoenix.mapreduce.CsvBulkLoadToolIT
Tests run: 15, Failures: 0, Errors: 0, Skipped: 0, Time elapsed: 28.128 sec - in org.apache.phoenix.end2end.ViewIT
Running org.apache.phoenix.end2end.QueryTimeoutIT
Running org.apache.phoenix.end2end.ParallelIteratorsIT
Tests run: 4, Failures: 2, Errors: 0, Skipped: 0, Time elapsed: 32.721 sec <<< FAILURE!
- in org.apache.phoenix.end2end.StatsCollectorIT
testCompactUpdatesStats(org.apache.phoenix.end2end.StatsCollectorIT)  Time elapsed: 10.915
sec  <<< FAILURE!
java.lang.AssertionError: expected:<11> but was:<1>
	at org.junit.Assert.fail(Assert.java:88)
	at org.junit.Assert.failNotEquals(Assert.java:834)
	at org.junit.Assert.assertEquals(Assert.java:645)
	at org.junit.Assert.assertEquals(Assert.java:631)
	at org.apache.phoenix.end2end.StatsCollectorIT.testCompactUpdatesStats(StatsCollectorIT.java:281)
	at org.apache.phoenix.end2end.StatsCollectorIT.testCompactUpdatesStats(StatsCollectorIT.java:240)

testCompactUpdatesStatsWithMinStatsUpdateFreq(org.apache.phoenix.end2end.StatsCollectorIT)
 Time elapsed: 10.836 sec  <<< FAILURE!
java.lang.AssertionError: expected:<11> but was:<1>
	at org.junit.Assert.fail(Assert.java:88)
	at org.junit.Assert.failNotEquals(Assert.java:834)
	at org.junit.Assert.assertEquals(Assert.java:645)
	at org.junit.Assert.assertEquals(Assert.java:631)
	at org.apache.phoenix.end2end.StatsCollectorIT.testCompactUpdatesStats(StatsCollectorIT.java:281)
	at org.apache.phoenix.end2end.StatsCollectorIT.testCompactUpdatesStatsWithMinStatsUpdateFreq(StatsCollectorIT.java:245)

Tests run: 1, Failures: 0, Errors: 0, Skipped: 0, Time elapsed: 12.133 sec - in org.apache.phoenix.end2end.QueryTimeoutIT
Running org.apache.phoenix.end2end.index.DropIndexDuringUpsertIT
Tests run: 1, Failures: 0, Errors: 0, Skipped: 1, Time elapsed: 0.001 sec - in org.apache.phoenix.end2end.index.DropIndexDuringUpsertIT
Tests run: 2, Failures: 0, Errors: 0, Skipped: 0, Time elapsed: 10.702 sec - in org.apache.phoenix.end2end.ParallelIteratorsIT
Running org.apache.phoenix.end2end.index.MutableIndexFailureIT
Running org.apache.phoenix.end2end.QueryWithLimitIT
Tests run: 2, Failures: 0, Errors: 0, Skipped: 0, Time elapsed: 8.657 sec - in org.apache.phoenix.end2end.QueryWithLimitIT
Running org.apache.phoenix.end2end.ContextClassloaderIT
Running org.apache.phoenix.end2end.index.ImmutableIndexWithStatsIT
Tests run: 1, Failures: 0, Errors: 0, Skipped: 0, Time elapsed: 2.021 sec - in org.apache.phoenix.end2end.index.ImmutableIndexWithStatsIT
Tests run: 3, Failures: 0, Errors: 0, Skipped: 0, Time elapsed: 7.926 sec - in org.apache.phoenix.end2end.ContextClassloaderIT
Running org.apache.phoenix.end2end.AlterTableIT
Running org.apache.phoenix.end2end.index.MutableIndexReplicationIT
Running org.apache.phoenix.end2end.TenantSpecificTablesDDLIT
Tests run: 1, Failures: 0, Errors: 0, Skipped: 0, Time elapsed: 17.085 sec - in org.apache.phoenix.end2end.index.MutableIndexReplicationIT
Running org.apache.phoenix.end2end.KeyOnlyIT
Tests run: 3, Failures: 0, Errors: 0, Skipped: 0, Time elapsed: 8.738 sec - in org.apache.phoenix.end2end.KeyOnlyIT
Tests run: 18, Failures: 0, Errors: 0, Skipped: 0, Time elapsed: 41.786 sec - in org.apache.phoenix.end2end.TenantSpecificTablesDDLIT
Running org.apache.phoenix.end2end.CountDistinctCompressionIT
Running org.apache.phoenix.end2end.SpillableGroupByIT
Tests run: 1, Failures: 0, Errors: 0, Skipped: 0, Time elapsed: 10.135 sec - in org.apache.phoenix.end2end.CountDistinctCompressionIT
Tests run: 1, Failures: 0, Errors: 0, Skipped: 0, Time elapsed: 12.202 sec - in org.apache.phoenix.end2end.SpillableGroupByIT
Running org.apache.phoenix.end2end.StatsCollectorWithSplitsAndMultiCFIT
Running org.apache.phoenix.end2end.TenantSpecificTablesDMLIT
Tests run: 16, Failures: 0, Errors: 0, Skipped: 0, Time elapsed: 18.639 sec - in org.apache.phoenix.end2end.TenantSpecificTablesDMLIT
Running org.apache.phoenix.hbase.index.FailForUnsupportedHBaseVersionsIT
Tests run: 2, Failures: 0, Errors: 0, Skipped: 0, Time elapsed: 32.289 sec - in org.apache.phoenix.end2end.StatsCollectorWithSplitsAndMultiCFIT
Tests run: 2, Failures: 0, Errors: 0, Skipped: 0, Time elapsed: 15.137 sec - in org.apache.phoenix.hbase.index.FailForUnsupportedHBaseVersionsIT
Running org.apache.phoenix.hbase.index.covered.EndToEndCoveredColumnsIndexBuilderIT
Running org.apache.phoenix.hbase.index.covered.example.FailWithoutRetriesIT
Tests run: 2, Failures: 0, Errors: 0, Skipped: 0, Time elapsed: 9.081 sec - in org.apache.phoenix.hbase.index.covered.EndToEndCoveredColumnsIndexBuilderIT
Tests run: 3, Failures: 0, Errors: 0, Skipped: 0, Time elapsed: 154.923 sec - in org.apache.phoenix.end2end.index.MutableIndexFailureIT
Tests run: 1, Failures: 0, Errors: 0, Skipped: 0, Time elapsed: 8.688 sec - in org.apache.phoenix.hbase.index.covered.example.FailWithoutRetriesIT
Running org.apache.phoenix.hbase.index.covered.example.EndtoEndIndexingWithCompressionIT
Running org.apache.phoenix.hbase.index.covered.example.EndToEndCoveredIndexingIT
Running org.apache.phoenix.hbase.index.balancer.IndexLoadBalancerIT
Tests run: 11, Failures: 0, Errors: 0, Skipped: 0, Time elapsed: 48.794 sec - in org.apache.phoenix.hbase.index.covered.example.EndtoEndIndexingWithCompressionIT
Running org.apache.hadoop.hbase.regionserver.wal.WALReplayWithIndexWritesAndUncompressedWALInHBase_094_9_IT
Tests run: 11, Failures: 0, Errors: 0, Skipped: 0, Time elapsed: 49.13 sec - in org.apache.phoenix.hbase.index.covered.example.EndToEndCoveredIndexingIT
Running org.apache.hadoop.hbase.regionserver.wal.WALReplayWithIndexWritesAndCompressedWALIT
Tests run: 6, Failures: 0, Errors: 0, Skipped: 0, Time elapsed: 243.84 sec - in org.apache.phoenix.mapreduce.CsvBulkLoadToolIT
Tests run: 1, Failures: 0, Errors: 0, Skipped: 0, Time elapsed: 15.322 sec - in org.apache.hadoop.hbase.regionserver.wal.WALReplayWithIndexWritesAndUncompressedWALInHBase_094_9_IT
Tests run: 1, Failures: 0, Errors: 0, Skipped: 0, Time elapsed: 14.966 sec - in org.apache.hadoop.hbase.regionserver.wal.WALReplayWithIndexWritesAndCompressedWALIT
Tests run: 9, Failures: 0, Errors: 0, Skipped: 0, Time elapsed: 111.461 sec - in org.apache.phoenix.hbase.index.balancer.IndexLoadBalancerIT
Tests run: 51, Failures: 0, Errors: 0, Skipped: 0, Time elapsed: 252.69 sec - in org.apache.phoenix.end2end.AlterTableIT

Results :

Failed tests: 
  SaltedViewIT.testSaltedUpdatableViewWithIndex:34->BaseViewIT.testUpdatableViewWithIndex:53->BaseViewIT.testUpdatableViewIndex:120
expected:<8> but was:<3>
  SaltedViewIT.testSaltedUpdatableViewWithLocalIndex:39->BaseViewIT.testUpdatableViewWithIndex:53->BaseViewIT.testUpdatableViewIndex:120
expected:<8> but was:<3>
  StatsCollectorIT.testCompactUpdatesStats:240->testCompactUpdatesStats:281 expected:<11>
but was:<1>
  StatsCollectorIT.testCompactUpdatesStatsWithMinStatsUpdateFreq:245->testCompactUpdatesStats:281
expected:<11> but was:<1>



Tests run: 182, Failures: 4, Errors: 0, Skipped: 1

[INFO] [failsafe:verify {execution: ClientManagedTimeTests}]
[INFO] Failsafe report directory: <https://builds.apache.org/job/Phoenix-4.3/ws/phoenix-core/target/failsafe-reports>
[INFO] ------------------------------------------------------------------------
[ERROR] BUILD FAILURE
[INFO] ------------------------------------------------------------------------
[INFO] There are test failures.

Please refer to <https://builds.apache.org/job/Phoenix-4.3/ws/phoenix-core/target/failsafe-reports>
for the individual test results.
[INFO] ------------------------------------------------------------------------
[INFO] For more information, run Maven with the -e switch
[INFO] ------------------------------------------------------------------------
[INFO] Total time: 15 minutes 2 seconds
[INFO] Finished at: Sat Mar 28 01:29:05 UTC 2015
[INFO] Final Memory: 102M/1051M
[INFO] ------------------------------------------------------------------------
Build step 'Invoke top-level Maven targets' marked build as failure
Archiving artifacts
Sending artifact delta relative to Phoenix | 4.3 #54
Archived 805 artifacts
Archive block size is 32768
Received 5232 blocks and 399800293 bytes
Compression is 30.0%
Took 1 min 49 sec
Recording test results

Mime
View raw message