phoenix-commits mailing list archives

Site index · List index
Message view « Date » · « Thread »
Top « Date » · « Thread »
From Apache Jenkins Server <jenk...@builds.apache.org>
Subject Build failed in Jenkins: Phoenix | 4.x-HBase-0.98 #604
Date Wed, 25 Mar 2015 20:14:45 GMT
See <https://builds.apache.org/job/Phoenix-4.0/604/changes>

Changes:

[rajeshbabu] PHOENIX-1756 Add Month() and Second() buildin functions(Alicia Ying Shu)

------------------------------------------
[...truncated 506 lines...]
testSelectDistinctMutableIndex(org.apache.phoenix.end2end.index.IndexExpressionIT)  Time elapsed:
5.491 sec  <<< FAILURE!
org.junit.ComparisonFailure: expected:<... ROWS BY [TO_BIGINT([(A.INT_COL1 + 1)])]
CLIENT MERGE SORT> but was:<... ROWS BY [TO_BIGINT(["(A.INT_COL1 + 1)"])]
CLIENT MERGE SORT>
	at org.junit.Assert.assertEquals(Assert.java:115)
	at org.junit.Assert.assertEquals(Assert.java:144)
	at org.apache.phoenix.end2end.index.IndexExpressionIT.helpTestSelectDistinct(IndexExpressionIT.java:535)
	at org.apache.phoenix.end2end.index.IndexExpressionIT.testSelectDistinctMutableIndex(IndexExpressionIT.java:509)

testGroupByCountImmutableLocalIndex(org.apache.phoenix.end2end.index.IndexExpressionIT)  Time
elapsed: 0.433 sec  <<< FAILURE!
org.junit.ComparisonFailure: expected:<... ROWS BY [TO_BIGINT([(A.INT_COL1 + B.INT_COL2)])]
CLIENT MERGE SORT> but was:<... ROWS BY [TO_BIGINT(["(A.INT_COL1 + B.INT_COL2)"])]
CLIENT MERGE SORT>
	at org.junit.Assert.assertEquals(Assert.java:115)
	at org.junit.Assert.assertEquals(Assert.java:144)
	at org.apache.phoenix.end2end.index.IndexExpressionIT.helpTestGroupByCount(IndexExpressionIT.java:484)
	at org.apache.phoenix.end2end.index.IndexExpressionIT.testGroupByCountImmutableLocalIndex(IndexExpressionIT.java:451)

testSelectDistinctMutableLocalIndex(org.apache.phoenix.end2end.index.IndexExpressionIT)  Time
elapsed: 0.454 sec  <<< FAILURE!
org.junit.ComparisonFailure: expected:<... ROWS BY [TO_BIGINT([(A.INT_COL1 + 1)])]
CLIENT MERGE SORT> but was:<... ROWS BY [TO_BIGINT(["(A.INT_COL1 + 1)"])]
CLIENT MERGE SORT>
	at org.junit.Assert.assertEquals(Assert.java:115)
	at org.junit.Assert.assertEquals(Assert.java:144)
	at org.apache.phoenix.end2end.index.IndexExpressionIT.helpTestSelectDistinct(IndexExpressionIT.java:535)
	at org.apache.phoenix.end2end.index.IndexExpressionIT.testSelectDistinctMutableLocalIndex(IndexExpressionIT.java:514)

testGroupByCountImmutableIndex(org.apache.phoenix.end2end.index.IndexExpressionIT)  Time elapsed:
0.362 sec  <<< FAILURE!
org.junit.ComparisonFailure: expected:<... ROWS BY [TO_BIGINT([(A.INT_COL1 + B.INT_COL2)])]
CLIENT MERGE SORT> but was:<... ROWS BY [TO_BIGINT(["(A.INT_COL1 + B.INT_COL2)"])]
CLIENT MERGE SORT>
	at org.junit.Assert.assertEquals(Assert.java:115)
	at org.junit.Assert.assertEquals(Assert.java:144)
	at org.apache.phoenix.end2end.index.IndexExpressionIT.helpTestGroupByCount(IndexExpressionIT.java:484)
	at org.apache.phoenix.end2end.index.IndexExpressionIT.testGroupByCountImmutableIndex(IndexExpressionIT.java:446)

testGroupByCountMutableLocalIndex(org.apache.phoenix.end2end.index.IndexExpressionIT)  Time
elapsed: 0.53 sec  <<< FAILURE!
org.junit.ComparisonFailure: expected:<... ROWS BY [TO_BIGINT([(A.INT_COL1 + B.INT_COL2)])]
CLIENT MERGE SORT> but was:<... ROWS BY [TO_BIGINT(["(A.INT_COL1 + B.INT_COL2)"])]
CLIENT MERGE SORT>
	at org.junit.Assert.assertEquals(Assert.java:115)
	at org.junit.Assert.assertEquals(Assert.java:144)
	at org.apache.phoenix.end2end.index.IndexExpressionIT.helpTestGroupByCount(IndexExpressionIT.java:484)
	at org.apache.phoenix.end2end.index.IndexExpressionIT.testGroupByCountMutableLocalIndex(IndexExpressionIT.java:461)

Running org.apache.phoenix.end2end.ArithmeticQueryIT
Tests run: 3, Failures: 0, Errors: 0, Skipped: 0, Time elapsed: 15.399 sec - in org.apache.phoenix.end2end.StoreNullsIT
Running org.apache.phoenix.end2end.DecodeFunctionIT
Tests run: 20, Failures: 0, Errors: 0, Skipped: 0, Time elapsed: 164.383 sec - in org.apache.phoenix.end2end.index.LocalIndexIT
Running org.apache.phoenix.end2end.ExecuteStatementsIT
Tests run: 6, Failures: 0, Errors: 0, Skipped: 0, Time elapsed: 4.001 sec - in org.apache.phoenix.end2end.DecodeFunctionIT
Running org.apache.phoenix.end2end.SpooledTmpFileDeleteIT
Tests run: 1, Failures: 0, Errors: 0, Skipped: 0, Time elapsed: 3.731 sec - in org.apache.phoenix.end2end.SpooledTmpFileDeleteIT
Running org.apache.phoenix.end2end.ServerExceptionIT
Tests run: 1, Failures: 0, Errors: 0, Skipped: 0, Time elapsed: 3.173 sec - in org.apache.phoenix.end2end.ServerExceptionIT
Running org.apache.phoenix.end2end.ToDateFunctionIT
Tests run: 21, Failures: 0, Errors: 0, Skipped: 0, Time elapsed: 21.503 sec - in org.apache.phoenix.end2end.ArithmeticQueryIT
Running org.apache.phoenix.end2end.CSVCommonsLoaderIT
Tests run: 10, Failures: 0, Errors: 0, Skipped: 0, Time elapsed: 4.339 sec - in org.apache.phoenix.end2end.ToDateFunctionIT
Running org.apache.phoenix.end2end.MappingTableDataTypeIT
Tests run: 2, Failures: 0, Errors: 0, Skipped: 0, Time elapsed: 18.997 sec - in org.apache.phoenix.end2end.ExecuteStatementsIT
Running org.apache.phoenix.end2end.TenantSpecificViewIndexIT
Tests run: 1, Failures: 0, Errors: 0, Skipped: 0, Time elapsed: 7.741 sec - in org.apache.phoenix.end2end.MappingTableDataTypeIT
Running org.apache.phoenix.end2end.InListIT
Tests run: 15, Failures: 0, Errors: 0, Skipped: 0, Time elapsed: 20.496 sec - in org.apache.phoenix.end2end.CSVCommonsLoaderIT
Running org.apache.phoenix.end2end.StatementHintsIT
Tests run: 2, Failures: 0, Errors: 0, Skipped: 0, Time elapsed: 3.135 sec - in org.apache.phoenix.end2end.StatementHintsIT
Running org.apache.phoenix.end2end.TenantSpecificViewIndexSaltedIT
Tests run: 7, Failures: 0, Errors: 0, Skipped: 0, Time elapsed: 18.273 sec - in org.apache.phoenix.end2end.TenantSpecificViewIndexIT
Running org.apache.phoenix.end2end.TimezoneOffsetFunctionIT
Tests run: 7, Failures: 0, Errors: 0, Skipped: 0, Time elapsed: 6.268 sec - in org.apache.phoenix.end2end.TimezoneOffsetFunctionIT
Running org.apache.phoenix.end2end.QueryExecWithoutSCNIT
Tests run: 4, Failures: 0, Errors: 0, Skipped: 0, Time elapsed: 10.889 sec - in org.apache.phoenix.end2end.TenantSpecificViewIndexSaltedIT
Running org.apache.phoenix.end2end.LpadFunctionIT
Tests run: 1, Failures: 0, Errors: 0, Skipped: 0, Time elapsed: 3.732 sec - in org.apache.phoenix.end2end.QueryExecWithoutSCNIT
Running org.apache.phoenix.end2end.PhoenixMetricsIT
Tests run: 4, Failures: 0, Errors: 0, Skipped: 0, Time elapsed: 5.563 sec - in org.apache.phoenix.end2end.PhoenixMetricsIT
Running org.apache.phoenix.end2end.CoalesceFunctionIT
Tests run: 10, Failures: 0, Errors: 0, Skipped: 0, Time elapsed: 10.014 sec - in org.apache.phoenix.end2end.LpadFunctionIT
Running org.apache.phoenix.end2end.EvaluationOfORIT
Tests run: 1, Failures: 0, Errors: 0, Skipped: 0, Time elapsed: 2.699 sec - in org.apache.phoenix.end2end.EvaluationOfORIT
Running org.apache.phoenix.end2end.LastValueFunctionIT
Tests run: 10, Failures: 0, Errors: 0, Skipped: 0, Time elapsed: 10.139 sec - in org.apache.phoenix.end2end.CoalesceFunctionIT
Running org.apache.phoenix.end2end.SkipScanAfterManualSplitIT
Tests run: 11, Failures: 0, Errors: 0, Skipped: 0, Time elapsed: 8.69 sec - in org.apache.phoenix.end2end.LastValueFunctionIT
Running org.apache.phoenix.end2end.salted.SaltedTableVarLengthRowKeyIT
Tests run: 1, Failures: 0, Errors: 0, Skipped: 0, Time elapsed: 4.419 sec - in org.apache.phoenix.end2end.salted.SaltedTableVarLengthRowKeyIT
Running org.apache.phoenix.end2end.salted.SaltedTableUpsertSelectIT
Tests run: 5, Failures: 0, Errors: 0, Skipped: 0, Time elapsed: 10.934 sec - in org.apache.phoenix.end2end.salted.SaltedTableUpsertSelectIT
Running org.apache.phoenix.end2end.DynamicFamilyIT
Tests run: 4, Failures: 0, Errors: 0, Skipped: 0, Time elapsed: 5.315 sec - in org.apache.phoenix.end2end.DynamicFamilyIT
Running org.apache.phoenix.end2end.MinMaxAggregateFunctionIT
Tests run: 1, Failures: 0, Errors: 0, Skipped: 0, Time elapsed: 3.376 sec - in org.apache.phoenix.end2end.MinMaxAggregateFunctionIT
Running org.apache.phoenix.end2end.SubqueryIT
Tests run: 25, Failures: 0, Errors: 0, Skipped: 0, Time elapsed: 75.893 sec - in org.apache.phoenix.end2end.InListIT
Running org.apache.phoenix.end2end.YearMonthSecondFunctionIT
Tests run: 3, Failures: 0, Errors: 0, Skipped: 0, Time elapsed: 34.183 sec - in org.apache.phoenix.end2end.SkipScanAfterManualSplitIT
Running org.apache.phoenix.end2end.ReverseScanIT
Tests run: 5, Failures: 0, Errors: 0, Skipped: 0, Time elapsed: 4.251 sec - in org.apache.phoenix.end2end.YearMonthSecondFunctionIT
Running org.apache.phoenix.end2end.SortMergeJoinIT
Tests run: 2, Failures: 0, Errors: 0, Skipped: 0, Time elapsed: 3.791 sec - in org.apache.phoenix.end2end.ReverseScanIT
Running org.apache.phoenix.end2end.SignFunctionEnd2EndIT
Tests run: 2, Failures: 0, Errors: 0, Skipped: 0, Time elapsed: 6.888 sec - in org.apache.phoenix.end2end.SignFunctionEnd2EndIT
Running org.apache.phoenix.end2end.QueryMoreIT
Tests run: 105, Failures: 0, Errors: 0, Skipped: 0, Time elapsed: 171.783 sec - in org.apache.phoenix.end2end.HashJoinIT
Running org.apache.phoenix.end2end.ConvertTimezoneFunctionIT
Tests run: 6, Failures: 0, Errors: 0, Skipped: 0, Time elapsed: 4.484 sec - in org.apache.phoenix.end2end.ConvertTimezoneFunctionIT
Running org.apache.phoenix.trace.PhoenixTraceReaderIT
Tests run: 2, Failures: 0, Errors: 0, Skipped: 0, Time elapsed: 0.888 sec - in org.apache.phoenix.trace.PhoenixTraceReaderIT
Running org.apache.phoenix.trace.PhoenixTracingEndToEndIT
Tests run: 5, Failures: 0, Errors: 0, Skipped: 0, Time elapsed: 18.932 sec - in org.apache.phoenix.end2end.QueryMoreIT
Running org.apache.phoenix.trace.PhoenixTableMetricsWriterIT
Tests run: 2, Failures: 0, Errors: 0, Skipped: 0, Time elapsed: 1.121 sec - in org.apache.phoenix.trace.PhoenixTableMetricsWriterIT
Tests run: 21, Failures: 0, Errors: 0, Skipped: 0, Time elapsed: 65.309 sec - in org.apache.phoenix.end2end.SubqueryIT
Tests run: 6, Failures: 0, Errors: 0, Skipped: 0, Time elapsed: 86.116 sec - in org.apache.phoenix.trace.PhoenixTracingEndToEndIT
Tests run: 105, Failures: 0, Errors: 0, Skipped: 0, Time elapsed: 286.756 sec - in org.apache.phoenix.end2end.SpooledSortMergeJoinIT
Tests run: 105, Failures: 0, Errors: 0, Skipped: 0, Time elapsed: 162.118 sec - in org.apache.phoenix.end2end.SortMergeJoinIT

Results :

Failed tests: 
  IndexExpressionIT.testGroupByCountImmutableIndex:446->helpTestGroupByCount:484 expected:<...
ROWS BY [TO_BIGINT([(A.INT_COL1 + B.INT_COL2)])]
CLIENT MERGE SORT> but was:<... ROWS BY [TO_BIGINT(["(A.INT_COL1 + B.INT_COL2)"])]
CLIENT MERGE SORT>
  IndexExpressionIT.testGroupByCountImmutableLocalIndex:451->helpTestGroupByCount:484 expected:<...
ROWS BY [TO_BIGINT([(A.INT_COL1 + B.INT_COL2)])]
CLIENT MERGE SORT> but was:<... ROWS BY [TO_BIGINT(["(A.INT_COL1 + B.INT_COL2)"])]
CLIENT MERGE SORT>
  IndexExpressionIT.testGroupByCountMutableIndex:456->helpTestGroupByCount:484 expected:<...
ROWS BY [TO_BIGINT([(A.INT_COL1 + B.INT_COL2)])]
CLIENT MERGE SORT> but was:<... ROWS BY [TO_BIGINT(["(A.INT_COL1 + B.INT_COL2)"])]
CLIENT MERGE SORT>
  IndexExpressionIT.testGroupByCountMutableLocalIndex:461->helpTestGroupByCount:484 expected:<...
ROWS BY [TO_BIGINT([(A.INT_COL1 + B.INT_COL2)])]
CLIENT MERGE SORT> but was:<... ROWS BY [TO_BIGINT(["(A.INT_COL1 + B.INT_COL2)"])]
CLIENT MERGE SORT>
  IndexExpressionIT.testSelectDistinctImmutableIndex:499->helpTestSelectDistinct:535 expected:<...
ROWS BY [TO_BIGINT([(A.INT_COL1 + 1)])]
CLIENT MERGE SORT> but was:<... ROWS BY [TO_BIGINT(["(A.INT_COL1 + 1)"])]
CLIENT MERGE SORT>
  IndexExpressionIT.testSelectDistinctImmutableIndexLocal:504->helpTestSelectDistinct:535
expected:<... ROWS BY [TO_BIGINT([(A.INT_COL1 + 1)])]
CLIENT MERGE SORT> but was:<... ROWS BY [TO_BIGINT(["(A.INT_COL1 + 1)"])]
CLIENT MERGE SORT>
  IndexExpressionIT.testSelectDistinctMutableIndex:509->helpTestSelectDistinct:535 expected:<...
ROWS BY [TO_BIGINT([(A.INT_COL1 + 1)])]
CLIENT MERGE SORT> but was:<... ROWS BY [TO_BIGINT(["(A.INT_COL1 + 1)"])]
CLIENT MERGE SORT>
  IndexExpressionIT.testSelectDistinctMutableLocalIndex:514->helpTestSelectDistinct:535
expected:<... ROWS BY [TO_BIGINT([(A.INT_COL1 + 1)])]
CLIENT MERGE SORT> but was:<... ROWS BY [TO_BIGINT(["(A.INT_COL1 + 1)"])]
CLIENT MERGE SORT>



Tests run: 839, Failures: 8, Errors: 0, Skipped: 0

[INFO] [failsafe:integration-test {execution: NeedTheirOwnClusterTests}]
[INFO] Failsafe report directory: <https://builds.apache.org/job/Phoenix-4.0/ws/phoenix-core/target/failsafe-reports>
[INFO] parallel='none', perCoreThreadCount=true, threadCount=0, useUnlimitedThreads=false,
threadCountSuites=0, threadCountClasses=0, threadCountMethods=0, parallelOptimized=true

-------------------------------------------------------
 T E S T S
-------------------------------------------------------
Running org.apache.phoenix.end2end.index.MutableIndexFailureIT
Running org.apache.phoenix.end2end.index.IndexQosIT
Running org.apache.phoenix.end2end.index.ImmutableIndexWithStatsIT
Running org.apache.phoenix.end2end.ViewIT
Running org.apache.phoenix.end2end.TenantSpecificTablesDMLIT
Tests run: 1, Failures: 0, Errors: 0, Skipped: 0, Time elapsed: 8.935 sec - in org.apache.phoenix.end2end.index.ImmutableIndexWithStatsIT
Tests run: 1, Failures: 0, Errors: 0, Skipped: 0, Time elapsed: 42.988 sec - in org.apache.phoenix.end2end.index.IndexQosIT
Running org.apache.phoenix.end2end.index.DropIndexDuringUpsertIT
Tests run: 1, Failures: 0, Errors: 0, Skipped: 1, Time elapsed: 0.001 sec - in org.apache.phoenix.end2end.index.DropIndexDuringUpsertIT
Tests run: 16, Failures: 0, Errors: 0, Skipped: 0, Time elapsed: 24.391 sec - in org.apache.phoenix.end2end.TenantSpecificTablesDMLIT
Tests run: 15, Failures: 0, Errors: 0, Skipped: 0, Time elapsed: 29.033 sec - in org.apache.phoenix.end2end.ViewIT
Running org.apache.phoenix.end2end.index.MutableIndexReplicationIT
Running org.apache.phoenix.end2end.QueryTimeoutIT
Running org.apache.phoenix.end2end.QueryWithLimitIT
Running org.apache.phoenix.end2end.StatsCollectorIT
Tests run: 1, Failures: 0, Errors: 0, Skipped: 0, Time elapsed: 22.279 sec - in org.apache.phoenix.end2end.index.MutableIndexReplicationIT
Tests run: 2, Failures: 0, Errors: 0, Skipped: 0, Time elapsed: 7.893 sec - in org.apache.phoenix.end2end.QueryWithLimitIT
Tests run: 1, Failures: 0, Errors: 0, Skipped: 0, Time elapsed: 16.904 sec - in org.apache.phoenix.end2end.QueryTimeoutIT
Running org.apache.phoenix.end2end.KeyOnlyIT
Running org.apache.phoenix.end2end.ContextClassloaderIT
Running org.apache.phoenix.end2end.MultiCfQueryExecIT
Tests run: 3, Failures: 0, Errors: 0, Skipped: 0, Time elapsed: 6.824 sec - in org.apache.phoenix.end2end.ContextClassloaderIT
Tests run: 3, Failures: 0, Errors: 0, Skipped: 0, Time elapsed: 16.621 sec - in org.apache.phoenix.end2end.KeyOnlyIT
Tests run: 7, Failures: 0, Errors: 0, Skipped: 0, Time elapsed: 18.632 sec - in org.apache.phoenix.end2end.MultiCfQueryExecIT
Running org.apache.phoenix.end2end.SaltedViewIT
Tests run: 4, Failures: 0, Errors: 0, Skipped: 0, Time elapsed: 56.412 sec - in org.apache.phoenix.end2end.StatsCollectorIT
Running org.apache.phoenix.end2end.AlterTableIT
Tests run: 2, Failures: 0, Errors: 0, Skipped: 0, Time elapsed: 9.014 sec - in org.apache.phoenix.end2end.SaltedViewIT
Running org.apache.phoenix.end2end.TenantSpecificTablesDDLIT
Running org.apache.phoenix.end2end.CountDistinctCompressionIT
Running org.apache.phoenix.end2end.SpillableGroupByIT
Tests run: 1, Failures: 0, Errors: 0, Skipped: 0, Time elapsed: 7.652 sec - in org.apache.phoenix.end2end.CountDistinctCompressionIT
Tests run: 1, Failures: 0, Errors: 0, Skipped: 0, Time elapsed: 8.753 sec - in org.apache.phoenix.end2end.SpillableGroupByIT
Tests run: 18, Failures: 0, Errors: 0, Skipped: 0, Time elapsed: 37.264 sec - in org.apache.phoenix.end2end.TenantSpecificTablesDDLIT
Running org.apache.phoenix.end2end.StatsCollectorWithSplitsAndMultiCFIT
Running org.apache.phoenix.end2end.ParallelIteratorsIT
Tests run: 3, Failures: 0, Errors: 0, Skipped: 0, Time elapsed: 175.286 sec - in org.apache.phoenix.end2end.index.MutableIndexFailureIT
Running org.apache.phoenix.mapreduce.IndexToolIT
Tests run: 2, Failures: 0, Errors: 0, Skipped: 0, Time elapsed: 18.07 sec - in org.apache.phoenix.end2end.ParallelIteratorsIT
Running org.apache.phoenix.hbase.index.FailForUnsupportedHBaseVersionsIT
Tests run: 2, Failures: 0, Errors: 0, Skipped: 0, Time elapsed: 27.875 sec - in org.apache.phoenix.end2end.StatsCollectorWithSplitsAndMultiCFIT
Tests run: 2, Failures: 0, Errors: 0, Skipped: 0, Time elapsed: 15.786 sec - in org.apache.phoenix.hbase.index.FailForUnsupportedHBaseVersionsIT
Running org.apache.phoenix.hbase.index.covered.example.EndToEndCoveredIndexingIT
Running org.apache.phoenix.hbase.index.covered.example.EndtoEndIndexingWithCompressionIT
Running org.apache.phoenix.mapreduce.CsvBulkLoadToolIT
Tests run: 11, Failures: 0, Errors: 0, Skipped: 0, Time elapsed: 57.987 sec - in org.apache.phoenix.hbase.index.covered.example.EndToEndCoveredIndexingIT
Running org.apache.phoenix.hbase.index.covered.example.FailWithoutRetriesIT
Tests run: 11, Failures: 0, Errors: 0, Skipped: 0, Time elapsed: 58.273 sec - in org.apache.phoenix.hbase.index.covered.example.EndtoEndIndexingWithCompressionIT
Running org.apache.phoenix.hbase.index.covered.EndToEndCoveredColumnsIndexBuilderIT
Tests run: 1, Failures: 0, Errors: 0, Skipped: 0, Time elapsed: 8.818 sec - in org.apache.phoenix.hbase.index.covered.example.FailWithoutRetriesIT
Running org.apache.phoenix.hbase.index.balancer.IndexLoadBalancerIT
Tests run: 2, Failures: 0, Errors: 0, Skipped: 0, Time elapsed: 8.35 sec - in org.apache.phoenix.hbase.index.covered.EndToEndCoveredColumnsIndexBuilderIT
Running org.apache.hadoop.hbase.regionserver.wal.WALReplayWithIndexWritesAndCompressedWALIT
Tests run: 1, Failures: 0, Errors: 0, Skipped: 0, Time elapsed: 17.325 sec - in org.apache.hadoop.hbase.regionserver.wal.WALReplayWithIndexWritesAndCompressedWALIT
Running org.apache.hadoop.hbase.regionserver.wal.WALReplayWithIndexWritesAndUncompressedWALInHBase_094_9_IT
Tests run: 1, Failures: 0, Errors: 0, Skipped: 0, Time elapsed: 16.356 sec - in org.apache.hadoop.hbase.regionserver.wal.WALReplayWithIndexWritesAndUncompressedWALInHBase_094_9_IT
Tests run: 51, Failures: 0, Errors: 0, Skipped: 0, Time elapsed: 268.013 sec - in org.apache.phoenix.end2end.AlterTableIT
Tests run: 5, Failures: 0, Errors: 0, Skipped: 0, Time elapsed: 222.41 sec - in org.apache.phoenix.mapreduce.IndexToolIT
Tests run: 9, Failures: 0, Errors: 0, Skipped: 0, Time elapsed: 132.751 sec - in org.apache.phoenix.hbase.index.balancer.IndexLoadBalancerIT
Tests run: 6, Failures: 0, Errors: 0, Skipped: 0, Time elapsed: 263.508 sec - in org.apache.phoenix.mapreduce.CsvBulkLoadToolIT

Results :




Tests run: 184, Failures: 0, Errors: 0, Skipped: 1

[INFO] [failsafe:verify {execution: ClientManagedTimeTests}]
[INFO] Failsafe report directory: <https://builds.apache.org/job/Phoenix-4.0/ws/phoenix-core/target/failsafe-reports>
[INFO] ------------------------------------------------------------------------
[ERROR] BUILD FAILURE
[INFO] ------------------------------------------------------------------------
[INFO] There are test failures.

Please refer to <https://builds.apache.org/job/Phoenix-4.0/ws/phoenix-core/target/failsafe-reports>
for the individual test results.
[INFO] ------------------------------------------------------------------------
[INFO] For more information, run Maven with the -e switch
[INFO] ------------------------------------------------------------------------
[INFO] Total time: 21 minutes 35 seconds
[INFO] Finished at: Wed Mar 25 20:10:04 UTC 2015
[INFO] Final Memory: 102M/1041M
[INFO] ------------------------------------------------------------------------
Build step 'Invoke top-level Maven targets' marked build as failure
Archiving artifacts
Sending artifact delta relative to Phoenix | 4.x-HBase-0.98 #601
Archived 971 artifacts
Archive block size is 32768
Received 12445 blocks and 458488032 bytes
Compression is 47.1%
Took 4 min 29 sec
Recording test results

Mime
View raw message