phoenix-commits mailing list archives

Site index · List index
Message view « Date » · « Thread »
Top « Date » · « Thread »
From Apache Jenkins Server <jenk...@builds.apache.org>
Subject Build failed in Jenkins: Phoenix | Master #642
Date Thu, 26 Mar 2015 19:41:51 GMT
See <https://builds.apache.org/job/Phoenix-master/642/changes>

Changes:

[twdsilva] Fix IndexExpressionIT test failures

------------------------------------------
[...truncated 3892 lines...]
3823/4437 KB   
3827/4437 KB   
3831/4437 KB   
3835/4437 KB   
3839/4437 KB   
3843/4437 KB   
3847/4437 KB   
3851/4437 KB   
3855/4437 KB   
3858/4437 KB   
3862/4437 KB   
3866/4437 KB   
3870/4437 KB   
3874/4437 KB   
3878/4437 KB   
3882/4437 KB   
3886/4437 KB   
3890/4437 KB   
3894/4437 KB   
3897/4437 KB   
3901/4437 KB   
3905/4437 KB   
3909/4437 KB   
3913/4437 KB   
3917/4437 KB   
3921/4437 KB   
3925/4437 KB   
3929/4437 KB   
3933/4437 KB   
3937/4437 KB   
3941/4437 KB   
3944/4437 KB   
3948/4437 KB   
3952/4437 KB   
3956/4437 KB   
3960/4437 KB   
3964/4437 KB   
3968/4437 KB   
3972/4437 KB   
3976/4437 KB   
3980/4437 KB   
3983/4437 KB   
3987/4437 KB   
3991/4437 KB   
3995/4437 KB   
3999/4437 KB   
4003/4437 KB   
4007/4437 KB   
4011/4437 KB   
4015/4437 KB   
4019/4437 KB   
4022/4437 KB   
4026/4437 KB   
4030/4437 KB   
4034/4437 KB   
4038/4437 KB   
4042/4437 KB   
4046/4437 KB   
4050/4437 KB   
4054/4437 KB   
4058/4437 KB   
4062/4437 KB   
4066/4437 KB   
4069/4437 KB   
4073/4437 KB   
4077/4437 KB   
4081/4437 KB   
4085/4437 KB   
4089/4437 KB   
4093/4437 KB   
4097/4437 KB   
4101/4437 KB   
4105/4437 KB   
4108/4437 KB   
4112/4437 KB   
4116/4437 KB   
4120/4437 KB   
4124/4437 KB   
4128/4437 KB   
4132/4437 KB   
4136/4437 KB   
4140/4437 KB   
4144/4437 KB   
4147/4437 KB   
4151/4437 KB   
4155/4437 KB   
4159/4437 KB   
4163/4437 KB   
4167/4437 KB   
4171/4437 KB   
4175/4437 KB   
4179/4437 KB   
4183/4437 KB   
4187/4437 KB   
4191/4437 KB   
4194/4437 KB   
4198/4437 KB   
4202/4437 KB   
4206/4437 KB   
4210/4437 KB   
4214/4437 KB   
4218/4437 KB   
4222/4437 KB   
4226/4437 KB   
4230/4437 KB   
4233/4437 KB   
4237/4437 KB   
4241/4437 KB   
4245/4437 KB   
4249/4437 KB   
4253/4437 KB   
4257/4437 KB   
4261/4437 KB   
4265/4437 KB   
4269/4437 KB   
4272/4437 KB   
4276/4437 KB   
4280/4437 KB   
4284/4437 KB   
4288/4437 KB   
4292/4437 KB   
4296/4437 KB   
4300/4437 KB   
4304/4437 KB   
4308/4437 KB   
4312/4437 KB   
4316/4437 KB   
4319/4437 KB   
4323/4437 KB   
4327/4437 KB   
4331/4437 KB   
4335/4437 KB   
4339/4437 KB   
4343/4437 KB   
4347/4437 KB   
4351/4437 KB   
4355/4437 KB   
4358/4437 KB   
4362/4437 KB   
4366/4437 KB   
4370/4437 KB   
4374/4437 KB   
4378/4437 KB   
4382/4437 KB   
4386/4437 KB   
4390/4437 KB   
4394/4437 KB   
4397/4437 KB   
4401/4437 KB   
4405/4437 KB   
4409/4437 KB   
4413/4437 KB   
4417/4437 KB   
4421/4437 KB   
4425/4437 KB   
4429/4437 KB   
4433/4437 KB   
4437/4437 KB   
4437/4437 KB   
               
Downloaded: https://repository.apache.org/content/repositories/snapshots/org/apache/hbase/hbase-server/1.0.1-SNAPSHOT/hbase-server-1.0.1-20150326.011647-2-tests.jar
(4437 KB at 4189.5 KB/sec)
[INFO] 
[INFO] --- maven-clean-plugin:2.5:clean (default-clean) @ phoenix-core ---
[INFO] Deleting <https://builds.apache.org/job/Phoenix-master/ws/phoenix-core/target>
[INFO] 
[INFO] --- build-helper-maven-plugin:1.9.1:add-test-source (add-test-source) @ phoenix-core
---
[INFO] Test Source directory: <https://builds.apache.org/job/Phoenix-master/ws/phoenix-core/src/it/java>
added.
[INFO] 
[INFO] --- build-helper-maven-plugin:1.9.1:add-test-resource (add-test-resource) @ phoenix-core
---
[INFO] 
[INFO] --- build-helper-maven-plugin:1.9.1:add-source (add-source) @ phoenix-core ---
[INFO] Source directory: <https://builds.apache.org/job/Phoenix-master/ws/phoenix-core/target/generated-sources/antlr3>
added.
[INFO] Source directory: <https://builds.apache.org/job/Phoenix-master/ws/phoenix-core/src/main/antlr3>
added.
[INFO] 
[INFO] --- antlr3-maven-plugin:3.5:antlr (default) @ phoenix-core ---
[INFO] ANTLR: Processing source directory <https://builds.apache.org/job/Phoenix-master/ws/phoenix-core/src/main/antlr3>
ANTLR Parser Generator  Version 3.5
Output file <https://builds.apache.org/job/Phoenix-master/ws/phoenix-core/target/generated-sources/antlr3/org/apache/phoenix/parse/PhoenixSQLParser.java>
does not exist: must build <https://builds.apache.org/job/Phoenix-master/ws/phoenix-core/src/main/antlr3/PhoenixSQL.g>
PhoenixSQL.g
[INFO] 
[INFO] --- maven-dependency-plugin:2.1:build-classpath (create-phoenix-generated-classpath)
@ phoenix-core ---
[INFO] Wrote classpath file '<https://builds.apache.org/job/Phoenix-master/ws/phoenix-core/target/cached_classpath.txt'.>
[INFO] 
[INFO] --- maven-remote-resources-plugin:1.5:process (default) @ phoenix-core ---
Downloading: http://people.apache.org/~garyh/mvn/org/apache/hbase/hbase/1.0.1-SNAPSHOT/maven-metadata.xml
               
[INFO] 
[INFO] --- maven-resources-plugin:2.6:resources (default-resources) @ phoenix-core ---
[INFO] Using 'UTF-8' encoding to copy filtered resources.
[INFO] Copying 1 resource to META-INF/services
[INFO] Copying 3 resources
[INFO] 
[INFO] --- maven-compiler-plugin:3.0:compile (default-compile) @ phoenix-core ---
[INFO] Changes detected - recompiling the module!
[INFO] Compiling 785 source files to <https://builds.apache.org/job/Phoenix-master/ws/phoenix-core/target/classes>
[INFO] -------------------------------------------------------------
[WARNING] COMPILATION WARNING : 
[INFO] -------------------------------------------------------------
[WARNING] <https://builds.apache.org/job/Phoenix-master/ws/phoenix-core/src/main/java/org/apache/phoenix/hbase/index/write/ParallelWriterIndexCommitter.java>:
Some input files use or override a deprecated API.
[WARNING] <https://builds.apache.org/job/Phoenix-master/ws/phoenix-core/src/main/java/org/apache/phoenix/hbase/index/write/ParallelWriterIndexCommitter.java>:
Recompile with -Xlint:deprecation for details.
[WARNING] <https://builds.apache.org/job/Phoenix-master/ws/phoenix-core/src/main/java/org/apache/phoenix/parse/FunctionParseNode.java>:
Some input files use unchecked or unsafe operations.
[WARNING] <https://builds.apache.org/job/Phoenix-master/ws/phoenix-core/src/main/java/org/apache/phoenix/parse/FunctionParseNode.java>:
Recompile with -Xlint:unchecked for details.
[INFO] 4 warnings 
[INFO] -------------------------------------------------------------
[INFO] -------------------------------------------------------------
[ERROR] COMPILATION ERROR : 
[INFO] -------------------------------------------------------------
[ERROR] <https://builds.apache.org/job/Phoenix-master/ws/phoenix-core/src/main/java/org/apache/phoenix/trace/util/Tracing.java>:[119,49]
SAMPLER_FRACTION_CONF_KEY has private access in org.apache.htrace.impl.ProbabilitySampler
[ERROR] <https://builds.apache.org/job/Phoenix-master/ws/phoenix-core/src/main/java/org/apache/phoenix/trace/util/Tracing.java>:[143,39]
SAMPLER_FRACTION_CONF_KEY has private access in org.apache.htrace.impl.ProbabilitySampler
[INFO] 2 errors 
[INFO] -------------------------------------------------------------
[INFO] ------------------------------------------------------------------------
[INFO] Reactor Summary:
[INFO] 
[INFO] Apache Phoenix .................................... SUCCESS [2.058s]
[INFO] Phoenix Core ...................................... FAILURE [1:21.128s]
[INFO] Phoenix - Flume ................................... SKIPPED
[INFO] Phoenix - Pig ..................................... SKIPPED
[INFO] Phoenix Assembly .................................. SKIPPED
[INFO] Phoenix - Pherf ................................... SKIPPED
[INFO] ------------------------------------------------------------------------
[INFO] BUILD FAILURE
[INFO] ------------------------------------------------------------------------
[INFO] Total time: 1:23.613s
[INFO] Finished at: Thu Mar 26 19:39:42 UTC 2015
[INFO] Final Memory: 48M/726M
[INFO] ------------------------------------------------------------------------
[ERROR] Failed to execute goal org.apache.maven.plugins:maven-compiler-plugin:3.0:compile
(default-compile) on project phoenix-core: Compilation failure: Compilation failure:
[ERROR] <https://builds.apache.org/job/Phoenix-master/ws/phoenix-core/src/main/java/org/apache/phoenix/trace/util/Tracing.java>:[119,49]
SAMPLER_FRACTION_CONF_KEY has private access in org.apache.htrace.impl.ProbabilitySampler
[ERROR] <https://builds.apache.org/job/Phoenix-master/ws/phoenix-core/src/main/java/org/apache/phoenix/trace/util/Tracing.java>:[143,39]
SAMPLER_FRACTION_CONF_KEY has private access in org.apache.htrace.impl.ProbabilitySampler
[ERROR] -> [Help 1]
[ERROR] 
[ERROR] To see the full stack trace of the errors, re-run Maven with the -e switch.
[ERROR] Re-run Maven using the -X switch to enable full debug logging.
[ERROR] 
[ERROR] For more information about the errors and possible solutions, please read the following
articles:
[ERROR] [Help 1] http://cwiki.apache.org/confluence/display/MAVEN/MojoFailureException
[ERROR] 
[ERROR] After correcting the problems, you can resume the build with the command
[ERROR]   mvn <goals> -rf :phoenix-core
Build step 'Invoke top-level Maven targets' marked build as failure
Archiving artifacts
Sending artifact delta relative to Phoenix | Master #628
Archived 73 artifacts
Archive block size is 32768
Received 1120 blocks and 101388201 bytes
Compression is 26.6%
Took 2 min 8 sec
Recording test results

Mime
View raw message