phoenix-commits mailing list archives

Site index · List index
Message view « Date » · « Thread »
Top « Date » · « Thread »
From Apache Jenkins Server <jenk...@builds.apache.org>
Subject Build failed in Jenkins: Phoenix | Master #585
Date Tue, 10 Feb 2015 03:09:14 GMT
See <https://builds.apache.org/job/Phoenix-master/585/changes>

Changes:

[jtaylor] PHOENIX-688 Add to_time and to_timestamp built-in functions

[jtaylor] PHOENIX-653 Support ANSI-standard date literals from SQL 2003

[jtaylor] PHOENIX-1646 Views and functional index expressions may lose information when stringified

------------------------------------------
[...truncated 400 lines...]
Running org.apache.phoenix.end2end.ToCharFunctionIT
Tests run: 210, Failures: 0, Errors: 0, Skipped: 0, Time elapsed: 86.031 sec - in org.apache.phoenix.end2end.ClientTimeArithmeticQueryIT
Running org.apache.phoenix.end2end.FunkyNamesIT
Tests run: 10, Failures: 0, Errors: 0, Skipped: 0, Time elapsed: 3.983 sec - in org.apache.phoenix.end2end.ToCharFunctionIT
Tests run: 3, Failures: 0, Errors: 0, Skipped: 0, Time elapsed: 2.014 sec - in org.apache.phoenix.end2end.FunkyNamesIT
Running org.apache.phoenix.end2end.salted.SaltedTableIT
Running org.apache.phoenix.end2end.NativeHBaseTypesIT
Tests run: 8, Failures: 0, Errors: 0, Skipped: 0, Time elapsed: 4.173 sec - in org.apache.phoenix.end2end.salted.SaltedTableIT
Running org.apache.phoenix.end2end.CompareDecimalToLongIT
Tests run: 7, Failures: 0, Errors: 0, Skipped: 0, Time elapsed: 2.397 sec - in org.apache.phoenix.end2end.NativeHBaseTypesIT
Running org.apache.phoenix.end2end.TruncateFunctionIT
Tests run: 8, Failures: 0, Errors: 0, Skipped: 0, Time elapsed: 3.931 sec - in org.apache.phoenix.end2end.CompareDecimalToLongIT
Running org.apache.phoenix.end2end.QueryDatabaseMetaDataIT
Tests run: 1, Failures: 0, Errors: 0, Skipped: 0, Time elapsed: 2.346 sec - in org.apache.phoenix.end2end.TruncateFunctionIT
Running org.apache.phoenix.end2end.PercentileIT
Tests run: 36, Failures: 0, Errors: 0, Skipped: 0, Time elapsed: 30.025 sec - in org.apache.phoenix.end2end.RowValueConstructorIT
Running org.apache.phoenix.end2end.ToNumberFunctionIT
Tests run: 91, Failures: 0, Errors: 0, Skipped: 0, Time elapsed: 52.513 sec - in org.apache.phoenix.end2end.GroupByIT
Tests run: 17, Failures: 0, Errors: 0, Skipped: 0, Time elapsed: 7.308 sec - in org.apache.phoenix.end2end.PercentileIT
Running org.apache.phoenix.end2end.OrderByIT
Running org.apache.phoenix.end2end.AggregateQueryIT
Tests run: 18, Failures: 0, Errors: 0, Skipped: 0, Time elapsed: 4.99 sec - in org.apache.phoenix.end2end.ToNumberFunctionIT
Running org.apache.phoenix.end2end.GroupByCaseIT
Tests run: 2, Failures: 0, Errors: 0, Skipped: 0, Time elapsed: 2.722 sec - in org.apache.phoenix.end2end.OrderByIT
Tests run: 3, Failures: 0, Errors: 0, Skipped: 0, Time elapsed: 2.061 sec - in org.apache.phoenix.end2end.GroupByCaseIT
Tests run: 126, Failures: 0, Errors: 0, Skipped: 0, Time elapsed: 67.569 sec - in org.apache.phoenix.end2end.QueryIT
Tests run: 42, Failures: 0, Errors: 0, Skipped: 0, Time elapsed: 43.883 sec - in org.apache.phoenix.end2end.AggregateQueryIT
Tests run: 16, Failures: 0, Errors: 0, Skipped: 0, Time elapsed: 61.964 sec - in org.apache.phoenix.end2end.QueryDatabaseMetaDataIT

Results :




Tests run: 1227, Failures: 0, Errors: 0, Skipped: 0

[INFO] 
[INFO] --- maven-failsafe-plugin:2.18:integration-test (HBaseManagedTimeTests) @ phoenix-core
---
[INFO] Failsafe report directory: <https://builds.apache.org/job/Phoenix-master/ws/phoenix-core/target/failsafe-reports>
[INFO] parallel='none', perCoreThreadCount=true, threadCount=0, useUnlimitedThreads=false,
threadCountSuites=0, threadCountClasses=0, threadCountMethods=0, parallelOptimized=true

-------------------------------------------------------
 T E S T S
-------------------------------------------------------
Running org.apache.phoenix.trace.PhoenixTableMetricsWriterIT
Running org.apache.phoenix.trace.PhoenixTraceReaderIT
Running org.apache.phoenix.end2end.AutoCommitIT
Tests run: 2, Failures: 0, Errors: 0, Skipped: 0, Time elapsed: 1.566 sec - in org.apache.phoenix.trace.PhoenixTableMetricsWriterIT
Tests run: 2, Failures: 0, Errors: 0, Skipped: 0, Time elapsed: 1.159 sec - in org.apache.phoenix.trace.PhoenixTraceReaderIT
Running org.apache.phoenix.trace.PhoenixTracingEndToEndIT
Running org.apache.phoenix.end2end.DeleteIT
Running org.apache.phoenix.end2end.EncodeFunctionIT
Running org.apache.phoenix.end2end.StddevIT
Tests run: 1, Failures: 0, Errors: 0, Skipped: 0, Time elapsed: 2.13 sec - in org.apache.phoenix.end2end.AutoCommitIT
Running org.apache.phoenix.end2end.ModulusExpressionIT
Tests run: 4, Failures: 0, Errors: 0, Skipped: 0, Time elapsed: 4.118 sec - in org.apache.phoenix.end2end.StddevIT
Running org.apache.phoenix.end2end.QueryExecWithoutSCNIT
Tests run: 1, Failures: 0, Errors: 0, Skipped: 0, Time elapsed: 2.378 sec - in org.apache.phoenix.end2end.QueryExecWithoutSCNIT
Running org.apache.phoenix.end2end.LastValueFunctionIT
Tests run: 11, Failures: 0, Errors: 0, Skipped: 0, Time elapsed: 5.939 sec - in org.apache.phoenix.end2end.ModulusExpressionIT
Tests run: 6, Failures: 0, Errors: 0, Skipped: 0, Time elapsed: 7.863 sec - in org.apache.phoenix.end2end.EncodeFunctionIT
Running org.apache.phoenix.end2end.QueryMoreIT
Running org.apache.phoenix.end2end.EvaluationOfORIT
Tests run: 1, Failures: 0, Errors: 0, Skipped: 0, Time elapsed: 1.777 sec - in org.apache.phoenix.end2end.EvaluationOfORIT
Running org.apache.phoenix.end2end.StatementHintsIT
Tests run: 2, Failures: 0, Errors: 0, Skipped: 0, Time elapsed: 1.923 sec - in org.apache.phoenix.end2end.StatementHintsIT
Running org.apache.phoenix.end2end.MinMaxAggregateFunctionIT
Tests run: 11, Failures: 0, Errors: 0, Skipped: 0, Time elapsed: 5.343 sec - in org.apache.phoenix.end2end.LastValueFunctionIT
Running org.apache.phoenix.end2end.ReverseFunctionIT
Tests run: 1, Failures: 0, Errors: 0, Skipped: 0, Time elapsed: 1.782 sec - in org.apache.phoenix.end2end.MinMaxAggregateFunctionIT
Running org.apache.phoenix.end2end.SpooledTmpFileDeleteIT
Tests run: 5, Failures: 0, Errors: 0, Skipped: 0, Time elapsed: 2.354 sec - in org.apache.phoenix.end2end.ReverseFunctionIT
Running org.apache.phoenix.end2end.ArithmeticQueryIT
Tests run: 1, Failures: 0, Errors: 0, Skipped: 0, Time elapsed: 2.305 sec - in org.apache.phoenix.end2end.SpooledTmpFileDeleteIT
Running org.apache.phoenix.end2end.index.ViewIndexIT
Tests run: 1, Failures: 0, Errors: 0, Skipped: 0, Time elapsed: 3.458 sec - in org.apache.phoenix.end2end.index.ViewIndexIT
Running org.apache.phoenix.end2end.index.LocalIndexIT
Tests run: 4, Failures: 0, Errors: 0, Skipped: 0, Time elapsed: 15.34 sec - in org.apache.phoenix.end2end.QueryMoreIT
Running org.apache.phoenix.end2end.index.LocalMutableIndexIT
Tests run: 20, Failures: 0, Errors: 0, Skipped: 0, Time elapsed: 30.628 sec - in org.apache.phoenix.end2end.DeleteIT
Running org.apache.phoenix.end2end.index.IndexMetadataIT
Tests run: 21, Failures: 0, Errors: 0, Skipped: 0, Time elapsed: 19.035 sec - in org.apache.phoenix.end2end.ArithmeticQueryIT
Running org.apache.phoenix.end2end.index.DropViewIT
Tests run: 1, Failures: 0, Errors: 0, Skipped: 0, Time elapsed: 7.61 sec - in org.apache.phoenix.end2end.index.DropViewIT
Running org.apache.phoenix.end2end.index.SaltedIndexIT
Tests run: 3, Failures: 0, Errors: 0, Skipped: 0, Time elapsed: 12.581 sec - in org.apache.phoenix.end2end.index.SaltedIndexIT
Running org.apache.phoenix.end2end.index.GlobalMutableIndexIT
Tests run: 6, Failures: 0, Errors: 0, Skipped: 0, Time elapsed: 34.46 sec - in org.apache.phoenix.end2end.index.IndexMetadataIT
Running org.apache.phoenix.end2end.index.IndexExpressionIT
Tests run: 15, Failures: 0, Errors: 0, Skipped: 0, Time elapsed: 62.095 sec - in org.apache.phoenix.end2end.index.LocalMutableIndexIT
Running org.apache.phoenix.end2end.index.GlobalIndexOptimizationIT
Tests run: 5, Failures: 0, Errors: 0, Skipped: 0, Time elapsed: 92.828 sec - in org.apache.phoenix.trace.PhoenixTracingEndToEndIT
Running org.apache.phoenix.end2end.index.ImmutableIndexIT
Tests run: 15, Failures: 0, Errors: 0, Skipped: 0, Time elapsed: 55.249 sec - in org.apache.phoenix.end2end.index.GlobalMutableIndexIT
Running org.apache.phoenix.end2end.SubqueryUsingSortMergeJoinIT
Killed
Killed
Killed
Killed
Killed

Results :




Tests run: 139, Failures: 0, Errors: 0, Skipped: 0

[INFO] 
[INFO] --- maven-failsafe-plugin:2.18:integration-test (NeedTheirOwnClusterTests) @ phoenix-core
---
[INFO] Failsafe report directory: <https://builds.apache.org/job/Phoenix-master/ws/phoenix-core/target/failsafe-reports>
[INFO] parallel='none', perCoreThreadCount=true, threadCount=0, useUnlimitedThreads=false,
threadCountSuites=0, threadCountClasses=0, threadCountMethods=0, parallelOptimized=true

-------------------------------------------------------
 T E S T S
-------------------------------------------------------
Running org.apache.phoenix.hbase.index.FailForUnsupportedHBaseVersionsIT
Running org.apache.hadoop.hbase.regionserver.wal.WALReplayWithIndexWritesAndCompressedWALIT
Running org.apache.hadoop.hbase.regionserver.wal.WALReplayWithIndexWritesAndUncompressedWALInHBase_094_9_IT
Running org.apache.phoenix.hbase.index.balancer.IndexLoadBalancerIT
Running org.apache.phoenix.hbase.index.covered.EndToEndCoveredColumnsIndexBuilderIT
Tests run: 1, Failures: 0, Errors: 0, Skipped: 0, Time elapsed: 17.427 sec - in org.apache.hadoop.hbase.regionserver.wal.WALReplayWithIndexWritesAndUncompressedWALInHBase_094_9_IT
Tests run: 2, Failures: 0, Errors: 0, Skipped: 0, Time elapsed: 17.926 sec - in org.apache.phoenix.hbase.index.FailForUnsupportedHBaseVersionsIT
Tests run: 1, Failures: 0, Errors: 0, Skipped: 0, Time elapsed: 17.599 sec - in org.apache.hadoop.hbase.regionserver.wal.WALReplayWithIndexWritesAndCompressedWALIT
Tests run: 2, Failures: 0, Errors: 0, Skipped: 0, Time elapsed: 7.957 sec - in org.apache.phoenix.hbase.index.covered.EndToEndCoveredColumnsIndexBuilderIT
Running org.apache.phoenix.hbase.index.covered.example.EndtoEndIndexingWithCompressionIT
Running org.apache.phoenix.hbase.index.covered.example.EndToEndCoveredIndexingIT
Running org.apache.phoenix.hbase.index.covered.example.FailWithoutRetriesIT
Tests run: 1, Failures: 0, Errors: 0, Skipped: 0, Time elapsed: 8.491 sec - in org.apache.phoenix.hbase.index.covered.example.FailWithoutRetriesIT
Running org.apache.phoenix.end2end.TenantSpecificTablesDMLIT
Running org.apache.phoenix.end2end.ViewIT
Tests run: 16, Failures: 0, Errors: 0, Skipped: 0, Time elapsed: 17.758 sec - in org.apache.phoenix.end2end.TenantSpecificTablesDMLIT
Running org.apache.phoenix.end2end.TenantSpecificTablesDDLIT
Tests run: 11, Failures: 0, Errors: 0, Skipped: 0, Time elapsed: 49.055 sec - in org.apache.phoenix.hbase.index.covered.example.EndtoEndIndexingWithCompressionIT
Running org.apache.phoenix.end2end.index.MutableIndexFailureIT
Tests run: 11, Failures: 0, Errors: 0, Skipped: 0, Time elapsed: 48.681 sec - in org.apache.phoenix.hbase.index.covered.example.EndToEndCoveredIndexingIT
Tests run: 14, Failures: 0, Errors: 1, Skipped: 0, Time elapsed: 26.894 sec <<< FAILURE!
- in org.apache.phoenix.end2end.ViewIT
testViewUsesTableIndex(org.apache.phoenix.end2end.ViewIT)  Time elapsed: 1.393 sec  <<<
ERROR!
org.apache.phoenix.exception.PhoenixParserException: ERROR 602 (42P00): Syntax error. Missing
"LPAREN" at line 1, column 26.
	at org.apache.phoenix.parse.PhoenixSQLParser.recoverFromMismatchedToken(PhoenixSQLParser.java:322)
	at org.antlr.runtime.BaseRecognizer.match(BaseRecognizer.java:115)
	at org.apache.phoenix.parse.PhoenixSQLParser.not_expression(PhoenixSQLParser.java:5756)
	at org.apache.phoenix.parse.PhoenixSQLParser.and_expression(PhoenixSQLParser.java:5573)
	at org.apache.phoenix.parse.PhoenixSQLParser.or_expression(PhoenixSQLParser.java:5510)
	at org.apache.phoenix.parse.PhoenixSQLParser.expression(PhoenixSQLParser.java:5475)
	at org.apache.phoenix.parse.PhoenixSQLParser.select_node(PhoenixSQLParser.java:3758)
	at org.apache.phoenix.parse.PhoenixSQLParser.hinted_select_node(PhoenixSQLParser.java:3900)
	at org.apache.phoenix.parse.PhoenixSQLParser.query(PhoenixSQLParser.java:502)
	at org.apache.phoenix.parse.SQLParser.parseQuery(SQLParser.java:129)
	at org.apache.phoenix.compile.QueryCompiler.compileSingleFlatQuery(QueryCompiler.java:472)
	at org.apache.phoenix.compile.QueryCompiler.compileSingleQuery(QueryCompiler.java:447)
	at org.apache.phoenix.compile.QueryCompiler.compile(QueryCompiler.java:154)
	at org.apache.phoenix.optimize.QueryOptimizer.addPlan(QueryOptimizer.java:240)
	at org.apache.phoenix.optimize.QueryOptimizer.getApplicablePlans(QueryOptimizer.java:153)
	at org.apache.phoenix.optimize.QueryOptimizer.optimize(QueryOptimizer.java:94)
	at org.apache.phoenix.optimize.QueryOptimizer.optimize(QueryOptimizer.java:80)
	at org.apache.phoenix.jdbc.PhoenixStatement$1.call(PhoenixStatement.java:231)
	at org.apache.phoenix.jdbc.PhoenixStatement$1.call(PhoenixStatement.java:226)
	at org.apache.phoenix.call.CallRunner.run(CallRunner.java:53)
	at org.apache.phoenix.jdbc.PhoenixStatement.executeQuery(PhoenixStatement.java:225)
	at org.apache.phoenix.jdbc.PhoenixStatement.executeQuery(PhoenixStatement.java:1039)
	at org.apache.phoenix.end2end.ViewIT.testViewUsesTableIndex(ViewIT.java:446)

Running org.apache.phoenix.end2end.index.DropIndexDuringUpsertIT
Tests run: 1, Failures: 0, Errors: 0, Skipped: 1, Time elapsed: 0 sec - in org.apache.phoenix.end2end.index.DropIndexDuringUpsertIT
Running org.apache.phoenix.end2end.index.MutableIndexReplicationIT
Running org.apache.phoenix.end2end.StatsCollectorIT
Tests run: 18, Failures: 0, Errors: 0, Skipped: 0, Time elapsed: 29.383 sec - in org.apache.phoenix.end2end.TenantSpecificTablesDDLIT
Tests run: 1, Failures: 0, Errors: 0, Skipped: 0, Time elapsed: 16.826 sec - in org.apache.phoenix.end2end.index.MutableIndexReplicationIT
Running org.apache.phoenix.end2end.KeyOnlyIT
Tests run: 9, Failures: 0, Errors: 0, Skipped: 0, Time elapsed: 104.255 sec - in org.apache.phoenix.hbase.index.balancer.IndexLoadBalancerIT
Tests run: 3, Failures: 0, Errors: 0, Skipped: 0, Time elapsed: 11.672 sec - in org.apache.phoenix.end2end.KeyOnlyIT
Running org.apache.phoenix.end2end.ContextClassloaderIT
Running org.apache.phoenix.end2end.QueryTimeoutIT
Tests run: 3, Failures: 0, Errors: 0, Skipped: 0, Time elapsed: 9.006 sec - in org.apache.phoenix.end2end.ContextClassloaderIT
Running org.apache.phoenix.end2end.MultiCfQueryExecIT
Tests run: 1, Failures: 0, Errors: 0, Skipped: 0, Time elapsed: 11.715 sec - in org.apache.phoenix.end2end.QueryTimeoutIT
Tests run: 4, Failures: 0, Errors: 0, Skipped: 0, Time elapsed: 48.686 sec - in org.apache.phoenix.end2end.StatsCollectorIT
Running org.apache.phoenix.end2end.QueryWithLimitIT
Tests run: 7, Failures: 0, Errors: 0, Skipped: 0, Time elapsed: 11.195 sec - in org.apache.phoenix.end2end.MultiCfQueryExecIT
Running org.apache.phoenix.end2end.ParallelIteratorsIT
Tests run: 2, Failures: 0, Errors: 0, Skipped: 0, Time elapsed: 11.914 sec - in org.apache.phoenix.end2end.QueryWithLimitIT
Running org.apache.phoenix.end2end.SaltedViewIT
Running org.apache.phoenix.end2end.SpillableGroupByIT
Tests run: 2, Failures: 0, Errors: 0, Skipped: 0, Time elapsed: 9.928 sec - in org.apache.phoenix.end2end.ParallelIteratorsIT
Tests run: 2, Failures: 0, Errors: 0, Skipped: 0, Time elapsed: 11.526 sec - in org.apache.phoenix.end2end.SaltedViewIT
Tests run: 1, Failures: 0, Errors: 0, Skipped: 0, Time elapsed: 11.457 sec - in org.apache.phoenix.end2end.SpillableGroupByIT
Running org.apache.phoenix.end2end.StatsCollectorWithSplitsAndMultiCFIT
Running org.apache.phoenix.end2end.AlterTableIT
Running org.apache.phoenix.end2end.CountDistinctCompressionIT
Tests run: 1, Failures: 0, Errors: 0, Skipped: 0, Time elapsed: 3.135 sec - in org.apache.phoenix.end2end.CountDistinctCompressionIT
Tests run: 2, Failures: 0, Errors: 0, Skipped: 0, Time elapsed: 28.923 sec - in org.apache.phoenix.end2end.StatsCollectorWithSplitsAndMultiCFIT
Running org.apache.phoenix.mapreduce.CsvBulkLoadToolIT
Tests run: 3, Failures: 0, Errors: 0, Skipped: 0, Time elapsed: 147.294 sec - in org.apache.phoenix.end2end.index.MutableIndexFailureIT
Tests run: 51, Failures: 0, Errors: 0, Skipped: 0, Time elapsed: 249.941 sec - in org.apache.phoenix.end2end.AlterTableIT
Tests run: 6, Failures: 0, Errors: 0, Skipped: 0, Time elapsed: 244.96 sec - in org.apache.phoenix.mapreduce.CsvBulkLoadToolIT

Results :


Tests in error: 
  ViewIT.testViewUsesTableIndex:446 ยป PhoenixParser ERROR 602 (42P00): Syntax er...


Tests run: 176, Failures: 0, Errors: 1, Skipped: 1

[INFO] 
[INFO] --- maven-failsafe-plugin:2.18:verify (ClientManagedTimeTests) @ phoenix-core ---
[INFO] Failsafe report directory: <https://builds.apache.org/job/Phoenix-master/ws/phoenix-core/target/failsafe-reports>
[INFO] ------------------------------------------------------------------------
[INFO] Reactor Summary:
[INFO] 
[INFO] Apache Phoenix .................................... SUCCESS [2.539s]
[INFO] Phoenix Core ...................................... FAILURE [14:18.717s]
[INFO] Phoenix - Flume ................................... SKIPPED
[INFO] Phoenix - Pig ..................................... SKIPPED
[INFO] Phoenix Assembly .................................. SKIPPED
[INFO] ------------------------------------------------------------------------
[INFO] BUILD FAILURE
[INFO] ------------------------------------------------------------------------
[INFO] Total time: 14:21.730s
[INFO] Finished at: Tue Feb 10 03:06:41 UTC 2015
[INFO] Final Memory: 49M/1059M
[INFO] ------------------------------------------------------------------------
[ERROR] Failed to execute goal org.apache.maven.plugins:maven-failsafe-plugin:2.18:verify
(ClientManagedTimeTests) on project phoenix-core: There are test failures.
[ERROR] 
[ERROR] Please refer to <https://builds.apache.org/job/Phoenix-master/ws/phoenix-core/target/failsafe-reports>
for the individual test results.
[ERROR] -> [Help 1]
[ERROR] 
[ERROR] To see the full stack trace of the errors, re-run Maven with the -e switch.
[ERROR] Re-run Maven using the -X switch to enable full debug logging.
[ERROR] 
[ERROR] For more information about the errors and possible solutions, please read the following
articles:
[ERROR] [Help 1] http://cwiki.apache.org/confluence/display/MAVEN/MojoFailureException
[ERROR] 
[ERROR] After correcting the problems, you can resume the build with the command
[ERROR]   mvn <goals> -rf :phoenix-core
Build step 'Invoke top-level Maven targets' marked build as failure
Archiving artifacts
Sending artifact delta relative to Phoenix | Master #584
Archived 723 artifacts
Archive block size is 32768
Received 8122 blocks and 294574010 bytes
Compression is 47.5%
Took 2 min 20 sec
Updating PHOENIX-688
Updating PHOENIX-1646
Updating PHOENIX-653
Recording test results

Mime
View raw message