phoenix-commits mailing list archives

Site index · List index
Message view « Date » · « Thread »
Top « Date » · « Thread »
From Apache Jenkins Server <jenk...@builds.apache.org>
Subject Build failed in Jenkins: Phoenix | Master #564
Date Wed, 21 Jan 2015 02:01:44 GMT
See <https://builds.apache.org/job/Phoenix-master/564/changes>

Changes:

[larsh] PHOENIX-1516 Add RAND() built-in function.

------------------------------------------
[...truncated 745 lines...]

Tests run: 13, Failures: 0, Errors: 0, Skipped: 0

[INFO] 
[INFO] --- maven-failsafe-plugin:2.18:integration-test (NeedTheirOwnClusterTests) @ phoenix-flume
---
[INFO] Failsafe report directory: <https://builds.apache.org/job/Phoenix-master/ws/phoenix-flume/target/failsafe-reports>
[INFO] parallel='none', perCoreThreadCount=true, threadCount=0, useUnlimitedThreads=false,
threadCountSuites=0, threadCountClasses=0, threadCountMethods=0, parallelOptimized=true

-------------------------------------------------------
 T E S T S
-------------------------------------------------------

Results :




Tests run: 0, Failures: 0, Errors: 0, Skipped: 0

[INFO] 
[INFO] --- maven-failsafe-plugin:2.18:verify (ClientManagedTimeTests) @ phoenix-flume ---
[INFO] Failsafe report directory: <https://builds.apache.org/job/Phoenix-master/ws/phoenix-flume/target/failsafe-reports>
[INFO] 
[INFO] --- maven-failsafe-plugin:2.18:verify (HBaseManagedTimeTests) @ phoenix-flume ---
[INFO] Failsafe report directory: <https://builds.apache.org/job/Phoenix-master/ws/phoenix-flume/target/failsafe-reports>
[INFO] 
[INFO] --- maven-failsafe-plugin:2.18:verify (NeedTheirOwnClusterTests) @ phoenix-flume ---
[INFO] Failsafe report directory: <https://builds.apache.org/job/Phoenix-master/ws/phoenix-flume/target/failsafe-reports>
[INFO] 
[INFO] --- maven-install-plugin:2.5.1:install (default-install) @ phoenix-flume ---
[INFO] Installing <https://builds.apache.org/job/Phoenix-master/564/artifact/phoenix-flume/target/phoenix-flume-5.0.0-SNAPSHOT.jar>
to /home/jenkins/.m2/repository/org/apache/phoenix/phoenix-flume/5.0.0-SNAPSHOT/phoenix-flume-5.0.0-SNAPSHOT.jar
[INFO] Installing <https://builds.apache.org/job/Phoenix-master/ws/phoenix-flume/pom.xml>
to /home/jenkins/.m2/repository/org/apache/phoenix/phoenix-flume/5.0.0-SNAPSHOT/phoenix-flume-5.0.0-SNAPSHOT.pom
[INFO] Installing <https://builds.apache.org/job/Phoenix-master/564/artifact/phoenix-flume/target/phoenix-flume-5.0.0-SNAPSHOT-sources.jar>
to /home/jenkins/.m2/repository/org/apache/phoenix/phoenix-flume/5.0.0-SNAPSHOT/phoenix-flume-5.0.0-SNAPSHOT-sources.jar
[INFO] Installing <https://builds.apache.org/job/Phoenix-master/564/artifact/phoenix-flume/target/phoenix-flume-5.0.0-SNAPSHOT-tests.jar>
to /home/jenkins/.m2/repository/org/apache/phoenix/phoenix-flume/5.0.0-SNAPSHOT/phoenix-flume-5.0.0-SNAPSHOT-tests.jar
[INFO]                                                                         
[INFO] ------------------------------------------------------------------------
[INFO] Building Phoenix - Pig 5.0.0-SNAPSHOT
[INFO] ------------------------------------------------------------------------
[INFO] 
[INFO] --- maven-clean-plugin:2.5:clean (default-clean) @ phoenix-pig ---
[INFO] Deleting <https://builds.apache.org/job/Phoenix-master/ws/phoenix-pig/target>
[INFO] 
[INFO] --- build-helper-maven-plugin:1.9.1:add-test-source (add-test-source) @ phoenix-pig
---
[INFO] Test Source directory: <https://builds.apache.org/job/Phoenix-master/ws/phoenix-pig/src/it/java>
added.
[INFO] 
[INFO] --- build-helper-maven-plugin:1.9.1:add-test-resource (add-test-resource) @ phoenix-pig
---
[INFO] 
[INFO] --- maven-remote-resources-plugin:1.5:process (default) @ phoenix-pig ---
[INFO] 
[INFO] --- maven-resources-plugin:2.6:resources (default-resources) @ phoenix-pig ---
[INFO] Using 'UTF-8' encoding to copy filtered resources.
[INFO] skip non existing resourceDirectory <https://builds.apache.org/job/Phoenix-master/ws/phoenix-pig/src/main/resources>
[INFO] Copying 3 resources
[INFO] 
[INFO] --- maven-compiler-plugin:3.0:compile (default-compile) @ phoenix-pig ---
[INFO] Changes detected - recompiling the module!
[INFO] Compiling 8 source files to <https://builds.apache.org/job/Phoenix-master/ws/phoenix-pig/target/classes>
[INFO] 
[INFO] --- maven-dependency-plugin:2.1:build-classpath (create-mrapp-generated-classpath)
@ phoenix-pig ---
[INFO] Wrote classpath file '<https://builds.apache.org/job/Phoenix-master/ws/phoenix-pig/target/classes/mrapp-generated-classpath'.>
[INFO] 
[INFO] --- maven-resources-plugin:2.6:testResources (default-testResources) @ phoenix-pig
---
[INFO] Using 'UTF-8' encoding to copy filtered resources.
[INFO] skip non existing resourceDirectory <https://builds.apache.org/job/Phoenix-master/ws/phoenix-pig/src/test/resources>
[INFO] skip non existing resourceDirectory <https://builds.apache.org/job/Phoenix-master/ws/phoenix-pig/src/it/resources>
[INFO] Copying 3 resources
[INFO] 
[INFO] --- maven-compiler-plugin:3.0:testCompile (default-testCompile) @ phoenix-pig ---
[INFO] Changes detected - recompiling the module!
[INFO] Compiling 6 source files to <https://builds.apache.org/job/Phoenix-master/ws/phoenix-pig/target/test-classes>
[INFO] 
[INFO] --- maven-surefire-plugin:2.18:test (default-test) @ phoenix-pig ---
[INFO] Surefire report directory: <https://builds.apache.org/job/Phoenix-master/ws/phoenix-pig/target/surefire-reports>

-------------------------------------------------------
 T E S T S
-------------------------------------------------------
Running org.apache.phoenix.pig.util.SqlQueryToColumnInfoFunctionTest
Tests run: 1, Failures: 0, Errors: 0, Skipped: 0, Time elapsed: 1.774 sec - in org.apache.phoenix.pig.util.SqlQueryToColumnInfoFunctionTest
Running org.apache.phoenix.pig.util.TableSchemaParserFunctionTest
Tests run: 3, Failures: 0, Errors: 0, Skipped: 0, Time elapsed: 0.004 sec - in org.apache.phoenix.pig.util.TableSchemaParserFunctionTest
Running org.apache.phoenix.pig.util.QuerySchemaParserFunctionTest
Tests run: 4, Failures: 0, Errors: 0, Skipped: 0, Time elapsed: 0.218 sec - in org.apache.phoenix.pig.util.QuerySchemaParserFunctionTest
Running org.apache.phoenix.pig.util.PhoenixPigSchemaUtilTest
Tests run: 2, Failures: 0, Errors: 0, Skipped: 0, Time elapsed: 0.022 sec - in org.apache.phoenix.pig.util.PhoenixPigSchemaUtilTest

Results :




Tests run: 10, Failures: 0, Errors: 0, Skipped: 0

[INFO] 
[INFO] --- maven-source-plugin:2.2.1:jar-no-fork (attach-sources) @ phoenix-pig ---
[INFO] Building jar: <https://builds.apache.org/job/Phoenix-master/564/artifact/phoenix-pig/target/phoenix-pig-5.0.0-SNAPSHOT-sources.jar>
[INFO] 
[INFO] --- maven-jar-plugin:2.4:test-jar (default) @ phoenix-pig ---
[INFO] Building jar: <https://builds.apache.org/job/Phoenix-master/564/artifact/phoenix-pig/target/phoenix-pig-5.0.0-SNAPSHOT-tests.jar>
[INFO] 
[INFO] --- maven-jar-plugin:2.4:jar (default-jar) @ phoenix-pig ---
[INFO] Building jar: <https://builds.apache.org/job/Phoenix-master/564/artifact/phoenix-pig/target/phoenix-pig-5.0.0-SNAPSHOT.jar>
[INFO] 
[INFO] --- maven-site-plugin:3.2:attach-descriptor (attach-descriptor) @ phoenix-pig ---
[INFO] 
[INFO] --- maven-failsafe-plugin:2.18:integration-test (ClientManagedTimeTests) @ phoenix-pig
---
[INFO] Failsafe report directory: <https://builds.apache.org/job/Phoenix-master/ws/phoenix-pig/target/failsafe-reports>
[INFO] parallel='none', perCoreThreadCount=true, threadCount=0, useUnlimitedThreads=false,
threadCountSuites=0, threadCountClasses=0, threadCountMethods=0, parallelOptimized=true

-------------------------------------------------------
 T E S T S
-------------------------------------------------------

Results :




Tests run: 0, Failures: 0, Errors: 0, Skipped: 0

[INFO] 
[INFO] --- maven-failsafe-plugin:2.18:integration-test (HBaseManagedTimeTests) @ phoenix-pig
---
[INFO] Failsafe report directory: <https://builds.apache.org/job/Phoenix-master/ws/phoenix-pig/target/failsafe-reports>
[INFO] parallel='none', perCoreThreadCount=true, threadCount=0, useUnlimitedThreads=false,
threadCountSuites=0, threadCountClasses=0, threadCountMethods=0, parallelOptimized=true

-------------------------------------------------------
 T E S T S
-------------------------------------------------------
Running org.apache.phoenix.pig.PhoenixHBaseStorerIT
Tests run: 4, Failures: 0, Errors: 0, Skipped: 0, Time elapsed: 12.477 sec - in org.apache.phoenix.pig.PhoenixHBaseStorerIT

Results :




Tests run: 4, Failures: 0, Errors: 0, Skipped: 0

[INFO] 
[INFO] --- maven-failsafe-plugin:2.18:integration-test (NeedTheirOwnClusterTests) @ phoenix-pig
---
[INFO] Failsafe report directory: <https://builds.apache.org/job/Phoenix-master/ws/phoenix-pig/target/failsafe-reports>
[INFO] parallel='none', perCoreThreadCount=true, threadCount=0, useUnlimitedThreads=false,
threadCountSuites=0, threadCountClasses=0, threadCountMethods=0, parallelOptimized=true

-------------------------------------------------------
 T E S T S
-------------------------------------------------------
Running org.apache.phoenix.pig.PhoenixHBaseLoaderIT
Tests run: 12, Failures: 1, Errors: 7, Skipped: 0, Time elapsed: 38.27 sec <<< FAILURE!
- in org.apache.phoenix.pig.PhoenixHBaseLoaderIT
testGroupingOfDataForTable(org.apache.phoenix.pig.PhoenixHBaseLoaderIT)  Time elapsed: 5.06
sec  <<< ERROR!
java.lang.RuntimeException: No data for location 'out'
	at org.apache.pig.builtin.mock.Storage$Data.get(Storage.java:327)
	at org.apache.phoenix.pig.PhoenixHBaseLoaderIT.testGroupingOfDataForTable(PhoenixHBaseLoaderIT.java:415)

testDataFromIndexTable(org.apache.phoenix.pig.PhoenixHBaseLoaderIT)  Time elapsed: 4.933 sec
 <<< ERROR!
org.apache.pig.impl.logicalLayer.FrontendException: Unable to open iterator for alias A
	at org.apache.pig.PigServer.openIterator(PigServer.java:872)
	at org.apache.phoenix.pig.PhoenixHBaseLoaderIT.testDataFromIndexTable(PhoenixHBaseLoaderIT.java:592)

testDataForTable(org.apache.phoenix.pig.PhoenixHBaseLoaderIT)  Time elapsed: 3.008 sec  <<<
ERROR!
org.apache.pig.impl.logicalLayer.FrontendException: Unable to open iterator for alias B
	at org.apache.pig.PigServer.openIterator(PigServer.java:872)
	at org.apache.phoenix.pig.PhoenixHBaseLoaderIT.testDataForTable(PhoenixHBaseLoaderIT.java:260)

testForNonPKSQLQuery(org.apache.phoenix.pig.PhoenixHBaseLoaderIT)  Time elapsed: 2.831 sec
 <<< ERROR!
org.apache.pig.impl.logicalLayer.FrontendException: Unable to open iterator for alias A
	at org.apache.pig.PigServer.openIterator(PigServer.java:872)
	at org.apache.phoenix.pig.PhoenixHBaseLoaderIT.testForNonPKSQLQuery(PhoenixHBaseLoaderIT.java:346)

testDataForSQLQueryWithSequences(org.apache.phoenix.pig.PhoenixHBaseLoaderIT)  Time elapsed:
2.861 sec  <<< ERROR!
org.apache.pig.impl.logicalLayer.FrontendException: Unable to open iterator for alias A
	at org.apache.pig.PigServer.openIterator(PigServer.java:872)
	at org.apache.phoenix.pig.PhoenixHBaseLoaderIT.testDataForSQLQueryWithSequences(PhoenixHBaseLoaderIT.java:520)

testDataForSQLQueryWithFunctions(org.apache.phoenix.pig.PhoenixHBaseLoaderIT)  Time elapsed:
2.846 sec  <<< ERROR!
org.apache.pig.impl.logicalLayer.FrontendException: Unable to open iterator for alias A
	at org.apache.pig.PigServer.openIterator(PigServer.java:872)
	at org.apache.phoenix.pig.PhoenixHBaseLoaderIT.testDataForSQLQueryWithFunctions(PhoenixHBaseLoaderIT.java:557)

testDataForSQLQuery(org.apache.phoenix.pig.PhoenixHBaseLoaderIT)  Time elapsed: 2.796 sec
 <<< ERROR!
org.apache.pig.impl.logicalLayer.FrontendException: Unable to open iterator for alias A
	at org.apache.pig.PigServer.openIterator(PigServer.java:872)
	at org.apache.phoenix.pig.PhoenixHBaseLoaderIT.testDataForSQLQuery(PhoenixHBaseLoaderIT.java:301)

testLoadAndStore(org.apache.phoenix.pig.PhoenixHBaseLoaderIT)  Time elapsed: 3.209 sec  <<<
FAILURE!
java.lang.AssertionError: null
	at org.junit.Assert.fail(Assert.java:86)
	at org.junit.Assert.assertTrue(Assert.java:41)
	at org.junit.Assert.assertTrue(Assert.java:52)
	at org.apache.phoenix.pig.PhoenixHBaseLoaderIT.testLoadAndStore(PhoenixHBaseLoaderIT.java:474)


Results :

Failed tests: 
  PhoenixHBaseLoaderIT.testLoadAndStore:474 null

Tests in error: 
  PhoenixHBaseLoaderIT.testDataForSQLQuery:301 » Frontend Unable to open iterato...
  PhoenixHBaseLoaderIT.testDataForSQLQueryWithFunctions:557 » Frontend Unable to...
  PhoenixHBaseLoaderIT.testDataForSQLQueryWithSequences:520 » Frontend Unable to...
  PhoenixHBaseLoaderIT.testDataForTable:260 » Frontend Unable to open iterator f...
  PhoenixHBaseLoaderIT.testDataFromIndexTable:592 » Frontend Unable to open iter...
  PhoenixHBaseLoaderIT.testForNonPKSQLQuery:346 » Frontend Unable to open iterat...
  PhoenixHBaseLoaderIT.testGroupingOfDataForTable:415 » Runtime No data for loca...


Tests run: 12, Failures: 1, Errors: 7, Skipped: 0

[INFO] 
[INFO] --- maven-failsafe-plugin:2.18:verify (ClientManagedTimeTests) @ phoenix-pig ---
[INFO] Failsafe report directory: <https://builds.apache.org/job/Phoenix-master/ws/phoenix-pig/target/failsafe-reports>
[INFO] ------------------------------------------------------------------------
[INFO] Reactor Summary:
[INFO] 
[INFO] Apache Phoenix .................................... SUCCESS [1.751s]
[INFO] Phoenix Core ...................................... SUCCESS [17:43.440s]
[INFO] Phoenix - Flume ................................... SUCCESS [59.824s]
[INFO] Phoenix - Pig ..................................... FAILURE [2:25.996s]
[INFO] Phoenix Assembly .................................. SKIPPED
[INFO] ------------------------------------------------------------------------
[INFO] BUILD FAILURE
[INFO] ------------------------------------------------------------------------
[INFO] Total time: 21:11.397s
[INFO] Finished at: Wed Jan 21 01:59:24 UTC 2015
[INFO] Final Memory: 60M/1141M
[INFO] ------------------------------------------------------------------------
[ERROR] Failed to execute goal org.apache.maven.plugins:maven-failsafe-plugin:2.18:verify
(ClientManagedTimeTests) on project phoenix-pig: There are test failures.
[ERROR] 
[ERROR] Please refer to <https://builds.apache.org/job/Phoenix-master/ws/phoenix-pig/target/failsafe-reports>
for the individual test results.
[ERROR] -> [Help 1]
[ERROR] 
[ERROR] To see the full stack trace of the errors, re-run Maven with the -e switch.
[ERROR] Re-run Maven using the -X switch to enable full debug logging.
[ERROR] 
[ERROR] For more information about the errors and possible solutions, please read the following
articles:
[ERROR] [Help 1] http://cwiki.apache.org/confluence/display/MAVEN/MojoFailureException
[ERROR] 
[ERROR] After correcting the problems, you can resume the build with the command
[ERROR]   mvn <goals> -rf :phoenix-pig
Build step 'Invoke top-level Maven targets' marked build as failure
Archiving artifacts
Sending artifact delta relative to Phoenix | Master #563
Archived 818 artifacts
Archive block size is 32768
Received 6623 blocks and 395525993 bytes
Compression is 35.4%
Took 2 min 12 sec
Updating PHOENIX-1516
Recording test results

Mime
View raw message