phoenix-commits mailing list archives

Site index · List index
Message view « Date » · « Thread »
Top « Date » · « Thread »
From Apache Jenkins Server <jenk...@builds.apache.org>
Subject Build failed in Jenkins: Phoenix | Master #557
Date Tue, 20 Jan 2015 05:13:41 GMT
See <https://builds.apache.org/job/Phoenix-master/557/changes>

Changes:

[jtaylor] PHOENIX-1582 Support TimeOut in JDBC

[jtaylor] PHOENIX-1594 Using KeyOnlyFilter for simple query of select count(1) from <table>

------------------------------------------
[...truncated 493 lines...]
java.lang.AssertionError: null
	at org.junit.Assert.fail(Assert.java:86)
	at org.junit.Assert.assertTrue(Assert.java:41)
	at org.junit.Assert.assertTrue(Assert.java:52)
	at org.apache.phoenix.end2end.index.GlobalIndexOptimizationIT.testOptimizationTenantSpecific(GlobalIndexOptimizationIT.java:263)
	at org.apache.phoenix.end2end.index.GlobalIndexOptimizationIT.testGlobalIndexOptimizationTenantSpecific(GlobalIndexOptimizationIT.java:89)

testGlobalIndexOptimizationWithSalting(org.apache.phoenix.end2end.index.GlobalIndexOptimizationIT)
 Time elapsed: 4.294 sec  <<< FAILURE!
java.lang.AssertionError: null
	at org.junit.Assert.fail(Assert.java:86)
	at org.junit.Assert.assertTrue(Assert.java:41)
	at org.junit.Assert.assertTrue(Assert.java:52)
	at org.apache.phoenix.end2end.index.GlobalIndexOptimizationIT.testOptimization(GlobalIndexOptimizationIT.java:111)
	at org.apache.phoenix.end2end.index.GlobalIndexOptimizationIT.testGlobalIndexOptimizationWithSalting(GlobalIndexOptimizationIT.java:84)

testGlobalIndexOptimizationWithSaltingTenantSpecific(org.apache.phoenix.end2end.index.GlobalIndexOptimizationIT)
 Time elapsed: 7.056 sec  <<< FAILURE!
java.lang.AssertionError: null
	at org.junit.Assert.fail(Assert.java:86)
	at org.junit.Assert.assertTrue(Assert.java:41)
	at org.junit.Assert.assertTrue(Assert.java:52)
	at org.apache.phoenix.end2end.index.GlobalIndexOptimizationIT.testOptimizationTenantSpecific(GlobalIndexOptimizationIT.java:263)
	at org.apache.phoenix.end2end.index.GlobalIndexOptimizationIT.testGlobalIndexOptimizationWithSaltingTenantSpecific(GlobalIndexOptimizationIT.java:94)

Running org.apache.phoenix.end2end.index.ViewIndexIT
Tests run: 1, Failures: 0, Errors: 0, Skipped: 0, Time elapsed: 4.586 sec - in org.apache.phoenix.end2end.index.ViewIndexIT
Running org.apache.phoenix.end2end.UpsertBigValuesIT
Tests run: 15, Failures: 0, Errors: 0, Skipped: 0, Time elapsed: 67.418 sec - in org.apache.phoenix.end2end.index.GlobalMutableIndexIT
Running org.apache.phoenix.end2end.AutoCommitIT
Tests run: 4, Failures: 0, Errors: 0, Skipped: 0, Time elapsed: 8.841 sec - in org.apache.phoenix.end2end.UpsertBigValuesIT
Running org.apache.phoenix.end2end.StddevIT
Tests run: 6, Failures: 0, Errors: 0, Skipped: 0, Time elapsed: 37.292 sec - in org.apache.phoenix.end2end.index.IndexMetadataIT
Running org.apache.phoenix.end2end.DeleteIT
Tests run: 1, Failures: 0, Errors: 0, Skipped: 0, Time elapsed: 1.958 sec - in org.apache.phoenix.end2end.AutoCommitIT
Tests run: 15, Failures: 0, Errors: 0, Skipped: 0, Time elapsed: 64.726 sec - in org.apache.phoenix.end2end.index.LocalMutableIndexIT
Running org.apache.phoenix.end2end.FirstValueFunctionIT
Running org.apache.phoenix.end2end.RegexpSubstrFunctionIT
Tests run: 4, Failures: 0, Errors: 0, Skipped: 0, Time elapsed: 3.777 sec - in org.apache.phoenix.end2end.StddevIT
Running org.apache.phoenix.end2end.BinaryRowKeyIT
Tests run: 2, Failures: 0, Errors: 0, Skipped: 0, Time elapsed: 2.47 sec - in org.apache.phoenix.end2end.RegexpSubstrFunctionIT
Running org.apache.phoenix.end2end.ModulusExpressionIT
Tests run: 7, Failures: 0, Errors: 0, Skipped: 0, Time elapsed: 3.031 sec - in org.apache.phoenix.end2end.FirstValueFunctionIT
Running org.apache.phoenix.end2end.SkipScanQueryIT
Tests run: 3, Failures: 0, Errors: 0, Skipped: 0, Time elapsed: 2.57 sec - in org.apache.phoenix.end2end.BinaryRowKeyIT
Running org.apache.phoenix.end2end.SpooledSortMergeJoinIT
Tests run: 11, Failures: 0, Errors: 0, Skipped: 0, Time elapsed: 4.954 sec - in org.apache.phoenix.end2end.ModulusExpressionIT
Running org.apache.phoenix.end2end.HashJoinIT
Tests run: 9, Failures: 0, Errors: 0, Skipped: 0, Time elapsed: 18.556 sec - in org.apache.phoenix.end2end.SkipScanQueryIT
Running org.apache.phoenix.end2end.ReadOnlyIT
Tests run: 20, Failures: 0, Errors: 0, Skipped: 0, Time elapsed: 29.731 sec - in org.apache.phoenix.end2end.DeleteIT
Running org.apache.phoenix.end2end.MD5FunctionIT
Tests run: 1, Failures: 0, Errors: 0, Skipped: 0, Time elapsed: 7.897 sec - in org.apache.phoenix.end2end.ReadOnlyIT
Running org.apache.phoenix.end2end.HashJoinLocalIndexIT
Tests run: 2, Failures: 0, Errors: 0, Skipped: 0, Time elapsed: 4.652 sec - in org.apache.phoenix.end2end.MD5FunctionIT
Running org.apache.phoenix.end2end.StoreNullsIT
Tests run: 1, Failures: 0, Errors: 0, Skipped: 0, Time elapsed: 16.666 sec - in org.apache.phoenix.end2end.HashJoinLocalIndexIT
Running org.apache.phoenix.end2end.ArithmeticQueryIT
Tests run: 3, Failures: 0, Errors: 0, Skipped: 0, Time elapsed: 17.307 sec - in org.apache.phoenix.end2end.StoreNullsIT
Running org.apache.phoenix.end2end.DecodeFunctionIT
Tests run: 6, Failures: 0, Errors: 0, Skipped: 0, Time elapsed: 3.633 sec - in org.apache.phoenix.end2end.DecodeFunctionIT
Running org.apache.phoenix.end2end.ExecuteStatementsIT
Tests run: 20, Failures: 0, Errors: 0, Skipped: 0, Time elapsed: 16.127 sec - in org.apache.phoenix.end2end.ArithmeticQueryIT
Running org.apache.phoenix.end2end.SpooledTmpFileDeleteIT
Tests run: 1, Failures: 0, Errors: 0, Skipped: 0, Time elapsed: 2.866 sec - in org.apache.phoenix.end2end.SpooledTmpFileDeleteIT
Running org.apache.phoenix.end2end.ServerExceptionIT
Tests run: 1, Failures: 0, Errors: 0, Skipped: 0, Time elapsed: 2.222 sec - in org.apache.phoenix.end2end.ServerExceptionIT
Running org.apache.phoenix.end2end.ToDateFunctionIT
Tests run: 6, Failures: 0, Errors: 0, Skipped: 0, Time elapsed: 1.298 sec - in org.apache.phoenix.end2end.ToDateFunctionIT
Running org.apache.phoenix.end2end.CSVCommonsLoaderIT
Tests run: 2, Failures: 0, Errors: 0, Skipped: 0, Time elapsed: 17.833 sec - in org.apache.phoenix.end2end.ExecuteStatementsIT
Running org.apache.phoenix.end2end.MappingTableDataTypeIT
Tests run: 18, Failures: 0, Errors: 0, Skipped: 0, Time elapsed: 146.87 sec - in org.apache.phoenix.end2end.index.LocalIndexIT
Running org.apache.phoenix.end2end.TenantSpecificViewIndexIT
Tests run: 1, Failures: 0, Errors: 0, Skipped: 0, Time elapsed: 7.89 sec - in org.apache.phoenix.end2end.MappingTableDataTypeIT
Running org.apache.phoenix.end2end.InListIT
Tests run: 15, Failures: 0, Errors: 0, Skipped: 0, Time elapsed: 19.785 sec - in org.apache.phoenix.end2end.CSVCommonsLoaderIT
Running org.apache.phoenix.end2end.StatementHintsIT
Tests run: 2, Failures: 0, Errors: 0, Skipped: 0, Time elapsed: 2.508 sec - in org.apache.phoenix.end2end.StatementHintsIT
Running org.apache.phoenix.end2end.TenantSpecificViewIndexSaltedIT
Tests run: 7, Failures: 0, Errors: 0, Skipped: 0, Time elapsed: 18.015 sec - in org.apache.phoenix.end2end.TenantSpecificViewIndexIT
Running org.apache.phoenix.end2end.TimezoneOffsetFunctionIT
Tests run: 6, Failures: 0, Errors: 0, Skipped: 0, Time elapsed: 3.19 sec - in org.apache.phoenix.end2end.TimezoneOffsetFunctionIT
Running org.apache.phoenix.end2end.QueryExecWithoutSCNIT
Tests run: 1, Failures: 0, Errors: 0, Skipped: 0, Time elapsed: 3.791 sec - in org.apache.phoenix.end2end.QueryExecWithoutSCNIT
Running org.apache.phoenix.end2end.LpadFunctionIT
Tests run: 4, Failures: 0, Errors: 0, Skipped: 0, Time elapsed: 10.44 sec - in org.apache.phoenix.end2end.TenantSpecificViewIndexSaltedIT
Running org.apache.phoenix.end2end.CoalesceFunctionIT
Tests run: 10, Failures: 0, Errors: 0, Skipped: 0, Time elapsed: 8.556 sec - in org.apache.phoenix.end2end.LpadFunctionIT
Running org.apache.phoenix.end2end.EvaluationOfORIT
Tests run: 10, Failures: 0, Errors: 0, Skipped: 0, Time elapsed: 9.383 sec - in org.apache.phoenix.end2end.CoalesceFunctionIT
Running org.apache.phoenix.end2end.LastValueFunctionIT
Tests run: 1, Failures: 0, Errors: 0, Skipped: 0, Time elapsed: 2.424 sec - in org.apache.phoenix.end2end.EvaluationOfORIT
Running org.apache.phoenix.end2end.SkipScanAfterManualSplitIT
Tests run: 11, Failures: 0, Errors: 0, Skipped: 0, Time elapsed: 6.55 sec - in org.apache.phoenix.end2end.LastValueFunctionIT
Running org.apache.phoenix.end2end.salted.SaltedTableVarLengthRowKeyIT
Tests run: 1, Failures: 0, Errors: 0, Skipped: 0, Time elapsed: 3.212 sec - in org.apache.phoenix.end2end.salted.SaltedTableVarLengthRowKeyIT
Running org.apache.phoenix.end2end.salted.SaltedTableUpsertSelectIT
Tests run: 5, Failures: 0, Errors: 0, Skipped: 0, Time elapsed: 11.989 sec - in org.apache.phoenix.end2end.salted.SaltedTableUpsertSelectIT
Running org.apache.phoenix.end2end.DynamicFamilyIT
Tests run: 4, Failures: 0, Errors: 0, Skipped: 0, Time elapsed: 5.123 sec - in org.apache.phoenix.end2end.DynamicFamilyIT
Running org.apache.phoenix.end2end.MinMaxAggregateFunctionIT
Tests run: 1, Failures: 0, Errors: 0, Skipped: 0, Time elapsed: 2.746 sec - in org.apache.phoenix.end2end.MinMaxAggregateFunctionIT
Running org.apache.phoenix.end2end.SubqueryIT
Tests run: 3, Failures: 0, Errors: 0, Skipped: 0, Time elapsed: 33.677 sec - in org.apache.phoenix.end2end.SkipScanAfterManualSplitIT
Running org.apache.phoenix.end2end.ReverseScanIT
Tests run: 2, Failures: 0, Errors: 0, Skipped: 0, Time elapsed: 3.874 sec - in org.apache.phoenix.end2end.ReverseScanIT
Running org.apache.phoenix.end2end.SortMergeJoinIT
Tests run: 25, Failures: 0, Errors: 0, Skipped: 0, Time elapsed: 87.671 sec - in org.apache.phoenix.end2end.InListIT
Running org.apache.phoenix.end2end.QueryMoreIT
Tests run: 102, Failures: 0, Errors: 0, Skipped: 0, Time elapsed: 169.488 sec - in org.apache.phoenix.end2end.HashJoinIT
Running org.apache.phoenix.end2end.ConvertTimezoneFunctionIT
Tests run: 6, Failures: 0, Errors: 0, Skipped: 0, Time elapsed: 3.153 sec - in org.apache.phoenix.end2end.ConvertTimezoneFunctionIT
Running org.apache.phoenix.trace.PhoenixTraceReaderIT
Tests run: 2, Failures: 0, Errors: 0, Skipped: 0, Time elapsed: 0.76 sec - in org.apache.phoenix.trace.PhoenixTraceReaderIT
Running org.apache.phoenix.trace.PhoenixTracingEndToEndIT
Tests run: 4, Failures: 0, Errors: 0, Skipped: 0, Time elapsed: 19.433 sec - in org.apache.phoenix.end2end.QueryMoreIT
Running org.apache.phoenix.trace.PhoenixTableMetricsWriterIT
Tests run: 2, Failures: 0, Errors: 0, Skipped: 0, Time elapsed: 0.675 sec - in org.apache.phoenix.trace.PhoenixTableMetricsWriterIT
Tests run: 21, Failures: 0, Errors: 0, Skipped: 0, Time elapsed: 62.301 sec - in org.apache.phoenix.end2end.SubqueryIT
Tests run: 5, Failures: 0, Errors: 0, Skipped: 0, Time elapsed: 87.92 sec - in org.apache.phoenix.trace.PhoenixTracingEndToEndIT
Tests run: 102, Failures: 0, Errors: 0, Skipped: 0, Time elapsed: 274.994 sec - in org.apache.phoenix.end2end.SpooledSortMergeJoinIT
Tests run: 102, Failures: 0, Errors: 0, Skipped: 0, Time elapsed: 157.458 sec - in org.apache.phoenix.end2end.SortMergeJoinIT

Results :

Failed tests: 
  GlobalIndexOptimizationIT.testGlobalIndexOptimization:79->testOptimization:111 null
  GlobalIndexOptimizationIT.testGlobalIndexOptimizationOnSharedIndex:308 null
  GlobalIndexOptimizationIT.testGlobalIndexOptimizationTenantSpecific:89->testOptimizationTenantSpecific:263
null
  GlobalIndexOptimizationIT.testGlobalIndexOptimizationWithSalting:84->testOptimization:111
null
  GlobalIndexOptimizationIT.testGlobalIndexOptimizationWithSaltingTenantSpecific:94->testOptimizationTenantSpecific:263
null
  GlobalIndexOptimizationIT.testNoGlobalIndexOptimization:346 expected:<...GE SCAN OVER
I ['a'][]> but was:<...GE SCAN OVER I ['a'][
    SERVER FILTER BY FIRST KEY ONLY]>



Tests run: 733, Failures: 6, Errors: 0, Skipped: 0

[INFO] 
[INFO] --- maven-failsafe-plugin:2.18:integration-test (NeedTheirOwnClusterTests) @ phoenix-core
---
[INFO] Failsafe report directory: <https://builds.apache.org/job/Phoenix-master/ws/phoenix-core/target/failsafe-reports>
[INFO] parallel='none', perCoreThreadCount=true, threadCount=0, useUnlimitedThreads=false,
threadCountSuites=0, threadCountClasses=0, threadCountMethods=0, parallelOptimized=true

-------------------------------------------------------
 T E S T S
-------------------------------------------------------
Running org.apache.phoenix.end2end.index.MutableIndexFailureIT
Running org.apache.phoenix.end2end.index.DropIndexDuringUpsertIT
Tests run: 1, Failures: 0, Errors: 0, Skipped: 1, Time elapsed: 0 sec - in org.apache.phoenix.end2end.index.DropIndexDuringUpsertIT
Running org.apache.phoenix.end2end.QueryTimeoutIT
Running org.apache.phoenix.end2end.ViewIT
Running org.apache.phoenix.end2end.TenantSpecificTablesDMLIT
Running org.apache.phoenix.end2end.index.MutableIndexReplicationIT
Tests run: 1, Failures: 0, Errors: 0, Skipped: 0, Time elapsed: 17.181 sec - in org.apache.phoenix.end2end.QueryTimeoutIT
Tests run: 1, Failures: 0, Errors: 0, Skipped: 0, Time elapsed: 19.304 sec - in org.apache.phoenix.end2end.index.MutableIndexReplicationIT
Tests run: 12, Failures: 0, Errors: 0, Skipped: 0, Time elapsed: 26.268 sec - in org.apache.phoenix.end2end.ViewIT
Tests run: 16, Failures: 0, Errors: 0, Skipped: 0, Time elapsed: 28.081 sec - in org.apache.phoenix.end2end.TenantSpecificTablesDMLIT
Running org.apache.phoenix.end2end.QueryWithLimitIT
Tests run: 2, Failures: 0, Errors: 0, Skipped: 0, Time elapsed: 8.591 sec - in org.apache.phoenix.end2end.QueryWithLimitIT
Running org.apache.phoenix.end2end.KeyOnlyIT
Running org.apache.phoenix.end2end.StatsCollectorIT
Running org.apache.phoenix.end2end.ContextClassloaderIT
Tests run: 3, Failures: 0, Errors: 0, Skipped: 0, Time elapsed: 10.362 sec - in org.apache.phoenix.end2end.KeyOnlyIT
Tests run: 3, Failures: 0, Errors: 0, Skipped: 0, Time elapsed: 7.112 sec - in org.apache.phoenix.end2end.ContextClassloaderIT
Running org.apache.phoenix.end2end.MultiCfQueryExecIT
Running org.apache.phoenix.end2end.SaltedViewIT
Running org.apache.phoenix.end2end.AlterTableIT
Tests run: 7, Failures: 0, Errors: 0, Skipped: 0, Time elapsed: 18.333 sec - in org.apache.phoenix.end2end.MultiCfQueryExecIT
Tests run: 2, Failures: 0, Errors: 0, Skipped: 0, Time elapsed: 10.209 sec - in org.apache.phoenix.end2end.SaltedViewIT
Running org.apache.phoenix.end2end.TenantSpecificTablesDDLIT
Running org.apache.phoenix.end2end.CountDistinctCompressionIT
Tests run: 4, Failures: 0, Errors: 0, Skipped: 0, Time elapsed: 58.179 sec - in org.apache.phoenix.end2end.StatsCollectorIT
Tests run: 1, Failures: 0, Errors: 0, Skipped: 0, Time elapsed: 8.461 sec - in org.apache.phoenix.end2end.CountDistinctCompressionIT
Running org.apache.phoenix.end2end.SpillableGroupByIT
Running org.apache.phoenix.end2end.StatsCollectorWithSplitsAndMultiCFIT
Tests run: 18, Failures: 0, Errors: 0, Skipped: 0, Time elapsed: 29.646 sec - in org.apache.phoenix.end2end.TenantSpecificTablesDDLIT
Tests run: 1, Failures: 0, Errors: 0, Skipped: 0, Time elapsed: 10.216 sec - in org.apache.phoenix.end2end.SpillableGroupByIT
Running org.apache.phoenix.end2end.ParallelIteratorsIT
Tests run: 3, Failures: 0, Errors: 0, Skipped: 0, Time elapsed: 171.536 sec - in org.apache.phoenix.end2end.index.MutableIndexFailureIT
Running org.apache.phoenix.hbase.index.FailForUnsupportedHBaseVersionsIT
Tests run: 2, Failures: 0, Errors: 0, Skipped: 0, Time elapsed: 30.916 sec - in org.apache.phoenix.end2end.StatsCollectorWithSplitsAndMultiCFIT
Tests run: 2, Failures: 0, Errors: 0, Skipped: 0, Time elapsed: 11.176 sec - in org.apache.phoenix.end2end.ParallelIteratorsIT
Running org.apache.phoenix.hbase.index.covered.example.EndToEndCoveredIndexingIT
Running org.apache.phoenix.hbase.index.covered.example.EndtoEndIndexingWithCompressionIT
Tests run: 2, Failures: 0, Errors: 0, Skipped: 0, Time elapsed: 16.682 sec - in org.apache.phoenix.hbase.index.FailForUnsupportedHBaseVersionsIT
Running org.apache.phoenix.mapreduce.CsvBulkLoadToolIT
Running org.apache.phoenix.hbase.index.covered.example.FailWithoutRetriesIT
Tests run: 1, Failures: 0, Errors: 0, Skipped: 0, Time elapsed: 8.365 sec - in org.apache.phoenix.hbase.index.covered.example.FailWithoutRetriesIT
Running org.apache.phoenix.hbase.index.covered.EndToEndCoveredColumnsIndexBuilderIT
Tests run: 2, Failures: 0, Errors: 0, Skipped: 0, Time elapsed: 7.828 sec - in org.apache.phoenix.hbase.index.covered.EndToEndCoveredColumnsIndexBuilderIT
Running org.apache.phoenix.hbase.index.balancer.IndexLoadBalancerIT
Tests run: 11, Failures: 0, Errors: 0, Skipped: 0, Time elapsed: 48.333 sec - in org.apache.phoenix.hbase.index.covered.example.EndtoEndIndexingWithCompressionIT
Running org.apache.hadoop.hbase.regionserver.wal.WALReplayWithIndexWritesAndCompressedWALIT
Tests run: 11, Failures: 0, Errors: 0, Skipped: 0, Time elapsed: 57.946 sec - in org.apache.phoenix.hbase.index.covered.example.EndToEndCoveredIndexingIT
Running org.apache.hadoop.hbase.regionserver.wal.WALReplayWithIndexWritesAndUncompressedWALInHBase_094_9_IT
Tests run: 1, Failures: 0, Errors: 0, Skipped: 0, Time elapsed: 17.182 sec - in org.apache.hadoop.hbase.regionserver.wal.WALReplayWithIndexWritesAndCompressedWALIT
Tests run: 1, Failures: 0, Errors: 0, Skipped: 0, Time elapsed: 16.035 sec - in org.apache.hadoop.hbase.regionserver.wal.WALReplayWithIndexWritesAndUncompressedWALInHBase_094_9_IT
Tests run: 51, Failures: 0, Errors: 0, Skipped: 0, Time elapsed: 260.483 sec - in org.apache.phoenix.end2end.AlterTableIT
Tests run: 4, Failures: 0, Errors: 0, Skipped: 0, Time elapsed: 174.447 sec - in org.apache.phoenix.mapreduce.CsvBulkLoadToolIT
Tests run: 9, Failures: 0, Errors: 0, Skipped: 0, Time elapsed: 141.723 sec - in org.apache.phoenix.hbase.index.balancer.IndexLoadBalancerIT

Results :




Tests run: 172, Failures: 0, Errors: 0, Skipped: 1

[INFO] 
[INFO] --- maven-failsafe-plugin:2.18:verify (ClientManagedTimeTests) @ phoenix-core ---
[INFO] Failsafe report directory: <https://builds.apache.org/job/Phoenix-master/ws/phoenix-core/target/failsafe-reports>
[INFO] ------------------------------------------------------------------------
[INFO] Reactor Summary:
[INFO] 
[INFO] Apache Phoenix .................................... SUCCESS [2.946s]
[INFO] Phoenix Core ...................................... FAILURE [18:13.774s]
[INFO] Phoenix - Flume ................................... SKIPPED
[INFO] Phoenix - Pig ..................................... SKIPPED
[INFO] Phoenix Assembly .................................. SKIPPED
[INFO] ------------------------------------------------------------------------
[INFO] BUILD FAILURE
[INFO] ------------------------------------------------------------------------
[INFO] Total time: 18:17.148s
[INFO] Finished at: Tue Jan 20 05:11:34 UTC 2015
[INFO] Final Memory: 47M/908M
[INFO] ------------------------------------------------------------------------
[ERROR] Failed to execute goal org.apache.maven.plugins:maven-failsafe-plugin:2.18:verify
(ClientManagedTimeTests) on project phoenix-core: There are test failures.
[ERROR] 
[ERROR] Please refer to <https://builds.apache.org/job/Phoenix-master/ws/phoenix-core/target/failsafe-reports>
for the individual test results.
[ERROR] -> [Help 1]
[ERROR] 
[ERROR] To see the full stack trace of the errors, re-run Maven with the -e switch.
[ERROR] Re-run Maven using the -X switch to enable full debug logging.
[ERROR] 
[ERROR] For more information about the errors and possible solutions, please read the following
articles:
[ERROR] [Help 1] http://cwiki.apache.org/confluence/display/MAVEN/MojoFailureException
[ERROR] 
[ERROR] After correcting the problems, you can resume the build with the command
[ERROR]   mvn <goals> -rf :phoenix-core
Build step 'Invoke top-level Maven targets' marked build as failure
Archiving artifacts
Sending artifact delta relative to Phoenix | Master #556
Archived 791 artifacts
Archive block size is 32768
Received 5228 blocks and 405264869 bytes
Compression is 29.7%
Took 2 min 0 sec
Updating PHOENIX-1594
Updating PHOENIX-1582
Recording test results

Mime
View raw message