phoenix-commits mailing list archives

Site index · List index
Message view « Date » · « Thread »
Top « Date » · « Thread »
From Apache Jenkins Server <jenk...@builds.apache.org>
Subject Build failed in Jenkins: Phoenix | Master #403
Date Mon, 06 Oct 2014 18:41:56 GMT
See <https://builds.apache.org/job/Phoenix-master/403/changes>

Changes:

[jyates] PHOENIX-1289 Drop index during upsert may abort RS (daniel meng + jyates)

------------------------------------------
[...truncated 507 lines...]
Tests run: 48, Failures: 0, Errors: 0, Skipped: 0, Time elapsed: 27.255 sec - in org.apache.phoenix.end2end.ArrayIT
Running org.apache.phoenix.end2end.StddevIT
Tests run: 4, Failures: 0, Errors: 0, Skipped: 0, Time elapsed: 4.559 sec - in org.apache.phoenix.end2end.StddevIT
Running org.apache.phoenix.end2end.MultiCfQueryExecIT
Tests run: 7, Failures: 0, Errors: 0, Skipped: 0, Time elapsed: 8.866 sec - in org.apache.phoenix.end2end.MultiCfQueryExecIT
Running org.apache.phoenix.end2end.NotQueryIT
Tests run: 34, Failures: 0, Errors: 0, Skipped: 0, Time elapsed: 29.095 sec - in org.apache.phoenix.end2end.RowValueConstructorIT
Running org.apache.phoenix.end2end.IsNullIT
Tests run: 2, Failures: 0, Errors: 0, Skipped: 0, Time elapsed: 4.784 sec - in org.apache.phoenix.end2end.IsNullIT
Running org.apache.phoenix.end2end.PercentileIT
Tests run: 17, Failures: 0, Errors: 0, Skipped: 0, Time elapsed: 10.456 sec - in org.apache.phoenix.end2end.PercentileIT
Running org.apache.phoenix.end2end.DistinctCountIT
Tests run: 10, Failures: 0, Errors: 0, Skipped: 0, Time elapsed: 9.661 sec - in org.apache.phoenix.end2end.DistinctCountIT
Running org.apache.phoenix.end2end.InMemoryOrderByIT
Tests run: 2, Failures: 0, Errors: 0, Skipped: 0, Time elapsed: 3.089 sec - in org.apache.phoenix.end2end.InMemoryOrderByIT
Running org.apache.phoenix.end2end.SkipRangeParallelIteratorRegionSplitterIT
Tests run: 8, Failures: 0, Errors: 0, Skipped: 8, Time elapsed: 0.128 sec - in org.apache.phoenix.end2end.SkipRangeParallelIteratorRegionSplitterIT
Tests run: 119, Failures: 0, Errors: 0, Skipped: 0, Time elapsed: 105.201 sec - in org.apache.phoenix.end2end.ScanQueryIT
Tests run: 203, Failures: 0, Errors: 0, Skipped: 0, Time elapsed: 170.724 sec - in org.apache.phoenix.end2end.ClientTimeArithmeticQueryIT
Tests run: 77, Failures: 0, Errors: 0, Skipped: 0, Time elapsed: 70.705 sec - in org.apache.phoenix.end2end.NotQueryIT
Tests run: 182, Failures: 0, Errors: 0, Skipped: 0, Time elapsed: 208.946 sec - in org.apache.phoenix.end2end.QueryIT

Results :

Tests run: 1266, Failures: 0, Errors: 0, Skipped: 8

[INFO] 
[INFO] --- maven-failsafe-plugin:2.17:integration-test (HBaseManagedTimeTests) @ phoenix-core
---
[INFO] Failsafe report directory: <https://builds.apache.org/job/Phoenix-master/ws/phoenix-core/target/failsafe-reports>
[INFO] parallel='none', perCoreThreadCount=true, threadCount=0, useUnlimitedThreads=false,
threadCountSuites=0, threadCountClasses=0, threadCountMethods=0, parallelOptimized=true

-------------------------------------------------------
 T E S T S
-------------------------------------------------------

-------------------------------------------------------
 T E S T S
-------------------------------------------------------
Running org.apache.phoenix.trace.PhoenixTraceReaderIT
Running org.apache.phoenix.end2end.SpillableGroupByIT
Tests run: 2, Failures: 0, Errors: 0, Skipped: 0, Time elapsed: 2.276 sec - in org.apache.phoenix.trace.PhoenixTraceReaderIT
Running org.apache.phoenix.end2end.CSVCommonsLoaderIT
Running org.apache.phoenix.trace.PhoenixTableMetricsWriterIT
Running org.apache.phoenix.trace.PhoenixTracingEndToEndIT
Running org.apache.phoenix.end2end.EncodeFunctionIT
Tests run: 2, Failures: 0, Errors: 0, Skipped: 0, Time elapsed: 1.564 sec - in org.apache.phoenix.trace.PhoenixTableMetricsWriterIT
Running org.apache.phoenix.end2end.ParallelIteratorsIT
Tests run: 1, Failures: 0, Errors: 0, Skipped: 0, Time elapsed: 5.464 sec - in org.apache.phoenix.end2end.SpillableGroupByIT
Running org.apache.phoenix.end2end.SkipScanAfterManualSplitIT
Tests run: 6, Failures: 0, Errors: 0, Skipped: 0, Time elapsed: 8.268 sec - in org.apache.phoenix.end2end.EncodeFunctionIT
Running org.apache.phoenix.end2end.TenantSpecificViewIndexSaltedIT
Tests run: 2, Failures: 0, Errors: 0, Skipped: 0, Time elapsed: 9.787 sec - in org.apache.phoenix.end2end.ParallelIteratorsIT
Running org.apache.phoenix.end2end.EvaluationOfORIT
Tests run: 1, Failures: 0, Errors: 0, Skipped: 0, Time elapsed: 3.21 sec - in org.apache.phoenix.end2end.EvaluationOfORIT
Running org.apache.phoenix.end2end.index.SaltedIndexIT
Tests run: 14, Failures: 0, Errors: 0, Skipped: 0, Time elapsed: 18.835 sec - in org.apache.phoenix.end2end.CSVCommonsLoaderIT
Running org.apache.phoenix.end2end.index.DropViewIT
Tests run: 1, Failures: 0, Errors: 0, Skipped: 0, Time elapsed: 3.729 sec - in org.apache.phoenix.end2end.index.DropViewIT
Tests run: 4, Failures: 0, Errors: 0, Skipped: 0, Time elapsed: 14.352 sec - in org.apache.phoenix.end2end.TenantSpecificViewIndexSaltedIT
Running org.apache.phoenix.end2end.index.ViewIndexIT
Running org.apache.phoenix.end2end.index.LocalIndexIT
Tests run: 1, Failures: 0, Errors: 0, Skipped: 0, Time elapsed: 4.294 sec - in org.apache.phoenix.end2end.index.ViewIndexIT
Running org.apache.phoenix.end2end.index.IndexMetadataIT
Tests run: 3, Failures: 0, Errors: 0, Skipped: 0, Time elapsed: 30.122 sec - in org.apache.phoenix.end2end.SkipScanAfterManualSplitIT
Running org.apache.phoenix.end2end.index.MutableIndexIT
Tests run: 3, Failures: 0, Errors: 0, Skipped: 0, Time elapsed: 21.284 sec - in org.apache.phoenix.end2end.index.SaltedIndexIT
Running org.apache.phoenix.end2end.index.ImmutableIndexIT
Tests run: 4, Failures: 0, Errors: 0, Skipped: 0, Time elapsed: 19.774 sec - in org.apache.phoenix.end2end.index.IndexMetadataIT
Running org.apache.phoenix.end2end.BinaryRowKeyIT
Tests run: 3, Failures: 0, Errors: 0, Skipped: 0, Time elapsed: 2.113 sec - in org.apache.phoenix.end2end.BinaryRowKeyIT
Running org.apache.phoenix.end2end.DynamicFamilyIT
Tests run: 13, Failures: 0, Errors: 0, Skipped: 0, Time elapsed: 17.105 sec - in org.apache.phoenix.end2end.index.ImmutableIndexIT
Tests run: 4, Failures: 0, Errors: 0, Skipped: 0, Time elapsed: 4.17 sec - in org.apache.phoenix.end2end.DynamicFamilyIT
Running org.apache.phoenix.end2end.AlterTableIT
Running org.apache.phoenix.end2end.ViewIT
Tests run: 11, Failures: 0, Errors: 0, Skipped: 0, Time elapsed: 19.302 sec - in org.apache.phoenix.end2end.ViewIT
Running org.apache.phoenix.end2end.NthValueFunctionIT
Tests run: 5, Failures: 0, Errors: 0, Skipped: 0, Time elapsed: 4.721 sec - in org.apache.phoenix.end2end.NthValueFunctionIT
Running org.apache.phoenix.end2end.SkipScanQueryIT
Tests run: 16, Failures: 0, Errors: 0, Skipped: 0, Time elapsed: 27.83 sec - in org.apache.phoenix.end2end.AlterTableIT
Running org.apache.phoenix.end2end.InListIT
Tests run: 8, Failures: 0, Errors: 0, Skipped: 0, Time elapsed: 10.198 sec - in org.apache.phoenix.end2end.SkipScanQueryIT
Running org.apache.phoenix.end2end.StatsCollectorIT
Tests run: 2, Failures: 0, Errors: 0, Skipped: 0, Time elapsed: 6.699 sec - in org.apache.phoenix.end2end.StatsCollectorIT
Running org.apache.phoenix.end2end.ReadOnlyIT
Tests run: 1, Failures: 0, Errors: 0, Skipped: 0, Time elapsed: 1.724 sec - in org.apache.phoenix.end2end.ReadOnlyIT
Running org.apache.phoenix.end2end.DeleteIT
Tests run: 16, Failures: 0, Errors: 0, Skipped: 1, Time elapsed: 75.452 sec - in org.apache.phoenix.end2end.index.LocalIndexIT
Running org.apache.phoenix.end2end.ModulusExpressionIT
Tests run: 11, Failures: 0, Errors: 0, Skipped: 0, Time elapsed: 4.819 sec - in org.apache.phoenix.end2end.ModulusExpressionIT
Running org.apache.phoenix.end2end.PhoenixEncodeDecodeIT
Tests run: 5, Failures: 0, Errors: 0, Skipped: 0, Time elapsed: 7.919 sec - in org.apache.phoenix.end2end.PhoenixEncodeDecodeIT
Running org.apache.phoenix.end2end.DecodeFunctionIT
Tests run: 5, Failures: 1, Errors: 0, Skipped: 0, Time elapsed: 104.847 sec <<< FAILURE!
- in org.apache.phoenix.trace.PhoenixTracingEndToEndIT
testCustomAnnotationTracing(org.apache.phoenix.trace.PhoenixTracingEndToEndIT)  Time elapsed:
39.292 sec  <<< FAILURE!
java.lang.AssertionError: Didn't find the custom annotation in the tracing
	at org.junit.Assert.fail(Assert.java:88)
	at org.junit.Assert.assertTrue(Assert.java:41)
	at org.apache.phoenix.trace.PhoenixTracingEndToEndIT.assertAnnotationPresent(PhoenixTracingEndToEndIT.java:415)
	at org.apache.phoenix.trace.PhoenixTracingEndToEndIT.testCustomAnnotationTracing(PhoenixTracingEndToEndIT.java:402)

Running org.apache.phoenix.end2end.MD5FunctionIT
Tests run: 6, Failures: 0, Errors: 0, Skipped: 0, Time elapsed: 3.018 sec - in org.apache.phoenix.end2end.DecodeFunctionIT
Running org.apache.phoenix.end2end.UpsertSelectAutoCommitIT
Tests run: 2, Failures: 0, Errors: 0, Skipped: 0, Time elapsed: 3.639 sec - in org.apache.phoenix.end2end.MD5FunctionIT
Running org.apache.phoenix.end2end.ExecuteStatementsIT
Tests run: 20, Failures: 0, Errors: 0, Skipped: 0, Time elapsed: 21.034 sec - in org.apache.phoenix.end2end.DeleteIT
Running org.apache.phoenix.end2end.HashJoinIT
Tests run: 3, Failures: 0, Errors: 0, Skipped: 0, Time elapsed: 11.682 sec - in org.apache.phoenix.end2end.UpsertSelectAutoCommitIT
Running org.apache.phoenix.end2end.TenantSpecificViewIndexIT
Tests run: 2, Failures: 0, Errors: 0, Skipped: 0, Time elapsed: 10.466 sec - in org.apache.phoenix.end2end.ExecuteStatementsIT
Running org.apache.phoenix.end2end.CoalesceFunctionIT
Tests run: 10, Failures: 0, Errors: 0, Skipped: 0, Time elapsed: 7.633 sec - in org.apache.phoenix.end2end.CoalesceFunctionIT
Running org.apache.phoenix.end2end.TimezoneOffsetFunctionIT
Tests run: 6, Failures: 0, Errors: 0, Skipped: 0, Time elapsed: 3.067 sec - in org.apache.phoenix.end2end.TimezoneOffsetFunctionIT
Running org.apache.phoenix.end2end.SubqueryIT
Tests run: 26, Failures: 0, Errors: 0, Skipped: 0, Time elapsed: 105.526 sec - in org.apache.phoenix.end2end.index.MutableIndexIT
Running org.apache.phoenix.end2end.ArithmeticQueryIT
Tests run: 6, Failures: 0, Errors: 0, Skipped: 0, Time elapsed: 14.635 sec - in org.apache.phoenix.end2end.TenantSpecificViewIndexIT
Running org.apache.phoenix.end2end.ReverseFunctionIT
Tests run: 5, Failures: 0, Errors: 0, Skipped: 0, Time elapsed: 2.885 sec - in org.apache.phoenix.end2end.ReverseFunctionIT
Running org.apache.phoenix.end2end.RegexpSplitFunctionIT
Tests run: 11, Failures: 0, Errors: 0, Skipped: 0, Time elapsed: 3.787 sec - in org.apache.phoenix.end2end.RegexpSplitFunctionIT
Running org.apache.phoenix.end2end.SaltedViewIT
Tests run: 20, Failures: 0, Errors: 0, Skipped: 0, Time elapsed: 16.813 sec - in org.apache.phoenix.end2end.ArithmeticQueryIT
Running org.apache.phoenix.end2end.FirstValueFunctionIT
Tests run: 2, Failures: 0, Errors: 0, Skipped: 0, Time elapsed: 8.126 sec - in org.apache.phoenix.end2end.SaltedViewIT
Running org.apache.phoenix.end2end.QueryExecWithoutSCNIT
Tests run: 7, Failures: 0, Errors: 0, Skipped: 0, Time elapsed: 3.892 sec - in org.apache.phoenix.end2end.FirstValueFunctionIT
Running org.apache.phoenix.end2end.ConvertTimezoneFunctionIT
Tests run: 1, Failures: 0, Errors: 0, Skipped: 0, Time elapsed: 4.064 sec - in org.apache.phoenix.end2end.QueryExecWithoutSCNIT
Running org.apache.phoenix.end2end.StatementHintsIT
Tests run: 2, Failures: 0, Errors: 0, Skipped: 0, Time elapsed: 2.453 sec - in org.apache.phoenix.end2end.StatementHintsIT
Tests run: 6, Failures: 0, Errors: 0, Skipped: 0, Time elapsed: 2.976 sec - in org.apache.phoenix.end2end.ConvertTimezoneFunctionIT
Running org.apache.phoenix.end2end.UpsertBigValuesIT
Running org.apache.phoenix.end2end.salted.SaltedTableUpsertSelectIT
Tests run: 4, Failures: 0, Errors: 0, Skipped: 0, Time elapsed: 7.66 sec - in org.apache.phoenix.end2end.UpsertBigValuesIT
Running org.apache.phoenix.end2end.salted.SaltedTableVarLengthRowKeyIT
Tests run: 1, Failures: 0, Errors: 0, Skipped: 0, Time elapsed: 2.008 sec - in org.apache.phoenix.end2end.salted.SaltedTableVarLengthRowKeyIT
Running org.apache.phoenix.end2end.SortOrderFIT
Tests run: 5, Failures: 0, Errors: 0, Skipped: 0, Time elapsed: 10.139 sec - in org.apache.phoenix.end2end.salted.SaltedTableUpsertSelectIT
Running org.apache.phoenix.end2end.QueryMoreIT
Tests run: 9, Failures: 0, Errors: 0, Skipped: 0, Time elapsed: 36.031 sec - in org.apache.phoenix.end2end.SubqueryIT
Running org.apache.phoenix.end2end.ReverseScanIT
Tests run: 25, Failures: 0, Errors: 0, Skipped: 0, Time elapsed: 95.745 sec - in org.apache.phoenix.end2end.InListIT
Running org.apache.phoenix.end2end.RegexpSubstrFunctionIT
Tests run: 2, Failures: 0, Errors: 0, Skipped: 0, Time elapsed: 3.491 sec - in org.apache.phoenix.end2end.ReverseScanIT
Running org.apache.phoenix.end2end.ServerExceptionIT
Tests run: 2, Failures: 0, Errors: 0, Skipped: 0, Time elapsed: 2.009 sec - in org.apache.phoenix.end2end.RegexpSubstrFunctionIT
Running org.apache.phoenix.end2end.AutoCommitIT
Tests run: 1, Failures: 0, Errors: 0, Skipped: 0, Time elapsed: 2.829 sec - in org.apache.phoenix.end2end.ServerExceptionIT
Running org.apache.phoenix.end2end.LastValueFunctionIT
Tests run: 1, Failures: 0, Errors: 0, Skipped: 0, Time elapsed: 2.114 sec - in org.apache.phoenix.end2end.AutoCommitIT
Running org.apache.phoenix.end2end.RoundFloorCeilFunctionsEnd2EndIT
Tests run: 30, Failures: 0, Errors: 0, Skipped: 0, Time elapsed: 8.011 sec - in org.apache.phoenix.end2end.SortOrderFIT
Running org.apache.phoenix.end2end.LpadFunctionIT
Tests run: 11, Failures: 0, Errors: 0, Skipped: 0, Time elapsed: 5.699 sec - in org.apache.phoenix.end2end.LastValueFunctionIT
Tests run: 30, Failures: 0, Errors: 0, Skipped: 0, Time elapsed: 7.41 sec - in org.apache.phoenix.end2end.RoundFloorCeilFunctionsEnd2EndIT
Tests run: 10, Failures: 0, Errors: 0, Skipped: 0, Time elapsed: 8.529 sec - in org.apache.phoenix.end2end.LpadFunctionIT
Tests run: 4, Failures: 0, Errors: 0, Skipped: 0, Time elapsed: 33.981 sec - in org.apache.phoenix.end2end.QueryMoreIT
Tests run: 96, Failures: 0, Errors: 0, Skipped: 0, Time elapsed: 126.549 sec - in org.apache.phoenix.end2end.HashJoinIT

Results :

Failed tests: 
  PhoenixTracingEndToEndIT.testCustomAnnotationTracing:402->assertAnnotationPresent:415
Didn't find the custom annotation in the tracing

Tests run: 510, Failures: 1, Errors: 0, Skipped: 1

[INFO] 
[INFO] --- maven-failsafe-plugin:2.17:integration-test (NeedTheirOwnClusterTests) @ phoenix-core
---
[INFO] Failsafe report directory: <https://builds.apache.org/job/Phoenix-master/ws/phoenix-core/target/failsafe-reports>
[INFO] parallel='none', perCoreThreadCount=true, threadCount=0, useUnlimitedThreads=false,
threadCountSuites=0, threadCountClasses=0, threadCountMethods=0, parallelOptimized=true

-------------------------------------------------------
 T E S T S
-------------------------------------------------------

-------------------------------------------------------
 T E S T S
-------------------------------------------------------
Running org.apache.phoenix.hbase.index.covered.example.EndtoEndIndexingWithCompressionIT
Running org.apache.phoenix.hbase.index.covered.example.FailWithoutRetriesIT
Running org.apache.phoenix.hbase.index.covered.example.EndToEndCoveredIndexingIT
Running org.apache.phoenix.hbase.index.covered.EndToEndCoveredColumnsIndexBuilderIT
Running org.apache.phoenix.hbase.index.balancer.IndexLoadBalancerIT
Tests run: 1, Failures: 0, Errors: 0, Skipped: 0, Time elapsed: 7.734 sec - in org.apache.phoenix.hbase.index.covered.example.FailWithoutRetriesIT
Running org.apache.phoenix.hbase.index.FailForUnsupportedHBaseVersionsIT
Tests run: 2, Failures: 0, Errors: 0, Skipped: 0, Time elapsed: 7.781 sec - in org.apache.phoenix.hbase.index.covered.EndToEndCoveredColumnsIndexBuilderIT
Running org.apache.phoenix.end2end.index.MutableIndexFailureIT
Tests run: 2, Failures: 0, Errors: 0, Skipped: 0, Time elapsed: 16.311 sec - in org.apache.phoenix.hbase.index.FailForUnsupportedHBaseVersionsIT
Running org.apache.phoenix.end2end.index.DropIndexDuringUpsertIT
Tests run: 11, Failures: 0, Errors: 0, Skipped: 0, Time elapsed: 47.161 sec - in org.apache.phoenix.hbase.index.covered.example.EndtoEndIndexingWithCompressionIT
Tests run: 11, Failures: 0, Errors: 0, Skipped: 0, Time elapsed: 48.236 sec - in org.apache.phoenix.hbase.index.covered.example.EndToEndCoveredIndexingIT
Running org.apache.phoenix.end2end.ContextClassloaderIT
Tests run: 3, Failures: 0, Errors: 0, Skipped: 0, Time elapsed: 2.61 sec - in org.apache.phoenix.end2end.ContextClassloaderIT
Running org.apache.phoenix.mapreduce.CsvBulkLoadToolIT
Tests run: 9, Failures: 0, Errors: 0, Skipped: 0, Time elapsed: 121.8 sec - in org.apache.phoenix.hbase.index.balancer.IndexLoadBalancerIT
Tests run: 1, Failures: 0, Errors: 0, Skipped: 0, Time elapsed: 116.969 sec - in org.apache.phoenix.end2end.index.DropIndexDuringUpsertIT
Tests run: 3, Failures: 0, Errors: 0, Skipped: 0, Time elapsed: 151.664 sec - in org.apache.phoenix.end2end.index.MutableIndexFailureIT
Tests run: 4, Failures: 0, Errors: 0, Skipped: 0, Time elapsed: 177.491 sec - in org.apache.phoenix.mapreduce.CsvBulkLoadToolIT

Results :

Tests run: 47, Failures: 0, Errors: 0, Skipped: 0

[INFO] 
[INFO] --- maven-failsafe-plugin:2.17:verify (ClientManagedTimeTests) @ phoenix-core ---
[INFO] Failsafe report directory: <https://builds.apache.org/job/Phoenix-master/ws/phoenix-core/target/failsafe-reports>
[INFO] ------------------------------------------------------------------------
[INFO] Reactor Summary:
[INFO] 
[INFO] Apache Phoenix .................................... SUCCESS [2.837s]
[INFO] Phoenix Hadoop Compatibility ...................... SUCCESS [3.886s]
[INFO] Phoenix Hadoop2 Compatibility ..................... SUCCESS [3.697s]
[INFO] Phoenix Core ...................................... FAILURE [14:53.504s]
[INFO] Phoenix - Flume ................................... SKIPPED
[INFO] Phoenix - Pig ..................................... SKIPPED
[INFO] Phoenix Assembly .................................. SKIPPED
[INFO] ------------------------------------------------------------------------
[INFO] BUILD FAILURE
[INFO] ------------------------------------------------------------------------
[INFO] Total time: 15:04.590s
[INFO] Finished at: Mon Oct 06 18:39:14 UTC 2014
[INFO] Final Memory: 49M/1039M
[INFO] ------------------------------------------------------------------------
[ERROR] Failed to execute goal org.apache.maven.plugins:maven-failsafe-plugin:2.17:verify
(ClientManagedTimeTests) on project phoenix-core: There are test failures.
[ERROR] 
[ERROR] Please refer to <https://builds.apache.org/job/Phoenix-master/ws/phoenix-core/target/failsafe-reports>
for the individual test results.
[ERROR] -> [Help 1]
[ERROR] 
[ERROR] To see the full stack trace of the errors, re-run Maven with the -e switch.
[ERROR] Re-run Maven using the -X switch to enable full debug logging.
[ERROR] 
[ERROR] For more information about the errors and possible solutions, please read the following
articles:
[ERROR] [Help 1] http://cwiki.apache.org/confluence/display/MAVEN/MojoFailureException
[ERROR] 
[ERROR] After correcting the problems, you can resume the build with the command
[ERROR]   mvn <goals> -rf :phoenix-core
Build step 'Invoke top-level Maven targets' marked build as failure
Archiving artifacts
Sending artifact delta relative to Phoenix | Master #402
Archived 726 artifacts
Archive block size is 32768
Received 6143 blocks and 400181683 bytes
Compression is 33.5%
Took 2 min 14 sec
Updating PHOENIX-1289
Recording test results

Mime
View raw message