phoenix-commits mailing list archives

Site index · List index
Message view « Date » · « Thread »
Top « Date » · « Thread »
From Apache Jenkins Server <jenk...@builds.apache.org>
Subject Build failed in Jenkins: Phoenix | 4.0 #360
Date Mon, 06 Oct 2014 23:26:55 GMT
See <https://builds.apache.org/job/Phoenix-4.0/360/changes>

Changes:

[jtaylor] PHOENIX-1321 Cleanup setting of timestamps when collecting and using stats

------------------------------------------
[...truncated 527 lines...]
Running org.apache.phoenix.end2end.InMemoryOrderByIT
Tests run: 10, Failures: 0, Errors: 0, Skipped: 0, Time elapsed: 8.491 sec - in org.apache.phoenix.end2end.DistinctCountIT
Running org.apache.phoenix.end2end.SkipRangeParallelIteratorRegionSplitterIT
Tests run: 8, Failures: 0, Errors: 0, Skipped: 8, Time elapsed: 0.122 sec - in org.apache.phoenix.end2end.SkipRangeParallelIteratorRegionSplitterIT
Tests run: 2, Failures: 0, Errors: 0, Skipped: 0, Time elapsed: 2.767 sec - in org.apache.phoenix.end2end.InMemoryOrderByIT
Tests run: 203, Failures: 0, Errors: 0, Skipped: 0, Time elapsed: 133.193 sec - in org.apache.phoenix.end2end.ClientTimeArithmeticQueryIT
Tests run: 77, Failures: 0, Errors: 0, Skipped: 0, Time elapsed: 51.633 sec - in org.apache.phoenix.end2end.NotQueryIT
Tests run: 182, Failures: 0, Errors: 0, Skipped: 0, Time elapsed: 163.613 sec - in org.apache.phoenix.end2end.QueryIT

Results :

Failed tests: 
  TenantSpecificTablesDMLIT.testBasicUpsertSelect2:147 expected:<3> but was:<1>

Tests run: 1266, Failures: 1, Errors: 0, Skipped: 8

[INFO] 
[INFO] --- maven-failsafe-plugin:2.17:integration-test (HBaseManagedTimeTests) @ phoenix-core
---
[INFO] Failsafe report directory: <https://builds.apache.org/job/Phoenix-4.0/ws/phoenix-core/target/failsafe-reports>
[INFO] parallel='none', perCoreThreadCount=true, threadCount=0, useUnlimitedThreads=false,
threadCountSuites=0, threadCountClasses=0, threadCountMethods=0, parallelOptimized=true

-------------------------------------------------------
 T E S T S
-------------------------------------------------------

-------------------------------------------------------
 T E S T S
-------------------------------------------------------
Running org.apache.phoenix.trace.PhoenixTraceReaderIT
Running org.apache.phoenix.end2end.SpillableGroupByIT
Running org.apache.phoenix.end2end.EncodeFunctionIT
Running org.apache.phoenix.trace.PhoenixTableMetricsWriterIT
Tests run: 2, Failures: 0, Errors: 0, Skipped: 0, Time elapsed: 1.697 sec - in org.apache.phoenix.trace.PhoenixTraceReaderIT
Running org.apache.phoenix.trace.PhoenixTracingEndToEndIT
Running org.apache.phoenix.end2end.CSVCommonsLoaderIT
Tests run: 2, Failures: 0, Errors: 0, Skipped: 0, Time elapsed: 1.465 sec - in org.apache.phoenix.trace.PhoenixTableMetricsWriterIT
Running org.apache.phoenix.end2end.ParallelIteratorsIT
Tests run: 1, Failures: 0, Errors: 0, Skipped: 0, Time elapsed: 6.34 sec - in org.apache.phoenix.end2end.SpillableGroupByIT
Running org.apache.phoenix.end2end.SkipScanAfterManualSplitIT
Tests run: 6, Failures: 0, Errors: 0, Skipped: 0, Time elapsed: 9.492 sec - in org.apache.phoenix.end2end.EncodeFunctionIT
Running org.apache.phoenix.end2end.TenantSpecificViewIndexSaltedIT
Tests run: 2, Failures: 0, Errors: 0, Skipped: 0, Time elapsed: 8.162 sec - in org.apache.phoenix.end2end.ParallelIteratorsIT
Running org.apache.phoenix.end2end.EvaluationOfORIT
Tests run: 1, Failures: 0, Errors: 0, Skipped: 0, Time elapsed: 2.592 sec - in org.apache.phoenix.end2end.EvaluationOfORIT
Running org.apache.phoenix.end2end.index.SaltedIndexIT
Tests run: 14, Failures: 0, Errors: 0, Skipped: 0, Time elapsed: 19.307 sec - in org.apache.phoenix.end2end.CSVCommonsLoaderIT
Running org.apache.phoenix.end2end.index.DropViewIT
Tests run: 4, Failures: 0, Errors: 0, Skipped: 0, Time elapsed: 12.488 sec - in org.apache.phoenix.end2end.TenantSpecificViewIndexSaltedIT
Running org.apache.phoenix.end2end.index.ViewIndexIT
Tests run: 1, Failures: 0, Errors: 0, Skipped: 0, Time elapsed: 4.025 sec - in org.apache.phoenix.end2end.index.DropViewIT
Running org.apache.phoenix.end2end.index.LocalIndexIT
Tests run: 1, Failures: 0, Errors: 0, Skipped: 0, Time elapsed: 4.004 sec - in org.apache.phoenix.end2end.index.ViewIndexIT
Running org.apache.phoenix.end2end.index.IndexMetadataIT
Tests run: 3, Failures: 0, Errors: 0, Skipped: 0, Time elapsed: 18.665 sec - in org.apache.phoenix.end2end.index.SaltedIndexIT
Running org.apache.phoenix.end2end.index.MutableIndexIT
Tests run: 3, Failures: 0, Errors: 0, Skipped: 0, Time elapsed: 28.505 sec - in org.apache.phoenix.end2end.SkipScanAfterManualSplitIT
Running org.apache.phoenix.end2end.index.ImmutableIndexIT
Tests run: 4, Failures: 0, Errors: 0, Skipped: 0, Time elapsed: 18.88 sec - in org.apache.phoenix.end2end.index.IndexMetadataIT
Running org.apache.phoenix.end2end.BinaryRowKeyIT
Tests run: 3, Failures: 0, Errors: 0, Skipped: 0, Time elapsed: 3.346 sec - in org.apache.phoenix.end2end.BinaryRowKeyIT
Running org.apache.phoenix.end2end.DynamicFamilyIT
Tests run: 4, Failures: 0, Errors: 0, Skipped: 0, Time elapsed: 4.821 sec - in org.apache.phoenix.end2end.DynamicFamilyIT
Running org.apache.phoenix.end2end.AlterTableIT
Tests run: 13, Failures: 0, Errors: 0, Skipped: 0, Time elapsed: 19.804 sec - in org.apache.phoenix.end2end.index.ImmutableIndexIT
Running org.apache.phoenix.end2end.ViewIT
Tests run: 11, Failures: 0, Errors: 0, Skipped: 0, Time elapsed: 20.19 sec - in org.apache.phoenix.end2end.ViewIT
Running org.apache.phoenix.end2end.NthValueFunctionIT
Tests run: 5, Failures: 0, Errors: 0, Skipped: 0, Time elapsed: 4.518 sec - in org.apache.phoenix.end2end.NthValueFunctionIT
Running org.apache.phoenix.end2end.SkipScanQueryIT
Tests run: 16, Failures: 0, Errors: 0, Skipped: 0, Time elapsed: 29.729 sec - in org.apache.phoenix.end2end.AlterTableIT
Running org.apache.phoenix.end2end.InListIT
Tests run: 5, Failures: 0, Errors: 0, Skipped: 0, Time elapsed: 85.707 sec - in org.apache.phoenix.trace.PhoenixTracingEndToEndIT
Running org.apache.phoenix.end2end.StatsCollectorIT
Tests run: 8, Failures: 0, Errors: 0, Skipped: 0, Time elapsed: 9.342 sec - in org.apache.phoenix.end2end.SkipScanQueryIT
Running org.apache.phoenix.end2end.ReadOnlyIT
Tests run: 1, Failures: 0, Errors: 0, Skipped: 0, Time elapsed: 1.753 sec - in org.apache.phoenix.end2end.ReadOnlyIT
Running org.apache.phoenix.end2end.DeleteIT
Tests run: 2, Failures: 0, Errors: 0, Skipped: 0, Time elapsed: 7.953 sec - in org.apache.phoenix.end2end.StatsCollectorIT
Running org.apache.phoenix.end2end.ModulusExpressionIT
Tests run: 11, Failures: 0, Errors: 0, Skipped: 0, Time elapsed: 5.685 sec - in org.apache.phoenix.end2end.ModulusExpressionIT
Running org.apache.phoenix.end2end.PhoenixEncodeDecodeIT
Tests run: 16, Failures: 0, Errors: 0, Skipped: 1, Time elapsed: 77.492 sec - in org.apache.phoenix.end2end.index.LocalIndexIT
Running org.apache.phoenix.end2end.DecodeFunctionIT
Tests run: 6, Failures: 0, Errors: 0, Skipped: 0, Time elapsed: 2.732 sec - in org.apache.phoenix.end2end.DecodeFunctionIT
Running org.apache.phoenix.end2end.MD5FunctionIT
Tests run: 5, Failures: 0, Errors: 0, Skipped: 0, Time elapsed: 7.291 sec - in org.apache.phoenix.end2end.PhoenixEncodeDecodeIT
Running org.apache.phoenix.end2end.UpsertSelectAutoCommitIT
Tests run: 2, Failures: 0, Errors: 0, Skipped: 0, Time elapsed: 3.941 sec - in org.apache.phoenix.end2end.MD5FunctionIT
Running org.apache.phoenix.end2end.ExecuteStatementsIT
Tests run: 20, Failures: 0, Errors: 0, Skipped: 0, Time elapsed: 19.551 sec - in org.apache.phoenix.end2end.DeleteIT
Running org.apache.phoenix.end2end.HashJoinIT
Tests run: 2, Failures: 0, Errors: 0, Skipped: 0, Time elapsed: 9.937 sec - in org.apache.phoenix.end2end.ExecuteStatementsIT
Running org.apache.phoenix.end2end.TenantSpecificViewIndexIT
Tests run: 3, Failures: 0, Errors: 0, Skipped: 0, Time elapsed: 12.092 sec - in org.apache.phoenix.end2end.UpsertSelectAutoCommitIT
Running org.apache.phoenix.end2end.CoalesceFunctionIT
Tests run: 10, Failures: 0, Errors: 0, Skipped: 0, Time elapsed: 8.723 sec - in org.apache.phoenix.end2end.CoalesceFunctionIT
Running org.apache.phoenix.end2end.TimezoneOffsetFunctionIT
Tests run: 6, Failures: 0, Errors: 0, Skipped: 0, Time elapsed: 2.657 sec - in org.apache.phoenix.end2end.TimezoneOffsetFunctionIT
Running org.apache.phoenix.end2end.SubqueryIT
Tests run: 6, Failures: 0, Errors: 0, Skipped: 0, Time elapsed: 14.12 sec - in org.apache.phoenix.end2end.TenantSpecificViewIndexIT
Running org.apache.phoenix.end2end.ArithmeticQueryIT
Tests run: 28, Failures: 0, Errors: 0, Skipped: 0, Time elapsed: 114.554 sec - in org.apache.phoenix.end2end.index.MutableIndexIT
Running org.apache.phoenix.end2end.ReverseFunctionIT
Tests run: 20, Failures: 0, Errors: 0, Skipped: 0, Time elapsed: 14.691 sec - in org.apache.phoenix.end2end.ArithmeticQueryIT
Running org.apache.phoenix.end2end.RegexpSplitFunctionIT
Tests run: 5, Failures: 0, Errors: 0, Skipped: 0, Time elapsed: 2.585 sec - in org.apache.phoenix.end2end.ReverseFunctionIT
Running org.apache.phoenix.end2end.SaltedViewIT
Tests run: 11, Failures: 0, Errors: 0, Skipped: 0, Time elapsed: 3.481 sec - in org.apache.phoenix.end2end.RegexpSplitFunctionIT
Running org.apache.phoenix.end2end.FirstValueFunctionIT
Tests run: 7, Failures: 0, Errors: 0, Skipped: 0, Time elapsed: 3.397 sec - in org.apache.phoenix.end2end.FirstValueFunctionIT
Running org.apache.phoenix.end2end.QueryExecWithoutSCNIT
Tests run: 2, Failures: 0, Errors: 0, Skipped: 0, Time elapsed: 8.327 sec - in org.apache.phoenix.end2end.SaltedViewIT
Running org.apache.phoenix.end2end.ConvertTimezoneFunctionIT
Tests run: 1, Failures: 0, Errors: 0, Skipped: 0, Time elapsed: 2.54 sec - in org.apache.phoenix.end2end.QueryExecWithoutSCNIT
Running org.apache.phoenix.end2end.StatementHintsIT
Tests run: 6, Failures: 0, Errors: 0, Skipped: 0, Time elapsed: 3.086 sec - in org.apache.phoenix.end2end.ConvertTimezoneFunctionIT
Tests run: 2, Failures: 0, Errors: 0, Skipped: 0, Time elapsed: 2.51 sec - in org.apache.phoenix.end2end.StatementHintsIT
Running org.apache.phoenix.end2end.UpsertBigValuesIT
Running org.apache.phoenix.end2end.salted.SaltedTableUpsertSelectIT
Tests run: 9, Failures: 0, Errors: 0, Skipped: 0, Time elapsed: 34.94 sec - in org.apache.phoenix.end2end.SubqueryIT
Running org.apache.phoenix.end2end.salted.SaltedTableVarLengthRowKeyIT
Tests run: 1, Failures: 0, Errors: 0, Skipped: 0, Time elapsed: 2.976 sec - in org.apache.phoenix.end2end.salted.SaltedTableVarLengthRowKeyIT
Running org.apache.phoenix.end2end.SortOrderFIT
Tests run: 5, Failures: 0, Errors: 0, Skipped: 0, Time elapsed: 9.488 sec - in org.apache.phoenix.end2end.salted.SaltedTableUpsertSelectIT
Running org.apache.phoenix.end2end.QueryMoreIT
Tests run: 4, Failures: 0, Errors: 0, Skipped: 0, Time elapsed: 10.033 sec - in org.apache.phoenix.end2end.UpsertBigValuesIT
Running org.apache.phoenix.end2end.ReverseScanIT
Tests run: 2, Failures: 0, Errors: 0, Skipped: 0, Time elapsed: 3.138 sec - in org.apache.phoenix.end2end.ReverseScanIT
Running org.apache.phoenix.end2end.RegexpSubstrFunctionIT
Tests run: 30, Failures: 0, Errors: 0, Skipped: 0, Time elapsed: 6.744 sec - in org.apache.phoenix.end2end.SortOrderFIT
Running org.apache.phoenix.end2end.ServerExceptionIT
Tests run: 2, Failures: 0, Errors: 0, Skipped: 0, Time elapsed: 3.18 sec - in org.apache.phoenix.end2end.RegexpSubstrFunctionIT
Running org.apache.phoenix.end2end.AutoCommitIT
Tests run: 1, Failures: 0, Errors: 0, Skipped: 0, Time elapsed: 1.74 sec - in org.apache.phoenix.end2end.ServerExceptionIT
Running org.apache.phoenix.end2end.LastValueFunctionIT
Tests run: 25, Failures: 0, Errors: 0, Skipped: 0, Time elapsed: 96.249 sec - in org.apache.phoenix.end2end.InListIT
Running org.apache.phoenix.end2end.RoundFloorCeilFunctionsEnd2EndIT
Tests run: 1, Failures: 0, Errors: 0, Skipped: 0, Time elapsed: 2.335 sec - in org.apache.phoenix.end2end.AutoCommitIT
Running org.apache.phoenix.end2end.LpadFunctionIT
Tests run: 11, Failures: 0, Errors: 0, Skipped: 0, Time elapsed: 5.674 sec - in org.apache.phoenix.end2end.LastValueFunctionIT
Tests run: 10, Failures: 0, Errors: 0, Skipped: 0, Time elapsed: 6.313 sec - in org.apache.phoenix.end2end.LpadFunctionIT
Tests run: 30, Failures: 0, Errors: 0, Skipped: 0, Time elapsed: 8.112 sec - in org.apache.phoenix.end2end.RoundFloorCeilFunctionsEnd2EndIT
Tests run: 4, Failures: 0, Errors: 0, Skipped: 0, Time elapsed: 35.056 sec - in org.apache.phoenix.end2end.QueryMoreIT
Tests run: 96, Failures: 0, Errors: 0, Skipped: 0, Time elapsed: 103.44 sec - in org.apache.phoenix.end2end.HashJoinIT

Results :

Tests run: 512, Failures: 0, Errors: 0, Skipped: 1

[INFO] 
[INFO] --- maven-failsafe-plugin:2.17:integration-test (NeedTheirOwnClusterTests) @ phoenix-core
---
[INFO] Failsafe report directory: <https://builds.apache.org/job/Phoenix-4.0/ws/phoenix-core/target/failsafe-reports>
[INFO] parallel='none', perCoreThreadCount=true, threadCount=0, useUnlimitedThreads=false,
threadCountSuites=0, threadCountClasses=0, threadCountMethods=0, parallelOptimized=true

-------------------------------------------------------
 T E S T S
-------------------------------------------------------

-------------------------------------------------------
 T E S T S
-------------------------------------------------------
Running org.apache.phoenix.hbase.index.covered.example.EndToEndCoveredIndexingIT
Running org.apache.phoenix.hbase.index.covered.EndToEndCoveredColumnsIndexBuilderIT
Running org.apache.phoenix.hbase.index.covered.example.FailWithoutRetriesIT
Running org.apache.phoenix.hbase.index.covered.example.EndtoEndIndexingWithCompressionIT
Running org.apache.phoenix.hbase.index.balancer.IndexLoadBalancerIT
Tests run: 1, Failures: 0, Errors: 0, Skipped: 0, Time elapsed: 7.395 sec - in org.apache.phoenix.hbase.index.covered.example.FailWithoutRetriesIT
Running org.apache.phoenix.hbase.index.FailForUnsupportedHBaseVersionsIT
Tests run: 2, Failures: 0, Errors: 0, Skipped: 0, Time elapsed: 7.66 sec - in org.apache.phoenix.hbase.index.covered.EndToEndCoveredColumnsIndexBuilderIT
Tests run: 2, Failures: 0, Errors: 0, Skipped: 0, Time elapsed: 16.223 sec - in org.apache.phoenix.hbase.index.FailForUnsupportedHBaseVersionsIT
Running org.apache.phoenix.end2end.index.MutableIndexFailureIT
Running org.apache.phoenix.end2end.index.MutableIndexReplicationIT
Tests run: 1, Failures: 0, Errors: 0, Skipped: 0, Time elapsed: 8.402 sec - in org.apache.phoenix.end2end.index.MutableIndexReplicationIT
Running org.apache.phoenix.end2end.index.DropIndexDuringUpsertIT
Tests run: 1, Failures: 1, Errors: 0, Skipped: 0, Time elapsed: 16.764 sec <<< FAILURE!
- in org.apache.phoenix.end2end.index.DropIndexDuringUpsertIT
testWriteFailureDropIndex(org.apache.phoenix.end2end.index.DropIndexDuringUpsertIT)  Time
elapsed: 16.764 sec  <<< FAILURE!
java.lang.AssertionError: null
	at org.junit.Assert.fail(Assert.java:86)
	at org.junit.Assert.assertTrue(Assert.java:41)
	at org.junit.Assert.assertTrue(Assert.java:52)
	at org.apache.phoenix.query.BaseTest.initAndRegisterDriver(BaseTest.java:613)
	at org.apache.phoenix.end2end.index.DropIndexDuringUpsertIT.doSetup(DropIndexDuringUpsertIT.java:93)

Tests run: 11, Failures: 0, Errors: 0, Skipped: 0, Time elapsed: 57.986 sec - in org.apache.phoenix.hbase.index.covered.example.EndToEndCoveredIndexingIT
Tests run: 11, Failures: 0, Errors: 0, Skipped: 0, Time elapsed: 57.233 sec - in org.apache.phoenix.hbase.index.covered.example.EndtoEndIndexingWithCompressionIT
Tests run: 1, Failures: 1, Errors: 0, Skipped: 0, Time elapsed: 33.533 sec <<< FAILURE!
- in org.apache.phoenix.end2end.ContextClassloaderIT
org.apache.phoenix.end2end.ContextClassloaderIT  Time elapsed: 33.532 sec  <<< FAILURE!
java.lang.AssertionError: null
	at org.junit.Assert.fail(Assert.java:86)
	at org.junit.Assert.assertTrue(Assert.java:41)
	at org.junit.Assert.assertTrue(Assert.java:52)
	at org.apache.phoenix.query.BaseTest.initAndRegisterDriver(BaseTest.java:613)
	at org.apache.phoenix.end2end.ContextClassloaderIT.setUpBeforeClass(ContextClassloaderIT.java:66)

Running org.apache.phoenix.mapreduce.CsvBulkLoadToolIT
Tests run: 9, Failures: 0, Errors: 0, Skipped: 0, Time elapsed: 122.096 sec - in org.apache.phoenix.hbase.index.balancer.IndexLoadBalancerIT
Tests run: 3, Failures: 0, Errors: 0, Skipped: 0, Time elapsed: 141.257 sec - in org.apache.phoenix.end2end.index.MutableIndexFailureIT
Tests run: 4, Failures: 0, Errors: 0, Skipped: 0, Time elapsed: 183.38 sec - in org.apache.phoenix.mapreduce.CsvBulkLoadToolIT

Results :

Failed tests: 
  DropIndexDuringUpsertIT.doSetup:93->BaseTest.initAndRegisterDriver:613 null
  ContextClassloaderIT.setUpBeforeClass:66->BaseTest.initAndRegisterDriver:613 null

Tests run: 46, Failures: 2, Errors: 0, Skipped: 0

[INFO] 
[INFO] --- maven-failsafe-plugin:2.17:verify (ClientManagedTimeTests) @ phoenix-core ---
[INFO] Failsafe report directory: <https://builds.apache.org/job/Phoenix-4.0/ws/phoenix-core/target/failsafe-reports>
[INFO] ------------------------------------------------------------------------
[INFO] Reactor Summary:
[INFO] 
[INFO] Apache Phoenix .................................... SUCCESS [2.204s]
[INFO] Phoenix Hadoop Compatibility ...................... SUCCESS [2.786s]
[INFO] Phoenix Hadoop2 Compatibility ..................... SUCCESS [3.002s]
[INFO] Phoenix Core ...................................... FAILURE [13:32.728s]
[INFO] Phoenix - Flume ................................... SKIPPED
[INFO] Phoenix - Pig ..................................... SKIPPED
[INFO] Phoenix Assembly .................................. SKIPPED
[INFO] ------------------------------------------------------------------------
[INFO] BUILD FAILURE
[INFO] ------------------------------------------------------------------------
[INFO] Total time: 13:41.206s
[INFO] Finished at: Mon Oct 06 23:24:40 UTC 2014
[INFO] Final Memory: 66M/3016M
[INFO] ------------------------------------------------------------------------
[ERROR] Failed to execute goal org.apache.maven.plugins:maven-failsafe-plugin:2.17:verify
(ClientManagedTimeTests) on project phoenix-core: There are test failures.
[ERROR] 
[ERROR] Please refer to <https://builds.apache.org/job/Phoenix-4.0/ws/phoenix-core/target/failsafe-reports>
for the individual test results.
[ERROR] -> [Help 1]
[ERROR] 
[ERROR] To see the full stack trace of the errors, re-run Maven with the -e switch.
[ERROR] Re-run Maven using the -X switch to enable full debug logging.
[ERROR] 
[ERROR] For more information about the errors and possible solutions, please read the following
articles:
[ERROR] [Help 1] http://cwiki.apache.org/confluence/display/MAVEN/MojoFailureException
[ERROR] 
[ERROR] After correcting the problems, you can resume the build with the command
[ERROR]   mvn <goals> -rf :phoenix-core
Build step 'Invoke top-level Maven targets' marked build as failure
Archiving artifacts
Sending artifact delta relative to Phoenix | 4.0 #359
Archived 723 artifacts
Archive block size is 32768
Received 5554 blocks and 303482387 bytes
Compression is 37.5%
Took 2 min 2 sec
Recording test results

Mime
View raw message