phoenix-commits mailing list archives

Site index · List index
Message view « Date » · « Thread »
Top « Date » · « Thread »
From Apache Jenkins Server <jenk...@builds.apache.org>
Subject Build failed in Jenkins: Phoenix | Master #434
Date Sat, 18 Oct 2014 01:55:31 GMT
See <https://builds.apache.org/job/Phoenix-master/434/changes>

Changes:

[jtaylor] PHOENIX-1297 Adding utility methods to get primary key information from the optimized
query plan (Samarth Jain)

[jtaylor] PHOENIX-973 Lexer skips unexpected characters

------------------------------------------
[...truncated 72561 lines...]
	at org.junit.internal.runners.statements.RunAfters.evaluate(RunAfters.java:33)
	at org.junit.runners.ParentRunner.runLeaf(ParentRunner.java:271)
	at org.junit.runners.BlockJUnit4ClassRunner.runChild(BlockJUnit4ClassRunner.java:70)
	at org.junit.runners.BlockJUnit4ClassRunner.runChild(BlockJUnit4ClassRunner.java:50)
	at org.junit.runners.ParentRunner$3.run(ParentRunner.java:238)
	at org.junit.runners.ParentRunner$1.schedule(ParentRunner.java:63)
	at org.junit.runners.ParentRunner.runChildren(ParentRunner.java:236)
	at org.junit.runners.ParentRunner.access$000(ParentRunner.java:53)
	at org.junit.runners.ParentRunner$2.evaluate(ParentRunner.java:229)
	at org.junit.internal.runners.statements.RunBefores.evaluate(RunBefores.java:26)
	at org.junit.internal.runners.statements.RunAfters.evaluate(RunAfters.java:27)
	at org.junit.runners.ParentRunner.run(ParentRunner.java:309)
	at org.junit.runners.Suite.runChild(Suite.java:127)
	at org.junit.runners.Suite.runChild(Suite.java:26)
	at org.junit.runners.ParentRunner$3.run(ParentRunner.java:238)
	at org.junit.runners.ParentRunner$1.schedule(ParentRunner.java:63)
	at org.junit.runners.ParentRunner.runChildren(ParentRunner.java:236)
	at org.junit.runners.ParentRunner.access$000(ParentRunner.java:53)
	at org.junit.runners.ParentRunner$2.evaluate(ParentRunner.java:229)
	at org.junit.runners.ParentRunner.run(ParentRunner.java:309)
	at org.junit.runner.JUnitCore.run(JUnitCore.java:160)
	at org.junit.runner.JUnitCore.run(JUnitCore.java:138)
	at org.apache.maven.surefire.junitcore.JUnitCoreWrapper.createRequestAndRun(JUnitCoreWrapper.java:113)
	at org.apache.maven.surefire.junitcore.JUnitCoreWrapper.executeLazy(JUnitCoreWrapper.java:94)
	at org.apache.maven.surefire.junitcore.JUnitCoreWrapper.execute(JUnitCoreWrapper.java:58)
	at org.apache.maven.surefire.junitcore.JUnitCoreProvider.invoke(JUnitCoreProvider.java:134)
	at org.apache.maven.surefire.booter.ForkedBooter.invokeProviderInSameClassLoader(ForkedBooter.java:200)
	at org.apache.maven.surefire.booter.ForkedBooter.runSuitesInProcess(ForkedBooter.java:153)
	at org.apache.maven.surefire.booter.ForkedBooter.main(ForkedBooter.java:103)

testViewAndTableAndDropCascade(org.apache.phoenix.end2end.ViewIT)  Time elapsed: 0.925 sec
 <<< ERROR!
java.lang.ArrayIndexOutOfBoundsException: 39
	at org.apache.phoenix.schema.PDataType$IntCodec.decodeInt(PDataType.java:6022)
	at org.apache.phoenix.schema.Sequence.dropSequence(Sequence.java:515)
	at org.apache.phoenix.query.ConnectionQueryServicesImpl.dropSequence(ConnectionQueryServicesImpl.java:1750)
	at org.apache.phoenix.schema.MetaDataClient.dropSequence(MetaDataClient.java:944)
	at org.apache.phoenix.compile.DropSequenceCompiler$1.execute(DropSequenceCompiler.java:48)
	at org.apache.phoenix.jdbc.PhoenixStatement$2.call(PhoenixStatement.java:260)
	at org.apache.phoenix.jdbc.PhoenixStatement$2.call(PhoenixStatement.java:252)
	at org.apache.phoenix.call.CallRunner.run(CallRunner.java:53)
	at org.apache.phoenix.jdbc.PhoenixStatement.executeMutation(PhoenixStatement.java:250)
	at org.apache.phoenix.jdbc.PhoenixStatement.execute(PhoenixStatement.java:1037)
	at org.apache.phoenix.query.BaseTest.deletePriorSequences(BaseTest.java:817)
	at org.apache.phoenix.query.BaseTest.deletePriorTables(BaseTest.java:764)
	at org.apache.phoenix.query.BaseTest.deletePriorTables(BaseTest.java:753)
	at org.apache.phoenix.end2end.BaseOwnClusterHBaseManagedTimeIT.cleanUpAfterTest(BaseOwnClusterHBaseManagedTimeIT.java:30)
	at sun.reflect.NativeMethodAccessorImpl.invoke0(Native Method)
	at sun.reflect.NativeMethodAccessorImpl.invoke(NativeMethodAccessorImpl.java:57)
	at sun.reflect.DelegatingMethodAccessorImpl.invoke(DelegatingMethodAccessorImpl.java:43)
	at java.lang.reflect.Method.invoke(Method.java:606)
	at org.junit.runners.model.FrameworkMethod$1.runReflectiveCall(FrameworkMethod.java:47)
	at org.junit.internal.runners.model.ReflectiveCallable.run(ReflectiveCallable.java:12)
	at org.junit.runners.model.FrameworkMethod.invokeExplosively(FrameworkMethod.java:44)
	at org.junit.internal.runners.statements.RunAfters.evaluate(RunAfters.java:33)
	at org.junit.runners.ParentRunner.runLeaf(ParentRunner.java:271)
	at org.junit.runners.BlockJUnit4ClassRunner.runChild(BlockJUnit4ClassRunner.java:70)
	at org.junit.runners.BlockJUnit4ClassRunner.runChild(BlockJUnit4ClassRunner.java:50)
	at org.junit.runners.ParentRunner$3.run(ParentRunner.java:238)
	at org.junit.runners.ParentRunner$1.schedule(ParentRunner.java:63)
	at org.junit.runners.ParentRunner.runChildren(ParentRunner.java:236)
	at org.junit.runners.ParentRunner.access$000(ParentRunner.java:53)
	at org.junit.runners.ParentRunner$2.evaluate(ParentRunner.java:229)
	at org.junit.internal.runners.statements.RunBefores.evaluate(RunBefores.java:26)
	at org.junit.internal.runners.statements.RunAfters.evaluate(RunAfters.java:27)
	at org.junit.runners.ParentRunner.run(ParentRunner.java:309)
	at org.junit.runners.Suite.runChild(Suite.java:127)
	at org.junit.runners.Suite.runChild(Suite.java:26)
	at org.junit.runners.ParentRunner$3.run(ParentRunner.java:238)
	at org.junit.runners.ParentRunner$1.schedule(ParentRunner.java:63)
	at org.junit.runners.ParentRunner.runChildren(ParentRunner.java:236)
	at org.junit.runners.ParentRunner.access$000(ParentRunner.java:53)
	at org.junit.runners.ParentRunner$2.evaluate(ParentRunner.java:229)
	at org.junit.runners.ParentRunner.run(ParentRunner.java:309)
	at org.junit.runner.JUnitCore.run(JUnitCore.java:160)
	at org.junit.runner.JUnitCore.run(JUnitCore.java:138)
	at org.apache.maven.surefire.junitcore.JUnitCoreWrapper.createRequestAndRun(JUnitCoreWrapper.java:113)
	at org.apache.maven.surefire.junitcore.JUnitCoreWrapper.executeLazy(JUnitCoreWrapper.java:94)
	at org.apache.maven.surefire.junitcore.JUnitCoreWrapper.execute(JUnitCoreWrapper.java:58)
	at org.apache.maven.surefire.junitcore.JUnitCoreProvider.invoke(JUnitCoreProvider.java:134)
	at org.apache.maven.surefire.booter.ForkedBooter.invokeProviderInSameClassLoader(ForkedBooter.java:200)
	at org.apache.maven.surefire.booter.ForkedBooter.runSuitesInProcess(ForkedBooter.java:153)
	at org.apache.maven.surefire.booter.ForkedBooter.main(ForkedBooter.java:103)

Running org.apache.phoenix.mapreduce.CsvBulkLoadToolIT
Running org.apache.phoenix.end2end.index.MutableIndexReplicationIT
Running org.apache.phoenix.end2end.SpillableGroupByIT
Tests run: 1, Failures: 0, Errors: 0, Skipped: 0, Time elapsed: 3.753 sec - in org.apache.phoenix.end2end.SpillableGroupByIT
Running org.apache.phoenix.end2end.KeyOnlyIT
Tests run: 1, Failures: 0, Errors: 0, Skipped: 0, Time elapsed: 16.353 sec - in org.apache.phoenix.end2end.index.MutableIndexReplicationIT
Tests run: 2, Failures: 0, Errors: 0, Skipped: 0, Time elapsed: 3.844 sec - in org.apache.phoenix.end2end.KeyOnlyIT
Running org.apache.phoenix.end2end.TenantSpecificTablesDDLIT
Running org.apache.phoenix.end2end.TenantSpecificTablesDMLIT
Tests run: 18, Failures: 0, Errors: 0, Skipped: 0, Time elapsed: 22.065 sec - in org.apache.phoenix.end2end.TenantSpecificTablesDDLIT
Tests run: 16, Failures: 0, Errors: 2, Skipped: 0, Time elapsed: 22.705 sec <<< FAILURE!
- in org.apache.phoenix.end2end.TenantSpecificTablesDMLIT
testDeleteWhenImmutableIndex(org.apache.phoenix.end2end.TenantSpecificTablesDMLIT)  Time elapsed:
0.414 sec  <<< ERROR!
org.apache.phoenix.exception.PhoenixIOException: Failed 1 action: org.apache.hadoop.hbase.DoNotRetryIOException:
Attempted to increment field that isn't 64 bits wide
	at org.apache.hadoop.hbase.regionserver.HRegion.increment(HRegion.java:5378)
	at org.apache.hadoop.hbase.regionserver.HRegionServer.increment(HRegionServer.java:4197)
	at org.apache.hadoop.hbase.regionserver.HRegionServer.doNonAtomicRegionMutation(HRegionServer.java:3445)
	at org.apache.hadoop.hbase.regionserver.HRegionServer.multi(HRegionServer.java:3380)
	at org.apache.hadoop.hbase.protobuf.generated.ClientProtos$ClientService$2.callBlockingMethod(ClientProtos.java:29503)
	at org.apache.hadoop.hbase.ipc.RpcServer.call(RpcServer.java:2027)
	at org.apache.hadoop.hbase.ipc.CallRunner.run(CallRunner.java:98)
	at org.apache.hadoop.hbase.ipc.RpcExecutor.consumerLoop(RpcExecutor.java:114)
	at org.apache.hadoop.hbase.ipc.RpcExecutor$1.run(RpcExecutor.java:94)
	at java.lang.Thread.run(Thread.java:724)
: 1 time, 
	at org.apache.hadoop.hbase.client.AsyncProcess$BatchErrors.makeException(AsyncProcess.java:192)
	at org.apache.hadoop.hbase.client.AsyncProcess$BatchErrors.access$500(AsyncProcess.java:176)
	at org.apache.hadoop.hbase.client.AsyncProcess.getErrors(AsyncProcess.java:913)
	at org.apache.hadoop.hbase.client.HConnectionManager$HConnectionImplementation.processBatchCallback(HConnectionManager.java:2359)
	at org.apache.hadoop.hbase.client.HTable.batchCallback(HTable.java:835)
	at org.apache.hadoop.hbase.client.HTable.batchCallback(HTable.java:850)
	at org.apache.hadoop.hbase.client.HTable.batch(HTable.java:825)
	at org.apache.phoenix.query.ConnectionQueryServicesImpl.incrementSequenceValues(ConnectionQueryServicesImpl.java:1850)
	at org.apache.phoenix.query.ConnectionQueryServicesImpl.incrementSequences(ConnectionQueryServicesImpl.java:1808)
	at org.apache.phoenix.query.DelegateConnectionQueryServices.incrementSequences(DelegateConnectionQueryServices.java:192)
	at org.apache.phoenix.query.DelegateConnectionQueryServices.incrementSequences(DelegateConnectionQueryServices.java:192)
	at org.apache.phoenix.schema.MetaDataClient.createIndex(MetaDataClient.java:898)
	at org.apache.phoenix.compile.CreateIndexCompiler$1.execute(CreateIndexCompiler.java:95)
	at org.apache.phoenix.jdbc.PhoenixStatement$2.call(PhoenixStatement.java:260)
	at org.apache.phoenix.jdbc.PhoenixStatement$2.call(PhoenixStatement.java:252)
	at org.apache.phoenix.call.CallRunner.run(CallRunner.java:53)
	at org.apache.phoenix.jdbc.PhoenixStatement.executeMutation(PhoenixStatement.java:250)
	at org.apache.phoenix.jdbc.PhoenixStatement.executeUpdate(PhoenixStatement.java:1026)
	at org.apache.phoenix.end2end.TenantSpecificTablesDMLIT.testDeleteWhenImmutableIndex(TenantSpecificTablesDMLIT.java:285)

testDeleteWhenImmutableIndex(org.apache.phoenix.end2end.TenantSpecificTablesDMLIT)  Time elapsed:
0.414 sec  <<< ERROR!
java.lang.ArrayIndexOutOfBoundsException: null

Tests run: 1, Failures: 0, Errors: 0, Skipped: 0, Time elapsed: 73.267 sec - in org.apache.phoenix.end2end.index.DropIndexDuringUpsertIT
Running org.apache.phoenix.end2end.ContextClassloaderIT
Tests run: 3, Failures: 0, Errors: 0, Skipped: 0, Time elapsed: 3.441 sec - in org.apache.phoenix.end2end.ContextClassloaderIT
Running org.apache.phoenix.hbase.index.covered.EndToEndCoveredColumnsIndexBuilderIT
Running org.apache.phoenix.end2end.ParallelIteratorsIT
Running org.apache.phoenix.hbase.index.covered.example.EndtoEndIndexingWithCompressionIT
Tests run: 2, Failures: 0, Errors: 0, Skipped: 0, Time elapsed: 8.474 sec - in org.apache.phoenix.hbase.index.covered.EndToEndCoveredColumnsIndexBuilderIT
Running org.apache.phoenix.hbase.index.covered.example.EndToEndCoveredIndexingIT
Tests run: 2, Failures: 0, Errors: 0, Skipped: 0, Time elapsed: 12.349 sec - in org.apache.phoenix.end2end.ParallelIteratorsIT
Running org.apache.phoenix.hbase.index.covered.example.FailWithoutRetriesIT
Tests run: 3, Failures: 0, Errors: 1, Skipped: 0, Time elapsed: 107.529 sec <<< FAILURE!
- in org.apache.phoenix.end2end.index.MutableIndexFailureIT
testWriteFailureDisablesLocalIndex(org.apache.phoenix.end2end.index.MutableIndexFailureIT)
 Time elapsed: 15.859 sec  <<< ERROR!
org.apache.phoenix.exception.PhoenixIOException: Failed 1 action: org.apache.hadoop.hbase.DoNotRetryIOException:
Attempted to increment field that isn't 64 bits wide
	at org.apache.hadoop.hbase.regionserver.HRegion.increment(HRegion.java:5378)
	at org.apache.hadoop.hbase.regionserver.HRegionServer.increment(HRegionServer.java:4197)
	at org.apache.hadoop.hbase.regionserver.HRegionServer.doNonAtomicRegionMutation(HRegionServer.java:3445)
	at org.apache.hadoop.hbase.regionserver.HRegionServer.multi(HRegionServer.java:3380)
	at org.apache.hadoop.hbase.protobuf.generated.ClientProtos$ClientService$2.callBlockingMethod(ClientProtos.java:29503)
	at org.apache.hadoop.hbase.ipc.RpcServer.call(RpcServer.java:2027)
	at org.apache.hadoop.hbase.ipc.CallRunner.run(CallRunner.java:98)
	at org.apache.hadoop.hbase.ipc.RpcExecutor.consumerLoop(RpcExecutor.java:114)
	at org.apache.hadoop.hbase.ipc.RpcExecutor$1.run(RpcExecutor.java:94)
	at java.lang.Thread.run(Thread.java:724)
: 1 time, 
	at org.apache.hadoop.hbase.client.AsyncProcess$BatchErrors.makeException(AsyncProcess.java:192)
	at org.apache.hadoop.hbase.client.AsyncProcess$BatchErrors.access$500(AsyncProcess.java:176)
	at org.apache.hadoop.hbase.client.AsyncProcess.getErrors(AsyncProcess.java:913)
	at org.apache.hadoop.hbase.client.HConnectionManager$HConnectionImplementation.processBatchCallback(HConnectionManager.java:2359)
	at org.apache.hadoop.hbase.client.HTable.batchCallback(HTable.java:835)
	at org.apache.hadoop.hbase.client.HTable.batchCallback(HTable.java:850)
	at org.apache.hadoop.hbase.client.HTable.batch(HTable.java:825)
	at org.apache.phoenix.query.ConnectionQueryServicesImpl.incrementSequenceValues(ConnectionQueryServicesImpl.java:1850)
	at org.apache.phoenix.query.ConnectionQueryServicesImpl.incrementSequences(ConnectionQueryServicesImpl.java:1808)
	at org.apache.phoenix.schema.MetaDataClient.createIndex(MetaDataClient.java:898)
	at org.apache.phoenix.compile.CreateIndexCompiler$1.execute(CreateIndexCompiler.java:95)
	at org.apache.phoenix.jdbc.PhoenixStatement$2.call(PhoenixStatement.java:260)
	at org.apache.phoenix.jdbc.PhoenixStatement$2.call(PhoenixStatement.java:252)
	at org.apache.phoenix.call.CallRunner.run(CallRunner.java:53)
	at org.apache.phoenix.jdbc.PhoenixStatement.executeMutation(PhoenixStatement.java:250)
	at org.apache.phoenix.jdbc.PhoenixStatement.execute(PhoenixStatement.java:1037)
	at org.apache.phoenix.end2end.index.MutableIndexFailureIT.testWriteFailureDisablesIndex(MutableIndexFailureIT.java:157)
	at org.apache.phoenix.end2end.index.MutableIndexFailureIT.testWriteFailureDisablesLocalIndex(MutableIndexFailureIT.java:135)

Tests run: 1, Failures: 0, Errors: 0, Skipped: 0, Time elapsed: 8.498 sec - in org.apache.phoenix.hbase.index.covered.example.FailWithoutRetriesIT
Running org.apache.phoenix.hbase.index.FailForUnsupportedHBaseVersionsIT
Running org.apache.phoenix.hbase.index.balancer.IndexLoadBalancerIT
Tests run: 2, Failures: 0, Errors: 0, Skipped: 0, Time elapsed: 14.627 sec - in org.apache.phoenix.hbase.index.FailForUnsupportedHBaseVersionsIT
Tests run: 11, Failures: 0, Errors: 0, Skipped: 0, Time elapsed: 38.904 sec - in org.apache.phoenix.hbase.index.covered.example.EndtoEndIndexingWithCompressionIT
Tests run: 11, Failures: 0, Errors: 0, Skipped: 0, Time elapsed: 49.003 sec - in org.apache.phoenix.hbase.index.covered.example.EndToEndCoveredIndexingIT
Tests run: 4, Failures: 0, Errors: 0, Skipped: 0, Time elapsed: 167.36 sec - in org.apache.phoenix.mapreduce.CsvBulkLoadToolIT
Tests run: 9, Failures: 0, Errors: 0, Skipped: 0, Time elapsed: 108.133 sec - in org.apache.phoenix.hbase.index.balancer.IndexLoadBalancerIT

Results :

Tests in error: 
  SaltedViewIT.testSaltedUpdatableViewWithIndex:35->BaseViewIT.testUpdatableViewWithIndex:54->BaseViewIT.testUpdatableViewIndex:113
» PhoenixIO
  SaltedViewIT>BaseOwnClusterHBaseManagedTimeIT.cleanUpAfterTest:30->BaseTest.deletePriorTables:753->BaseTest.deletePriorTables:764->BaseTest.deletePriorSequences:817
» ArrayIndexOutOfBounds
  SaltedViewIT.testSaltedUpdatableViewWithLocalIndex:40->BaseViewIT.testUpdatableViewWithIndex:54->BaseViewIT.testUpdatableViewIndex:111
» PhoenixIO
  SaltedViewIT>BaseOwnClusterHBaseManagedTimeIT.cleanUpAfterTest:30->BaseTest.deletePriorTables:753->BaseTest.deletePriorTables:764->BaseTest.deletePriorSequences:817
» ArrayIndexOutOfBounds
  ViewIT.testViewAndTableAndDropCascadeWithIndexes:328 » PhoenixIO Failed 1 acti...
  ViewIT>BaseOwnClusterHBaseManagedTimeIT.cleanUpAfterTest:30->BaseTest.deletePriorTables:753->BaseTest.deletePriorTables:764->BaseTest.deletePriorSequences:817
» ArrayIndexOutOfBounds
  ViewIT>BaseOwnClusterHBaseManagedTimeIT.cleanUpAfterTest:30->BaseTest.deletePriorTables:753->BaseTest.deletePriorTables:764->BaseTest.deletePriorSequences:817
» ArrayIndexOutOfBounds
  ViewIT.testNonSaltedUpdatableViewWithIndex:108->BaseViewIT.testUpdatableViewWithIndex:54->BaseViewIT.testUpdatableViewIndex:113
» PhoenixIO
  ViewIT>BaseOwnClusterHBaseManagedTimeIT.cleanUpAfterTest:30->BaseTest.deletePriorTables:753->BaseTest.deletePriorTables:764->BaseTest.deletePriorSequences:817
» ArrayIndexOutOfBounds
  ViewIT>BaseOwnClusterHBaseManagedTimeIT.cleanUpAfterTest:30->BaseTest.deletePriorTables:753->BaseTest.deletePriorTables:764->BaseTest.deletePriorSequences:817
» ArrayIndexOutOfBounds
  ViewIT>BaseOwnClusterHBaseManagedTimeIT.cleanUpAfterTest:30->BaseTest.deletePriorTables:753->BaseTest.deletePriorTables:764->BaseTest.deletePriorSequences:817
» ArrayIndexOutOfBounds
  ViewIT>BaseOwnClusterHBaseManagedTimeIT.cleanUpAfterTest:30->BaseTest.deletePriorTables:753->BaseTest.deletePriorTables:764->BaseTest.deletePriorSequences:817
» ArrayIndexOutOfBounds
  ViewIT>BaseOwnClusterHBaseManagedTimeIT.cleanUpAfterTest:30->BaseTest.deletePriorTables:753->BaseTest.deletePriorTables:764->BaseTest.deletePriorSequences:817
» ArrayIndexOutOfBounds
  ViewIT>BaseOwnClusterHBaseManagedTimeIT.cleanUpAfterTest:30->BaseTest.deletePriorTables:753->BaseTest.deletePriorTables:764->BaseTest.deletePriorSequences:817
» ArrayIndexOutOfBounds
  TenantSpecificTablesDMLIT.testDeleteWhenImmutableIndex:285 » PhoenixIO Failed ...
  TenantSpecificTablesDMLIT.testDeleteWhenImmutableIndex » ArrayIndexOutOfBounds
  MutableIndexFailureIT.testWriteFailureDisablesLocalIndex:135->testWriteFailureDisablesIndex:157
» PhoenixIO

Tests run: 113, Failures: 0, Errors: 17, Skipped: 0

[INFO] 
[INFO] --- maven-failsafe-plugin:2.17:verify (ClientManagedTimeTests) @ phoenix-core ---
[INFO] Failsafe report directory: <https://builds.apache.org/job/Phoenix-master/ws/phoenix-core/target/failsafe-reports>
[INFO] ------------------------------------------------------------------------
[INFO] Reactor Summary:
[INFO] 
[INFO] Apache Phoenix .................................... SUCCESS [1.792s]
[INFO] Phoenix Hadoop Compatibility ...................... SUCCESS [2.810s]
[INFO] Phoenix Hadoop2 Compatibility ..................... SUCCESS [2.637s]
[INFO] Phoenix Core ...................................... FAILURE [12:50.421s]
[INFO] Phoenix - Flume ................................... SKIPPED
[INFO] Phoenix - Pig ..................................... SKIPPED
[INFO] Phoenix Assembly .................................. SKIPPED
[INFO] ------------------------------------------------------------------------
[INFO] BUILD FAILURE
[INFO] ------------------------------------------------------------------------
[INFO] Total time: 12:58.083s
[INFO] Finished at: Sat Oct 18 01:51:57 UTC 2014
[INFO] Final Memory: 49M/872M
[INFO] ------------------------------------------------------------------------
[ERROR] Failed to execute goal org.apache.maven.plugins:maven-failsafe-plugin:2.17:verify
(ClientManagedTimeTests) on project phoenix-core: There are test failures.
[ERROR] 
[ERROR] Please refer to <https://builds.apache.org/job/Phoenix-master/ws/phoenix-core/target/failsafe-reports>
for the individual test results.
[ERROR] -> [Help 1]
[ERROR] 
[ERROR] To see the full stack trace of the errors, re-run Maven with the -e switch.
[ERROR] Re-run Maven using the -X switch to enable full debug logging.
[ERROR] 
[ERROR] For more information about the errors and possible solutions, please read the following
articles:
[ERROR] [Help 1] http://cwiki.apache.org/confluence/display/MAVEN/MojoFailureException
[ERROR] 
[ERROR] After correcting the problems, you can resume the build with the command
[ERROR]   mvn <goals> -rf :phoenix-core
Build step 'Invoke top-level Maven targets' marked build as failure
Archiving artifacts
Sending artifact delta relative to Phoenix | Master #429
Archived 740 artifacts
Archive block size is 32768
Received 6577 blocks and 409020818 bytes
Compression is 34.5%
Took 2 min 15 sec
Updating PHOENIX-1297
Updating PHOENIX-973
Recording test results

Mime
View raw message