phoenix-commits mailing list archives

Site index · List index
Message view « Date » · « Thread »
Top « Date » · « Thread »
From Apache Jenkins Server <jenk...@builds.apache.org>
Subject Build failed in Jenkins: Phoenix | Master #406
Date Mon, 06 Oct 2014 23:23:42 GMT
See <https://builds.apache.org/job/Phoenix-master/406/changes>

Changes:

[jtaylor] PHOENIX-1321 Cleanup setting of timestamps when collecting and using stats

------------------------------------------
[...truncated 512 lines...]
Running org.apache.phoenix.end2end.GroupByCaseIT
Tests run: 3, Failures: 0, Errors: 0, Skipped: 0, Time elapsed: 1.871 sec - in org.apache.phoenix.end2end.GroupByCaseIT
Running org.apache.phoenix.end2end.CustomEntityDataIT
Tests run: 3, Failures: 0, Errors: 0, Skipped: 0, Time elapsed: 1.93 sec - in org.apache.phoenix.end2end.CustomEntityDataIT
Running org.apache.phoenix.end2end.ClientTimeArithmeticQueryIT
Tests run: 119, Failures: 0, Errors: 0, Skipped: 0, Time elapsed: 77.772 sec - in org.apache.phoenix.end2end.ScanQueryIT
Running org.apache.phoenix.end2end.ColumnProjectionOptimizationIT
Tests run: 91, Failures: 0, Errors: 0, Skipped: 0, Time elapsed: 66.716 sec - in org.apache.phoenix.end2end.GroupByIT
Running org.apache.phoenix.end2end.NotQueryIT
Tests run: 3, Failures: 0, Errors: 0, Skipped: 0, Time elapsed: 8.655 sec - in org.apache.phoenix.end2end.ColumnProjectionOptimizationIT
Running org.apache.phoenix.end2end.QueryDatabaseMetaDataIT
Tests run: 63, Failures: 0, Errors: 0, Skipped: 0, Time elapsed: 44.158 sec - in org.apache.phoenix.end2end.CaseStatementIT
Running org.apache.phoenix.end2end.UpsertValuesIT
Tests run: 15, Failures: 0, Errors: 0, Skipped: 0, Time elapsed: 32.377 sec - in org.apache.phoenix.end2end.QueryDatabaseMetaDataIT
Running org.apache.phoenix.end2end.RowValueConstructorIT
Tests run: 12, Failures: 0, Errors: 0, Skipped: 0, Time elapsed: 16.381 sec - in org.apache.phoenix.end2end.UpsertValuesIT
Running org.apache.phoenix.end2end.InMemoryOrderByIT
Tests run: 2, Failures: 0, Errors: 0, Skipped: 0, Time elapsed: 2.972 sec - in org.apache.phoenix.end2end.InMemoryOrderByIT
Running org.apache.phoenix.end2end.TopNIT
Tests run: 4, Failures: 0, Errors: 0, Skipped: 0, Time elapsed: 3.639 sec - in org.apache.phoenix.end2end.TopNIT
Running org.apache.phoenix.end2end.ArrayIT
Tests run: 182, Failures: 0, Errors: 0, Skipped: 0, Time elapsed: 164.284 sec - in org.apache.phoenix.end2end.QueryIT
Tests run: 77, Failures: 0, Errors: 0, Skipped: 0, Time elapsed: 53.877 sec - in org.apache.phoenix.end2end.NotQueryIT
Tests run: 34, Failures: 0, Errors: 0, Skipped: 0, Time elapsed: 24.349 sec - in org.apache.phoenix.end2end.RowValueConstructorIT
Tests run: 48, Failures: 0, Errors: 0, Skipped: 0, Time elapsed: 22.557 sec - in org.apache.phoenix.end2end.ArrayIT
Tests run: 203, Failures: 0, Errors: 0, Skipped: 0, Time elapsed: 135.717 sec - in org.apache.phoenix.end2end.ClientTimeArithmeticQueryIT

Results :

Failed tests: 
  TenantSpecificTablesDMLIT.testBasicUpsertSelect2:147 expected:<3> but was:<1>

Tests run: 1266, Failures: 1, Errors: 0, Skipped: 8

[INFO] 
[INFO] --- maven-failsafe-plugin:2.17:integration-test (HBaseManagedTimeTests) @ phoenix-core
---
[INFO] Failsafe report directory: <https://builds.apache.org/job/Phoenix-master/ws/phoenix-core/target/failsafe-reports>
[INFO] parallel='none', perCoreThreadCount=true, threadCount=0, useUnlimitedThreads=false,
threadCountSuites=0, threadCountClasses=0, threadCountMethods=0, parallelOptimized=true

-------------------------------------------------------
 T E S T S
-------------------------------------------------------

-------------------------------------------------------
 T E S T S
-------------------------------------------------------
Running org.apache.phoenix.end2end.SkipScanQueryIT
Running org.apache.phoenix.end2end.HashJoinIT
Running org.apache.phoenix.trace.PhoenixTraceReaderIT
Running org.apache.phoenix.trace.PhoenixTracingEndToEndIT
Running org.apache.phoenix.trace.PhoenixTableMetricsWriterIT
Tests run: 2, Failures: 0, Errors: 0, Skipped: 0, Time elapsed: 1.392 sec - in org.apache.phoenix.trace.PhoenixTraceReaderIT
Running org.apache.phoenix.end2end.EncodeFunctionIT
Tests run: 2, Failures: 0, Errors: 0, Skipped: 0, Time elapsed: 1.082 sec - in org.apache.phoenix.trace.PhoenixTableMetricsWriterIT
Running org.apache.phoenix.end2end.SortOrderFIT
Tests run: 6, Failures: 0, Errors: 0, Skipped: 0, Time elapsed: 7.604 sec - in org.apache.phoenix.end2end.EncodeFunctionIT
Tests run: 30, Failures: 0, Errors: 0, Skipped: 0, Time elapsed: 7.067 sec - in org.apache.phoenix.end2end.SortOrderFIT
Running org.apache.phoenix.end2end.ArithmeticQueryIT
Running org.apache.phoenix.end2end.StatementHintsIT
Tests run: 8, Failures: 0, Errors: 0, Skipped: 0, Time elapsed: 12.792 sec - in org.apache.phoenix.end2end.SkipScanQueryIT
Running org.apache.phoenix.end2end.ViewIT
Tests run: 2, Failures: 0, Errors: 0, Skipped: 0, Time elapsed: 2.445 sec - in org.apache.phoenix.end2end.StatementHintsIT
Running org.apache.phoenix.end2end.ConvertTimezoneFunctionIT
Tests run: 6, Failures: 0, Errors: 0, Skipped: 0, Time elapsed: 2.967 sec - in org.apache.phoenix.end2end.ConvertTimezoneFunctionIT
Running org.apache.phoenix.end2end.RegexpSubstrFunctionIT
Tests run: 2, Failures: 0, Errors: 0, Skipped: 0, Time elapsed: 2.092 sec - in org.apache.phoenix.end2end.RegexpSubstrFunctionIT
Running org.apache.phoenix.end2end.TimezoneOffsetFunctionIT
Tests run: 6, Failures: 0, Errors: 0, Skipped: 0, Time elapsed: 2.319 sec - in org.apache.phoenix.end2end.TimezoneOffsetFunctionIT
Running org.apache.phoenix.end2end.StatsCollectorIT
Tests run: 20, Failures: 0, Errors: 0, Skipped: 0, Time elapsed: 15.914 sec - in org.apache.phoenix.end2end.ArithmeticQueryIT
Running org.apache.phoenix.end2end.UpsertSelectAutoCommitIT
Tests run: 2, Failures: 0, Errors: 0, Skipped: 0, Time elapsed: 8.173 sec - in org.apache.phoenix.end2end.StatsCollectorIT
Running org.apache.phoenix.end2end.QueryMoreIT
Tests run: 11, Failures: 0, Errors: 0, Skipped: 0, Time elapsed: 20.827 sec - in org.apache.phoenix.end2end.ViewIT
Running org.apache.phoenix.end2end.BinaryRowKeyIT
Tests run: 3, Failures: 0, Errors: 0, Skipped: 0, Time elapsed: 2.11 sec - in org.apache.phoenix.end2end.BinaryRowKeyIT
Running org.apache.phoenix.end2end.AlterTableIT
Tests run: 3, Failures: 0, Errors: 0, Skipped: 0, Time elapsed: 10.672 sec - in org.apache.phoenix.end2end.UpsertSelectAutoCommitIT
Running org.apache.phoenix.end2end.TenantSpecificViewIndexIT
Tests run: 6, Failures: 0, Errors: 0, Skipped: 0, Time elapsed: 12.557 sec - in org.apache.phoenix.end2end.TenantSpecificViewIndexIT
Running org.apache.phoenix.end2end.salted.SaltedTableVarLengthRowKeyIT
Tests run: 1, Failures: 0, Errors: 0, Skipped: 0, Time elapsed: 2.892 sec - in org.apache.phoenix.end2end.salted.SaltedTableVarLengthRowKeyIT
Running org.apache.phoenix.end2end.salted.SaltedTableUpsertSelectIT
Tests run: 4, Failures: 0, Errors: 0, Skipped: 0, Time elapsed: 31.708 sec - in org.apache.phoenix.end2end.QueryMoreIT
Running org.apache.phoenix.end2end.SaltedViewIT
Tests run: 5, Failures: 0, Errors: 0, Skipped: 0, Time elapsed: 9.234 sec - in org.apache.phoenix.end2end.salted.SaltedTableUpsertSelectIT
Running org.apache.phoenix.end2end.SkipScanAfterManualSplitIT
Tests run: 16, Failures: 0, Errors: 0, Skipped: 0, Time elapsed: 29.292 sec - in org.apache.phoenix.end2end.AlterTableIT
Running org.apache.phoenix.end2end.RegexpSplitFunctionIT
Tests run: 11, Failures: 0, Errors: 0, Skipped: 0, Time elapsed: 3.614 sec - in org.apache.phoenix.end2end.RegexpSplitFunctionIT
Running org.apache.phoenix.end2end.SubqueryIT
Tests run: 2, Failures: 0, Errors: 0, Skipped: 0, Time elapsed: 8.859 sec - in org.apache.phoenix.end2end.SaltedViewIT
Running org.apache.phoenix.end2end.CoalesceFunctionIT
Tests run: 10, Failures: 0, Errors: 0, Skipped: 0, Time elapsed: 7.379 sec - in org.apache.phoenix.end2end.CoalesceFunctionIT
Running org.apache.phoenix.end2end.index.LocalIndexIT
Tests run: 3, Failures: 0, Errors: 0, Skipped: 0, Time elapsed: 23.761 sec - in org.apache.phoenix.end2end.SkipScanAfterManualSplitIT
Running org.apache.phoenix.end2end.index.SaltedIndexIT
Tests run: 5, Failures: 0, Errors: 0, Skipped: 0, Time elapsed: 88.941 sec - in org.apache.phoenix.trace.PhoenixTracingEndToEndIT
Running org.apache.phoenix.end2end.index.IndexMetadataIT
Tests run: 96, Failures: 0, Errors: 0, Skipped: 0, Time elapsed: 90.447 sec - in org.apache.phoenix.end2end.HashJoinIT
Running org.apache.phoenix.end2end.index.MutableIndexIT
Tests run: 9, Failures: 0, Errors: 0, Skipped: 0, Time elapsed: 29.557 sec - in org.apache.phoenix.end2end.SubqueryIT
Running org.apache.phoenix.end2end.index.DropViewIT
Tests run: 1, Failures: 0, Errors: 0, Skipped: 0, Time elapsed: 2.985 sec - in org.apache.phoenix.end2end.index.DropViewIT
Running org.apache.phoenix.end2end.index.ViewIndexIT
Tests run: 3, Failures: 0, Errors: 0, Skipped: 0, Time elapsed: 14.592 sec - in org.apache.phoenix.end2end.index.SaltedIndexIT
Running org.apache.phoenix.end2end.index.ImmutableIndexIT
Tests run: 1, Failures: 0, Errors: 0, Skipped: 0, Time elapsed: 4.231 sec - in org.apache.phoenix.end2end.index.ViewIndexIT
Running org.apache.phoenix.end2end.ServerExceptionIT
Tests run: 1, Failures: 0, Errors: 0, Skipped: 0, Time elapsed: 1.712 sec - in org.apache.phoenix.end2end.ServerExceptionIT
Running org.apache.phoenix.end2end.CSVCommonsLoaderIT
Tests run: 4, Failures: 0, Errors: 0, Skipped: 0, Time elapsed: 19.186 sec - in org.apache.phoenix.end2end.index.IndexMetadataIT
Running org.apache.phoenix.end2end.ReverseFunctionIT
Tests run: 5, Failures: 0, Errors: 0, Skipped: 0, Time elapsed: 3.106 sec - in org.apache.phoenix.end2end.ReverseFunctionIT
Running org.apache.phoenix.end2end.AutoCommitIT
Tests run: 1, Failures: 0, Errors: 0, Skipped: 0, Time elapsed: 2.763 sec - in org.apache.phoenix.end2end.AutoCommitIT
Running org.apache.phoenix.end2end.SpillableGroupByIT
Tests run: 13, Failures: 0, Errors: 0, Skipped: 0, Time elapsed: 16.071 sec - in org.apache.phoenix.end2end.index.ImmutableIndexIT
Running org.apache.phoenix.end2end.TenantSpecificViewIndexSaltedIT
Tests run: 1, Failures: 0, Errors: 0, Skipped: 0, Time elapsed: 3.351 sec - in org.apache.phoenix.end2end.SpillableGroupByIT
Running org.apache.phoenix.end2end.DecodeFunctionIT
Tests run: 14, Failures: 0, Errors: 0, Skipped: 0, Time elapsed: 14.605 sec - in org.apache.phoenix.end2end.CSVCommonsLoaderIT
Running org.apache.phoenix.end2end.ModulusExpressionIT
Tests run: 6, Failures: 0, Errors: 0, Skipped: 0, Time elapsed: 2.276 sec - in org.apache.phoenix.end2end.DecodeFunctionIT
Running org.apache.phoenix.end2end.LastValueFunctionIT
Tests run: 11, Failures: 0, Errors: 0, Skipped: 0, Time elapsed: 4.294 sec - in org.apache.phoenix.end2end.ModulusExpressionIT
Running org.apache.phoenix.end2end.FirstValueFunctionIT
Tests run: 4, Failures: 0, Errors: 0, Skipped: 0, Time elapsed: 8.495 sec - in org.apache.phoenix.end2end.TenantSpecificViewIndexSaltedIT
Running org.apache.phoenix.end2end.UpsertBigValuesIT
Tests run: 11, Failures: 0, Errors: 0, Skipped: 0, Time elapsed: 4.892 sec - in org.apache.phoenix.end2end.LastValueFunctionIT
Running org.apache.phoenix.end2end.MD5FunctionIT
Tests run: 7, Failures: 0, Errors: 0, Skipped: 0, Time elapsed: 2.977 sec - in org.apache.phoenix.end2end.FirstValueFunctionIT
Running org.apache.phoenix.end2end.PhoenixEncodeDecodeIT
Tests run: 2, Failures: 0, Errors: 0, Skipped: 0, Time elapsed: 4.756 sec - in org.apache.phoenix.end2end.MD5FunctionIT
Running org.apache.phoenix.end2end.LpadFunctionIT
Tests run: 4, Failures: 0, Errors: 0, Skipped: 0, Time elapsed: 7.149 sec - in org.apache.phoenix.end2end.UpsertBigValuesIT
Running org.apache.phoenix.end2end.QueryExecWithoutSCNIT
Tests run: 1, Failures: 0, Errors: 0, Skipped: 0, Time elapsed: 2.421 sec - in org.apache.phoenix.end2end.QueryExecWithoutSCNIT
Running org.apache.phoenix.end2end.DynamicFamilyIT
Tests run: 5, Failures: 0, Errors: 0, Skipped: 0, Time elapsed: 7.312 sec - in org.apache.phoenix.end2end.PhoenixEncodeDecodeIT
Running org.apache.phoenix.end2end.RoundFloorCeilFunctionsEnd2EndIT
Tests run: 10, Failures: 0, Errors: 0, Skipped: 0, Time elapsed: 7.429 sec - in org.apache.phoenix.end2end.LpadFunctionIT
Running org.apache.phoenix.end2end.DeleteIT
Tests run: 4, Failures: 0, Errors: 0, Skipped: 0, Time elapsed: 4.475 sec - in org.apache.phoenix.end2end.DynamicFamilyIT
Running org.apache.phoenix.end2end.InListIT
Tests run: 30, Failures: 0, Errors: 0, Skipped: 0, Time elapsed: 5.384 sec - in org.apache.phoenix.end2end.RoundFloorCeilFunctionsEnd2EndIT
Running org.apache.phoenix.end2end.EvaluationOfORIT
Tests run: 1, Failures: 0, Errors: 0, Skipped: 0, Time elapsed: 1.692 sec - in org.apache.phoenix.end2end.EvaluationOfORIT
Running org.apache.phoenix.end2end.ReverseScanIT
Tests run: 16, Failures: 0, Errors: 0, Skipped: 1, Time elapsed: 65.921 sec - in org.apache.phoenix.end2end.index.LocalIndexIT
Running org.apache.phoenix.end2end.NthValueFunctionIT
Tests run: 2, Failures: 0, Errors: 0, Skipped: 0, Time elapsed: 2.759 sec - in org.apache.phoenix.end2end.ReverseScanIT
Running org.apache.phoenix.end2end.ParallelIteratorsIT
Tests run: 5, Failures: 0, Errors: 0, Skipped: 0, Time elapsed: 4.256 sec - in org.apache.phoenix.end2end.NthValueFunctionIT
Running org.apache.phoenix.end2end.ReadOnlyIT
Tests run: 1, Failures: 0, Errors: 0, Skipped: 0, Time elapsed: 1.726 sec - in org.apache.phoenix.end2end.ReadOnlyIT
Running org.apache.phoenix.end2end.ExecuteStatementsIT
Tests run: 2, Failures: 0, Errors: 0, Skipped: 0, Time elapsed: 5.946 sec - in org.apache.phoenix.end2end.ParallelIteratorsIT
Tests run: 20, Failures: 0, Errors: 0, Skipped: 0, Time elapsed: 20.015 sec - in org.apache.phoenix.end2end.DeleteIT
Tests run: 2, Failures: 0, Errors: 0, Skipped: 0, Time elapsed: 10.046 sec - in org.apache.phoenix.end2end.ExecuteStatementsIT
Tests run: 28, Failures: 0, Errors: 0, Skipped: 0, Time elapsed: 104.602 sec - in org.apache.phoenix.end2end.index.MutableIndexIT
Tests run: 25, Failures: 0, Errors: 0, Skipped: 0, Time elapsed: 85.543 sec - in org.apache.phoenix.end2end.InListIT

Results :

Tests run: 512, Failures: 0, Errors: 0, Skipped: 1

[INFO] 
[INFO] --- maven-failsafe-plugin:2.17:integration-test (NeedTheirOwnClusterTests) @ phoenix-core
---
[INFO] Failsafe report directory: <https://builds.apache.org/job/Phoenix-master/ws/phoenix-core/target/failsafe-reports>
[INFO] parallel='none', perCoreThreadCount=true, threadCount=0, useUnlimitedThreads=false,
threadCountSuites=0, threadCountClasses=0, threadCountMethods=0, parallelOptimized=true

-------------------------------------------------------
 T E S T S
-------------------------------------------------------

-------------------------------------------------------
 T E S T S
-------------------------------------------------------
Running org.apache.phoenix.end2end.index.MutableIndexFailureIT
Running org.apache.phoenix.end2end.index.DropIndexDuringUpsertIT
Running org.apache.phoenix.end2end.ContextClassloaderIT
Running org.apache.phoenix.end2end.index.MutableIndexReplicationIT
Tests run: 3, Failures: 0, Errors: 0, Skipped: 0, Time elapsed: 2.233 sec - in org.apache.phoenix.end2end.ContextClassloaderIT
Running org.apache.phoenix.mapreduce.CsvBulkLoadToolIT
Running org.apache.phoenix.hbase.index.covered.EndToEndCoveredColumnsIndexBuilderIT
Tests run: 1, Failures: 0, Errors: 0, Skipped: 0, Time elapsed: 6.642 sec - in org.apache.phoenix.end2end.index.MutableIndexReplicationIT
Running org.apache.phoenix.hbase.index.covered.example.EndtoEndIndexingWithCompressionIT
Tests run: 2, Failures: 0, Errors: 0, Skipped: 0, Time elapsed: 8.615 sec - in org.apache.phoenix.hbase.index.covered.EndToEndCoveredColumnsIndexBuilderIT
Running org.apache.phoenix.hbase.index.covered.example.EndToEndCoveredIndexingIT
Tests run: 11, Failures: 0, Errors: 0, Skipped: 0, Time elapsed: 48.409 sec - in org.apache.phoenix.hbase.index.covered.example.EndtoEndIndexingWithCompressionIT
Tests run: 1, Failures: 0, Errors: 0, Skipped: 0, Time elapsed: 79.16 sec - in org.apache.phoenix.end2end.index.DropIndexDuringUpsertIT
Running org.apache.phoenix.hbase.index.covered.example.FailWithoutRetriesIT
Running org.apache.phoenix.hbase.index.balancer.IndexLoadBalancerIT
Tests run: 11, Failures: 0, Errors: 0, Skipped: 0, Time elapsed: 48.125 sec - in org.apache.phoenix.hbase.index.covered.example.EndToEndCoveredIndexingIT
Running org.apache.phoenix.hbase.index.FailForUnsupportedHBaseVersionsIT
Tests run: 1, Failures: 0, Errors: 0, Skipped: 0, Time elapsed: 8.982 sec - in org.apache.phoenix.hbase.index.covered.example.FailWithoutRetriesIT
Tests run: 2, Failures: 0, Errors: 0, Skipped: 0, Time elapsed: 15.828 sec - in org.apache.phoenix.hbase.index.FailForUnsupportedHBaseVersionsIT
Tests run: 3, Failures: 0, Errors: 0, Skipped: 0, Time elapsed: 139.498 sec - in org.apache.phoenix.end2end.index.MutableIndexFailureIT
Tests run: 9, Failures: 0, Errors: 0, Skipped: 0, Time elapsed: 108.148 sec - in org.apache.phoenix.hbase.index.balancer.IndexLoadBalancerIT
Tests run: 4, Failures: 0, Errors: 0, Skipped: 0, Time elapsed: 175.164 sec - in org.apache.phoenix.mapreduce.CsvBulkLoadToolIT

Results :

Tests run: 48, Failures: 0, Errors: 0, Skipped: 0

[INFO] 
[INFO] --- maven-failsafe-plugin:2.17:verify (ClientManagedTimeTests) @ phoenix-core ---
[INFO] Failsafe report directory: <https://builds.apache.org/job/Phoenix-master/ws/phoenix-core/target/failsafe-reports>
[INFO] ------------------------------------------------------------------------
[INFO] Reactor Summary:
[INFO] 
[INFO] Apache Phoenix .................................... SUCCESS [1.844s]
[INFO] Phoenix Hadoop Compatibility ...................... SUCCESS [2.744s]
[INFO] Phoenix Hadoop2 Compatibility ..................... SUCCESS [2.584s]
[INFO] Phoenix Core ...................................... FAILURE [12:31.563s]
[INFO] Phoenix - Flume ................................... SKIPPED
[INFO] Phoenix - Pig ..................................... SKIPPED
[INFO] Phoenix Assembly .................................. SKIPPED
[INFO] ------------------------------------------------------------------------
[INFO] BUILD FAILURE
[INFO] ------------------------------------------------------------------------
[INFO] Total time: 12:39.152s
[INFO] Finished at: Mon Oct 06 23:21:35 UTC 2014
[INFO] Final Memory: 49M/843M
[INFO] ------------------------------------------------------------------------
[ERROR] Failed to execute goal org.apache.maven.plugins:maven-failsafe-plugin:2.17:verify
(ClientManagedTimeTests) on project phoenix-core: There are test failures.
[ERROR] 
[ERROR] Please refer to <https://builds.apache.org/job/Phoenix-master/ws/phoenix-core/target/failsafe-reports>
for the individual test results.
[ERROR] -> [Help 1]
[ERROR] 
[ERROR] To see the full stack trace of the errors, re-run Maven with the -e switch.
[ERROR] Re-run Maven using the -X switch to enable full debug logging.
[ERROR] 
[ERROR] For more information about the errors and possible solutions, please read the following
articles:
[ERROR] [Help 1] http://cwiki.apache.org/confluence/display/MAVEN/MojoFailureException
[ERROR] 
[ERROR] After correcting the problems, you can resume the build with the command
[ERROR]   mvn <goals> -rf :phoenix-core
Build step 'Invoke top-level Maven targets' marked build as failure
Archiving artifacts
Sending artifact delta relative to Phoenix | Master #404
Archived 662 artifacts
Archive block size is 32768
Received 3001 blocks and 373637152 bytes
Compression is 20.8%
Took 1 min 56 sec
Updating PHOENIX-1321
Recording test results

Mime
View raw message