phoenix-commits mailing list archives

Site index · List index
Message view « Date » · « Thread »
Top « Date » · « Thread »
From Apache Jenkins Server <jenk...@builds.apache.org>
Subject Build failed in Jenkins: Phoenix | 3.0 | Hadoop1 #226
Date Thu, 25 Sep 2014 18:40:40 GMT
See <https://builds.apache.org/job/Phoenix-3.0-hadoop1/226/changes>

Changes:

[larsh] PHOENIX-1281 Each MultiKeyValueTuple.setKeyValues creates a new immutable list object.

------------------------------------------
[...truncated 572 lines...]
	at org.junit.runners.Suite.runChild(Suite.java:127)
	at org.junit.runners.Suite.runChild(Suite.java:26)
	at org.junit.runners.ParentRunner$3.run(ParentRunner.java:238)
	at org.junit.runners.ParentRunner$1.schedule(ParentRunner.java:63)
	at org.junit.runners.ParentRunner.runChildren(ParentRunner.java:236)
	at org.junit.runners.ParentRunner.access$000(ParentRunner.java:53)
	at org.junit.runners.ParentRunner$2.evaluate(ParentRunner.java:229)
	at org.junit.runners.ParentRunner.run(ParentRunner.java:309)
	at org.junit.runner.JUnitCore.run(JUnitCore.java:160)
	at org.junit.runner.JUnitCore.run(JUnitCore.java:138)
	at org.apache.maven.surefire.junitcore.JUnitCoreWrapper.createRequestAndRun(JUnitCoreWrapper.java:113)
	at org.apache.maven.surefire.junitcore.JUnitCoreWrapper.executeLazy(JUnitCoreWrapper.java:94)
	at org.apache.maven.surefire.junitcore.JUnitCoreWrapper.execute(JUnitCoreWrapper.java:58)
	at org.apache.maven.surefire.junitcore.JUnitCoreProvider.invoke(JUnitCoreProvider.java:134)
	at org.apache.maven.surefire.booter.ForkedBooter.invokeProviderInSameClassLoader(ForkedBooter.java:200)
	at org.apache.maven.surefire.booter.ForkedBooter.runSuitesInProcess(ForkedBooter.java:153)
	at org.apache.maven.surefire.booter.ForkedBooter.main(ForkedBooter.java:103)

org.apache.phoenix.end2end.SkipScanAfterManualSplitIT  Time elapsed: 7,184.882 sec  <<<
FAILURE!
java.lang.AssertionError: null
	at org.junit.Assert.fail(Assert.java:86)
	at org.junit.Assert.assertTrue(Assert.java:41)
	at org.junit.Assert.assertTrue(Assert.java:52)
	at org.apache.phoenix.end2end.BaseHBaseManagedTimeIT.dropTables(BaseHBaseManagedTimeIT.java:70)
	at sun.reflect.NativeMethodAccessorImpl.invoke0(Native Method)
	at sun.reflect.NativeMethodAccessorImpl.invoke(NativeMethodAccessorImpl.java:57)
	at sun.reflect.DelegatingMethodAccessorImpl.invoke(DelegatingMethodAccessorImpl.java:43)
	at java.lang.reflect.Method.invoke(Method.java:606)
	at org.junit.runners.model.FrameworkMethod$1.runReflectiveCall(FrameworkMethod.java:47)
	at org.junit.internal.runners.model.ReflectiveCallable.run(ReflectiveCallable.java:12)
	at org.junit.runners.model.FrameworkMethod.invokeExplosively(FrameworkMethod.java:44)
	at org.junit.internal.runners.statements.RunAfters.evaluate(RunAfters.java:33)
	at org.junit.runners.ParentRunner.run(ParentRunner.java:309)
	at org.junit.runners.Suite.runChild(Suite.java:127)
	at org.junit.runners.Suite.runChild(Suite.java:26)
	at org.junit.runners.ParentRunner$3.run(ParentRunner.java:238)
	at org.junit.runners.ParentRunner$1.schedule(ParentRunner.java:63)
	at org.junit.runners.ParentRunner.runChildren(ParentRunner.java:236)
	at org.junit.runners.ParentRunner.access$000(ParentRunner.java:53)
	at org.junit.runners.ParentRunner$2.evaluate(ParentRunner.java:229)
	at org.junit.runners.ParentRunner.run(ParentRunner.java:309)
	at org.junit.runner.JUnitCore.run(JUnitCore.java:160)
	at org.junit.runner.JUnitCore.run(JUnitCore.java:138)
	at org.apache.maven.surefire.junitcore.JUnitCoreWrapper.createRequestAndRun(JUnitCoreWrapper.java:113)
	at org.apache.maven.surefire.junitcore.JUnitCoreWrapper.executeLazy(JUnitCoreWrapper.java:94)
	at org.apache.maven.surefire.junitcore.JUnitCoreWrapper.execute(JUnitCoreWrapper.java:58)
	at org.apache.maven.surefire.junitcore.JUnitCoreProvider.invoke(JUnitCoreProvider.java:134)
	at org.apache.maven.surefire.booter.ForkedBooter.invokeProviderInSameClassLoader(ForkedBooter.java:200)
	at org.apache.maven.surefire.booter.ForkedBooter.runSuitesInProcess(ForkedBooter.java:153)
	at org.apache.maven.surefire.booter.ForkedBooter.main(ForkedBooter.java:103)


Results :

Failed tests: 
  SkipScanAfterManualSplitIT>BaseHBaseManagedTimeIT.dropTables:70 null

Tests in error: 
  SkipScanAfterManualSplitIT>BaseHBaseManagedTimeIT.cleanUpAfterTest:56->BaseTest.deletePriorTables:683->BaseTest.deletePriorTables:693->BaseTest.deletePriorTables:727
? PhoenixIO

Tests run: 409, Failures: 1, Errors: 1, Skipped: 0

[INFO] 
[INFO] --- maven-failsafe-plugin:2.17:integration-test (ClientManagedTimeTests) @ phoenix-core
---
[INFO] Failsafe report directory: <https://builds.apache.org/job/Phoenix-3.0-hadoop1/ws/phoenix-core/target/failsafe-reports>
[INFO] parallel='none', perCoreThreadCount=true, threadCount=0, useUnlimitedThreads=false,
threadCountSuites=0, threadCountClasses=0, threadCountMethods=0, parallelOptimized=true

-------------------------------------------------------
 T E S T S
-------------------------------------------------------

-------------------------------------------------------
 T E S T S
-------------------------------------------------------
Running org.apache.phoenix.end2end.NotQueryIT
Running org.apache.phoenix.end2end.StddevIT
Running org.apache.phoenix.end2end.ProductMetricsIT
Running org.apache.phoenix.end2end.DistinctCountIT
Tests run: 4, Failures: 0, Errors: 0, Skipped: 0, Time elapsed: 17.889 sec - in org.apache.phoenix.end2end.StddevIT
Running org.apache.phoenix.end2end.TopNIT
Tests run: 4, Failures: 0, Errors: 0, Skipped: 0, Time elapsed: 16.893 sec - in org.apache.phoenix.end2end.TopNIT
Running org.apache.phoenix.end2end.CaseStatementIT
Tests run: 10, Failures: 0, Errors: 0, Skipped: 0, Time elapsed: 36.738 sec - in org.apache.phoenix.end2end.DistinctCountIT
Running org.apache.phoenix.end2end.CastAndCoerceIT
Tests run: 44, Failures: 0, Errors: 0, Skipped: 0, Time elapsed: 100.019 sec - in org.apache.phoenix.end2end.NotQueryIT
Running org.apache.phoenix.end2end.TenantSpecificTablesDMLIT
Tests run: 61, Failures: 0, Errors: 0, Skipped: 0, Time elapsed: 94.874 sec - in org.apache.phoenix.end2end.ProductMetricsIT
Running org.apache.phoenix.end2end.TenantSpecificTablesDDLIT
Tests run: 36, Failures: 0, Errors: 0, Skipped: 0, Time elapsed: 78.706 sec - in org.apache.phoenix.end2end.CaseStatementIT
Running org.apache.phoenix.end2end.InMemoryOrderByIT
Tests run: 28, Failures: 0, Errors: 0, Skipped: 0, Time elapsed: 74.069 sec - in org.apache.phoenix.end2end.CastAndCoerceIT
Running org.apache.phoenix.end2end.ReadIsolationLevelIT
Tests run: 3, Failures: 0, Errors: 0, Skipped: 1, Time elapsed: 7.274 sec - in org.apache.phoenix.end2end.InMemoryOrderByIT
Tests run: 2, Failures: 0, Errors: 0, Skipped: 0, Time elapsed: 6.38 sec - in org.apache.phoenix.end2end.ReadIsolationLevelIT
Running org.apache.phoenix.end2end.ClientTimeArithmeticQueryIT
Running org.apache.phoenix.end2end.DefaultParallelIteratorsRegionSplitterIT
Tests run: 2, Failures: 0, Errors: 0, Skipped: 0, Time elapsed: 9.275 sec - in org.apache.phoenix.end2end.DefaultParallelIteratorsRegionSplitterIT
Running org.apache.phoenix.end2end.ColumnProjectionOptimizationIT
Tests run: 14, Failures: 0, Errors: 0, Skipped: 0, Time elapsed: 46.341 sec - in org.apache.phoenix.end2end.TenantSpecificTablesDMLIT
Running org.apache.phoenix.end2end.CustomEntityDataIT
Tests run: 3, Failures: 0, Errors: 0, Skipped: 0, Time elapsed: 7.28 sec - in org.apache.phoenix.end2end.CustomEntityDataIT
Running org.apache.phoenix.end2end.UpsertSelectIT
Tests run: 3, Failures: 0, Errors: 0, Skipped: 0, Time elapsed: 22.858 sec - in org.apache.phoenix.end2end.ColumnProjectionOptimizationIT
Running org.apache.phoenix.end2end.SpooledOrderByIT
Tests run: 3, Failures: 0, Errors: 0, Skipped: 1, Time elapsed: 7.604 sec - in org.apache.phoenix.end2end.SpooledOrderByIT
Running org.apache.phoenix.end2end.VariableLengthPKIT
Tests run: 18, Failures: 0, Errors: 0, Skipped: 0, Time elapsed: 82.097 sec - in org.apache.phoenix.end2end.TenantSpecificTablesDDLIT
Running org.apache.phoenix.end2end.ScanQueryIT
Tests run: 12, Failures: 0, Errors: 0, Skipped: 0, Time elapsed: 75.411 sec - in org.apache.phoenix.end2end.UpsertSelectIT
Running org.apache.phoenix.end2end.KeyOnlyIT
Tests run: 2, Failures: 0, Errors: 0, Skipped: 0, Time elapsed: 9.122 sec - in org.apache.phoenix.end2end.KeyOnlyIT
Running org.apache.phoenix.end2end.DynamicUpsertIT
Tests run: 7, Failures: 0, Errors: 0, Skipped: 0, Time elapsed: 5.041 sec - in org.apache.phoenix.end2end.DynamicUpsertIT
Running org.apache.phoenix.end2end.CreateTableIT
Tests run: 50, Failures: 0, Errors: 0, Skipped: 0, Time elapsed: 88.454 sec - in org.apache.phoenix.end2end.VariableLengthPKIT
Running org.apache.phoenix.end2end.DynamicColumnIT
Tests run: 5, Failures: 0, Errors: 0, Skipped: 0, Time elapsed: 5.999 sec - in org.apache.phoenix.end2end.DynamicColumnIT
Running org.apache.phoenix.end2end.DerivedTableIT
Tests run: 11, Failures: 0, Errors: 0, Skipped: 0, Time elapsed: 53.454 sec - in org.apache.phoenix.end2end.CreateTableIT
Running org.apache.phoenix.end2end.MultiCfQueryExecIT
Tests run: 68, Failures: 0, Errors: 0, Skipped: 0, Time elapsed: 128.564 sec - in org.apache.phoenix.end2end.ScanQueryIT
Running org.apache.phoenix.end2end.UpsertValuesIT
Tests run: 16, Failures: 0, Errors: 0, Skipped: 0, Time elapsed: 40.755 sec - in org.apache.phoenix.end2end.DerivedTableIT
Running org.apache.phoenix.end2end.GroupByIT
Tests run: 116, Failures: 0, Errors: 0, Skipped: 0, Time elapsed: 194.571 sec - in org.apache.phoenix.end2end.ClientTimeArithmeticQueryIT
Running org.apache.phoenix.end2end.SequenceIT
Tests run: 7, Failures: 0, Errors: 0, Skipped: 0, Time elapsed: 21.796 sec - in org.apache.phoenix.end2end.MultiCfQueryExecIT
Running org.apache.phoenix.end2end.ArrayIT
Tests run: 12, Failures: 0, Errors: 0, Skipped: 0, Time elapsed: 44.519 sec - in org.apache.phoenix.end2end.UpsertValuesIT
Running org.apache.phoenix.end2end.RowValueConstructorIT
Tests run: 49, Failures: 0, Errors: 0, Skipped: 0, Time elapsed: 69.453 sec - in org.apache.phoenix.end2end.SequenceIT
Running org.apache.phoenix.end2end.ExtendedQueryExecIT
Tests run: 48, Failures: 0, Errors: 0, Skipped: 0, Time elapsed: 68.818 sec - in org.apache.phoenix.end2end.ArrayIT
Running org.apache.phoenix.end2end.QueryIT
Tests run: 4, Failures: 0, Errors: 0, Skipped: 0, Time elapsed: 10.723 sec - in org.apache.phoenix.end2end.ExtendedQueryExecIT
Running org.apache.phoenix.end2end.IsNullIT
Tests run: 2, Failures: 0, Errors: 0, Skipped: 0, Time elapsed: 8.55 sec - in org.apache.phoenix.end2end.IsNullIT
Running org.apache.phoenix.end2end.ToCharFunctionIT
Tests run: 34, Failures: 0, Errors: 0, Skipped: 0, Time elapsed: 56.217 sec - in org.apache.phoenix.end2end.RowValueConstructorIT
Running org.apache.phoenix.end2end.FunkyNamesIT
Tests run: 3, Failures: 0, Errors: 0, Skipped: 0, Time elapsed: 7.364 sec - in org.apache.phoenix.end2end.FunkyNamesIT
Tests run: 10, Failures: 0, Errors: 0, Skipped: 0, Time elapsed: 13.022 sec - in org.apache.phoenix.end2end.ToCharFunctionIT
Running org.apache.phoenix.end2end.salted.SaltedTableIT
Running org.apache.phoenix.end2end.NativeHBaseTypesIT
Tests run: 52, Failures: 0, Errors: 0, Skipped: 0, Time elapsed: 115.671 sec - in org.apache.phoenix.end2end.GroupByIT
Running org.apache.phoenix.end2end.salted.SaltedTableVarLengthRowKeyIT
Tests run: 7, Failures: 0, Errors: 0, Skipped: 0, Time elapsed: 8.081 sec - in org.apache.phoenix.end2end.NativeHBaseTypesIT
Tests run: 1, Failures: 0, Errors: 0, Skipped: 0, Time elapsed: 6.939 sec - in org.apache.phoenix.end2end.salted.SaltedTableVarLengthRowKeyIT
Running org.apache.phoenix.end2end.CompareDecimalToLongIT
Running org.apache.phoenix.end2end.TruncateFunctionIT
Tests run: 8, Failures: 0, Errors: 0, Skipped: 0, Time elapsed: 13.2 sec - in org.apache.phoenix.end2end.salted.SaltedTableIT
Running org.apache.phoenix.end2end.StatsManagerIT
Tests run: 1, Failures: 0, Errors: 0, Skipped: 0, Time elapsed: 4.913 sec - in org.apache.phoenix.end2end.TruncateFunctionIT
Running org.apache.phoenix.end2end.QueryDatabaseMetaDataIT
Tests run: 8, Failures: 0, Errors: 0, Skipped: 0, Time elapsed: 12.227 sec - in org.apache.phoenix.end2end.CompareDecimalToLongIT
Running org.apache.phoenix.end2end.SkipRangeParallelIteratorRegionSplitterIT
Tests run: 1, Failures: 0, Errors: 0, Skipped: 0, Time elapsed: 19.404 sec - in org.apache.phoenix.end2end.StatsManagerIT
Running org.apache.phoenix.end2end.PercentileIT
Tests run: 8, Failures: 0, Errors: 0, Skipped: 0, Time elapsed: 17.145 sec - in org.apache.phoenix.end2end.SkipRangeParallelIteratorRegionSplitterIT
Running org.apache.phoenix.end2end.ToNumberFunctionIT
Tests run: 18, Failures: 0, Errors: 0, Skipped: 0, Time elapsed: 23.261 sec - in org.apache.phoenix.end2end.ToNumberFunctionIT
Running org.apache.phoenix.end2end.OrderByIT
Tests run: 17, Failures: 0, Errors: 0, Skipped: 0, Time elapsed: 32.135 sec - in org.apache.phoenix.end2end.PercentileIT
Running org.apache.phoenix.end2end.GroupByCaseIT
Tests run: 3, Failures: 0, Errors: 0, Skipped: 0, Time elapsed: 6.417 sec - in org.apache.phoenix.end2end.GroupByCaseIT
Tests run: 3, Failures: 0, Errors: 0, Skipped: 1, Time elapsed: 9.085 sec - in org.apache.phoenix.end2end.OrderByIT
Tests run: 15, Failures: 0, Errors: 0, Skipped: 0, Time elapsed: 89.903 sec - in org.apache.phoenix.end2end.QueryDatabaseMetaDataIT
Tests run: 104, Failures: 0, Errors: 0, Skipped: 0, Time elapsed: 256.703 sec - in org.apache.phoenix.end2end.QueryIT

Results :

Tests run: 937, Failures: 0, Errors: 0, Skipped: 3

[INFO] 
[INFO] --- maven-failsafe-plugin:2.17:integration-test (NeedTheirOwnClusterTests) @ phoenix-core
---
[INFO] Failsafe report directory: <https://builds.apache.org/job/Phoenix-3.0-hadoop1/ws/phoenix-core/target/failsafe-reports>
[INFO] parallel='none', perCoreThreadCount=true, threadCount=0, useUnlimitedThreads=false,
threadCountSuites=0, threadCountClasses=0, threadCountMethods=0, parallelOptimized=true

-------------------------------------------------------
 T E S T S
-------------------------------------------------------

-------------------------------------------------------
 T E S T S
-------------------------------------------------------
Running org.apache.phoenix.hbase.index.FailForUnsupportedHBaseVersionsIT
Running org.apache.phoenix.hbase.index.covered.example.FailWithoutRetriesIT
Running org.apache.phoenix.hbase.index.covered.EndToEndCoveredColumnsIndexBuilderIT
Tests run: 1, Failures: 0, Errors: 0, Skipped: 0, Time elapsed: 7.026 sec - in org.apache.phoenix.hbase.index.covered.example.FailWithoutRetriesIT
Running org.apache.phoenix.hbase.index.covered.example.EndToEndCoveredIndexingIT
Tests run: 2, Failures: 0, Errors: 0, Skipped: 0, Time elapsed: 82.386 sec - in org.apache.phoenix.hbase.index.FailForUnsupportedHBaseVersionsIT
Running org.apache.phoenix.end2end.index.MutableIndexFailureIT
Tests run: 2, Failures: 0, Errors: 0, Skipped: 0, Time elapsed: 14.833 sec - in org.apache.phoenix.hbase.index.covered.EndToEndCoveredColumnsIndexBuilderIT
Running org.apache.phoenix.hbase.index.covered.example.EndtoEndIndexingWithCompressionIT
Running org.apache.phoenix.end2end.ContextClassloaderIT
Tests run: 3, Failures: 0, Errors: 0, Skipped: 0, Time elapsed: 12.056 sec - in org.apache.phoenix.end2end.ContextClassloaderIT
Tests run: 11, Failures: 0, Errors: 0, Skipped: 0, Time elapsed: 99.1 sec - in org.apache.phoenix.hbase.index.covered.example.EndToEndCoveredIndexingIT
Tests run: 11, Failures: 0, Errors: 0, Skipped: 0, Time elapsed: 107.165 sec - in org.apache.phoenix.hbase.index.covered.example.EndtoEndIndexingWithCompressionIT
Running org.apache.phoenix.mapreduce.CsvBulkLoadToolIT
Tests run: 2, Failures: 0, Errors: 0, Skipped: 0, Time elapsed: 271.97 sec - in org.apache.phoenix.end2end.index.MutableIndexFailureIT
Tests run: 4, Failures: 0, Errors: 0, Skipped: 0, Time elapsed: 291.715 sec - in org.apache.phoenix.mapreduce.CsvBulkLoadToolIT

Results :

Tests run: 36, Failures: 0, Errors: 0, Skipped: 0

[INFO] 
[INFO] --- maven-failsafe-plugin:2.17:verify (HBaseManagedTimeTests) @ phoenix-core ---
[INFO] Failsafe report directory: <https://builds.apache.org/job/Phoenix-3.0-hadoop1/ws/phoenix-core/target/failsafe-reports>
[INFO] ------------------------------------------------------------------------
[INFO] Reactor Summary:
[INFO] 
[INFO] Apache Phoenix .................................... SUCCESS [17.772s]
[INFO] Phoenix Hadoop Compatibility ...................... SUCCESS [3.776s]
[INFO] Phoenix Core ...................................... FAILURE [2:34:15.188s]
[INFO] Phoenix - Flume ................................... SKIPPED
[INFO] Phoenix - Pig ..................................... SKIPPED
[INFO] Phoenix Hadoop1 Compatibility ..................... SKIPPED
[INFO] Phoenix Assembly .................................. SKIPPED
[INFO] ------------------------------------------------------------------------
[INFO] BUILD FAILURE
[INFO] ------------------------------------------------------------------------
[INFO] Total time: 2:34:40.833s
[INFO] Finished at: Thu Sep 25 18:33:13 UTC 2014
[INFO] Final Memory: 24M/346M
[INFO] ------------------------------------------------------------------------
[ERROR] Failed to execute goal org.apache.maven.plugins:maven-failsafe-plugin:2.17:verify
(HBaseManagedTimeTests) on project phoenix-core: There are test failures.
[ERROR] 
[ERROR] Please refer to <https://builds.apache.org/job/Phoenix-3.0-hadoop1/ws/phoenix-core/target/failsafe-reports>
for the individual test results.
[ERROR] -> [Help 1]
[ERROR] 
[ERROR] To see the full stack trace of the errors, re-run Maven with the -e switch.
[ERROR] Re-run Maven using the -X switch to enable full debug logging.
[ERROR] 
[ERROR] For more information about the errors and possible solutions, please read the following
articles:
[ERROR] [Help 1] http://cwiki.apache.org/confluence/display/MAVEN/MojoFailureException
[ERROR] 
[ERROR] After correcting the problems, you can resume the build with the command
[ERROR]   mvn <goals> -rf :phoenix-core
Build step 'Invoke top-level Maven targets' marked build as failure
Archiving artifacts
Sending artifact delta relative to Phoenix | 3.0 | Hadoop1 #225
Archived 527 artifacts
Archive block size is 32768
Received 6 blocks and 155942353 bytes
Compression is 0.1%
Took 4 min 8 sec
Updating PHOENIX-1281
Recording test results

Mime
View raw message