phoenix-commits mailing list archives

Site index · List index
Message view « Date » · « Thread »
Top « Date » · « Thread »
From Apache Jenkins Server <jenk...@builds.apache.org>
Subject Build failed in Jenkins: Phoenix | Master | Hadoop1 #369
Date Fri, 19 Sep 2014 20:36:31 GMT
See <https://builds.apache.org/job/Phoenix-master-hadoop1/369/changes>

Changes:

[mujtaba] PHOENIX-1262 Generate phoenix-server jar with and without antlr

------------------------------------------
[...truncated 4058 lines...]
Downloading: http://conjars.org/repo/org/mockito/mockito-all/1.8.5/mockito-all-1.8.5.pom
            
Downloading: https://repository.apache.org/content/repositories/snapshots/org/mockito/mockito-all/1.8.5/mockito-all-1.8.5.pom
            
Downloading: http://repo.maven.apache.org/maven2/org/mockito/mockito-all/1.8.5/mockito-all-1.8.5.pom
            
Downloaded: http://repo.maven.apache.org/maven2/org/mockito/mockito-all/1.8.5/mockito-all-1.8.5.pom
(0 B at 0.0 KB/sec)
Downloading: https://repository.apache.org/content/repositories/releases/org/apache/httpcomponents/httpclient/4.0.1/httpclient-4.0.1.pom
4/7 KB      
7/7 KB   
         
Downloaded: https://repository.apache.org/content/repositories/releases/org/apache/httpcomponents/httpclient/4.0.1/httpclient-4.0.1.pom
(7 KB at 32.6 KB/sec)
Downloading: https://repository.apache.org/content/repositories/releases/org/apache/httpcomponents/httpcomponents-client/4.0.1/httpcomponents-client-4.0.1.pom
4/9 KB   
8/9 KB   
9/9 KB   
         
Downloaded: https://repository.apache.org/content/repositories/releases/org/apache/httpcomponents/httpcomponents-client/4.0.1/httpcomponents-client-4.0.1.pom
(9 KB at 41.0 KB/sec)
Downloading: https://repository.apache.org/content/repositories/releases/org/xerial/snappy/snappy-java/1.1.0.1/snappy-java-1.1.0.1.pom
         
Downloading: http://conjars.org/repo/org/xerial/snappy/snappy-java/1.1.0.1/snappy-java-1.1.0.1.pom
         
Downloading: https://repository.apache.org/content/repositories/snapshots/org/xerial/snappy/snappy-java/1.1.0.1/snappy-java-1.1.0.1.pom
         
Downloading: http://repo.maven.apache.org/maven2/org/xerial/snappy/snappy-java/1.1.0.1/snappy-java-1.1.0.1.pom
3/12 KB   
7/12 KB   
11/12 KB   
12/12 KB   
           
Downloaded: http://repo.maven.apache.org/maven2/org/xerial/snappy/snappy-java/1.1.0.1/snappy-java-1.1.0.1.pom
(12 KB at 206.9 KB/sec)
Downloading: http://conjars.org/repo/com/github/stephenc/high-scale-lib/high-scale-lib/1.1.1/high-scale-lib-1.1.1.pom
           
Downloading: https://repository.apache.org/content/repositories/snapshots/com/github/stephenc/high-scale-lib/high-scale-lib/1.1.1/high-scale-lib-1.1.1.pom
           
Downloading: http://repo.maven.apache.org/maven2/com/github/stephenc/high-scale-lib/high-scale-lib/1.1.1/high-scale-lib-1.1.1.pom
           
Downloaded: http://repo.maven.apache.org/maven2/com/github/stephenc/high-scale-lib/high-scale-lib/1.1.1/high-scale-lib-1.1.1.pom
(0 B at 0.0 KB/sec)
Downloading: http://conjars.org/repo/com/github/stephenc/high-scale-lib/high-scale-lib-parent/1.1.1/high-scale-lib-parent-1.1.1.pom
           
Downloading: https://repository.apache.org/content/repositories/snapshots/com/github/stephenc/high-scale-lib/high-scale-lib-parent/1.1.1/high-scale-lib-parent-1.1.1.pom
           
Downloading: http://repo.maven.apache.org/maven2/com/github/stephenc/high-scale-lib/high-scale-lib-parent/1.1.1/high-scale-lib-parent-1.1.1.pom
           
Downloaded: http://repo.maven.apache.org/maven2/com/github/stephenc/high-scale-lib/high-scale-lib-parent/1.1.1/high-scale-lib-parent-1.1.1.pom
(0 B at 0.0 KB/sec)
Downloading: http://conjars.org/repo/com/yammer/metrics/metrics-core/2.1.2/metrics-core-2.1.2.pom
           
Downloading: https://repository.apache.org/content/repositories/snapshots/com/yammer/metrics/metrics-core/2.1.2/metrics-core-2.1.2.pom
           
Downloading: http://repo.maven.apache.org/maven2/com/yammer/metrics/metrics-core/2.1.2/metrics-core-2.1.2.pom
           
Downloaded: http://repo.maven.apache.org/maven2/com/yammer/metrics/metrics-core/2.1.2/metrics-core-2.1.2.pom
(0 B at 0.0 KB/sec)
Downloading: http://conjars.org/repo/com/yammer/metrics/metrics-parent/2.1.2/metrics-parent-2.1.2.pom
           
Downloading: https://repository.apache.org/content/repositories/snapshots/com/yammer/metrics/metrics-parent/2.1.2/metrics-parent-2.1.2.pom
           
Downloading: http://repo.maven.apache.org/maven2/com/yammer/metrics/metrics-parent/2.1.2/metrics-parent-2.1.2.pom
           
Downloaded: http://repo.maven.apache.org/maven2/com/yammer/metrics/metrics-parent/2.1.2/metrics-parent-2.1.2.pom
(0 B at 0.0 KB/sec)
Downloading: https://repository.apache.org/content/repositories/releases/com/lmax/disruptor/3.2.0/disruptor-3.2.0.pom
           
Downloading: http://conjars.org/repo/com/lmax/disruptor/3.2.0/disruptor-3.2.0.pom
           
Downloading: https://repository.apache.org/content/repositories/snapshots/com/lmax/disruptor/3.2.0/disruptor-3.2.0.pom
           
Downloading: http://repo.maven.apache.org/maven2/com/lmax/disruptor/3.2.0/disruptor-3.2.0.pom
2/2 KB     
         
Downloaded: http://repo.maven.apache.org/maven2/com/lmax/disruptor/3.2.0/disruptor-3.2.0.pom
(2 KB at 24.8 KB/sec)
Downloading: https://repository.apache.org/content/repositories/releases/io/netty/netty/3.6.6.Final/netty-3.6.6.Final.pom
         
Downloading: http://conjars.org/repo/io/netty/netty/3.6.6.Final/netty-3.6.6.Final.pom
         
Downloading: https://repository.apache.org/content/repositories/snapshots/io/netty/netty/3.6.6.Final/netty-3.6.6.Final.pom
         
Downloading: http://repo.maven.apache.org/maven2/io/netty/netty/3.6.6.Final/netty-3.6.6.Final.pom
2/26 KB   
6/26 KB   
10/26 KB   
14/26 KB   
14/26 KB   
18/26 KB   
22/26 KB   
26/26 KB   
           
Downloaded: http://repo.maven.apache.org/maven2/io/netty/netty/3.6.6.Final/netty-3.6.6.Final.pom
(26 KB at 673.4 KB/sec)
Downloading: https://repository.apache.org/content/repositories/releases/org/apache/commons/commons-csv/1.0/commons-csv-1.0.pom
4/12 KB    
8/12 KB   
12/12 KB   
12/12 KB   
           
Downloaded: https://repository.apache.org/content/repositories/releases/org/apache/commons/commons-csv/1.0/commons-csv-1.0.pom
(12 KB at 16.2 KB/sec)
Downloading: https://repository.apache.org/content/repositories/releases/org/apache/commons/commons-parent/34/commons-parent-34.pom
4/55 KB    
8/55 KB   
12/55 KB   
16/55 KB   
20/55 KB   
23/55 KB   
27/55 KB   
31/55 KB   
35/55 KB   
35/55 KB   
39/55 KB   
43/55 KB   
47/55 KB   
51/55 KB   
55/55 KB   
55/55 KB   
           
Downloaded: https://repository.apache.org/content/repositories/releases/org/apache/commons/commons-parent/34/commons-parent-34.pom
(55 KB at 59.9 KB/sec)
Downloading: https://repository.apache.org/content/repositories/releases/org/apache/hbase/hbase-testing-util/0.98.4-hadoop1/hbase-testing-util-0.98.4-hadoop1.pom
4/10 KB    
8/10 KB   
10/10 KB   
           
Downloaded: https://repository.apache.org/content/repositories/releases/org/apache/hbase/hbase-testing-util/0.98.4-hadoop1/hbase-testing-util-0.98.4-hadoop1.pom
(10 KB at 7.6 KB/sec)
Downloading: https://repository.apache.org/content/repositories/releases/org/apache/hbase/hbase-protocol/0.98.4-hadoop1/hbase-protocol-0.98.4-hadoop1.pom
4/8 KB     
8/8 KB   
8/8 KB   
         
Downloaded: https://repository.apache.org/content/repositories/releases/org/apache/hbase/hbase-protocol/0.98.4-hadoop1/hbase-protocol-0.98.4-hadoop1.pom
(8 KB at 9.7 KB/sec)
Downloading: https://repository.apache.org/content/repositories/releases/org/apache/hbase/hbase-client/0.98.4-hadoop1/hbase-client-0.98.4-hadoop1.pom
4/8 KB   
8/8 KB   
8/8 KB   
         
Downloaded: https://repository.apache.org/content/repositories/releases/org/apache/hbase/hbase-client/0.98.4-hadoop1/hbase-client-0.98.4-hadoop1.pom
(8 KB at 19.6 KB/sec)
Downloading: https://repository.apache.org/content/repositories/releases/org/apache/zookeeper/zookeeper/3.4.6/zookeeper-3.4.6.pom
4/4 KB   
         
Downloaded: https://repository.apache.org/content/repositories/releases/org/apache/zookeeper/zookeeper/3.4.6/zookeeper-3.4.6.pom
(4 KB at 12.3 KB/sec)
Downloading: https://repository.apache.org/content/repositories/releases/org/apache/hbase/hbase-server/0.98.4-hadoop1/hbase-server-0.98.4-hadoop1.pom
4/27 KB   
8/27 KB   
12/27 KB   
16/27 KB   
20/27 KB   
21/27 KB   
25/27 KB   
27/27 KB   
           
Downloaded: https://repository.apache.org/content/repositories/releases/org/apache/hbase/hbase-server/0.98.4-hadoop1/hbase-server-0.98.4-hadoop1.pom
(27 KB at 65.1 KB/sec)
Downloading: https://repository.apache.org/content/repositories/releases/org/apache/hbase/hbase-prefix-tree/0.98.4-hadoop1/hbase-prefix-tree-0.98.4-hadoop1.pom
4/6 KB     
6/6 KB   
         
Downloaded: https://repository.apache.org/content/repositories/releases/org/apache/hbase/hbase-prefix-tree/0.98.4-hadoop1/hbase-prefix-tree-0.98.4-hadoop1.pom
(6 KB at 22.2 KB/sec)
Downloading: https://repository.apache.org/content/repositories/releases/org/apache/hbase/hbase-hadoop1-compat/0.98.4-hadoop1/hbase-hadoop1-compat-0.98.4-hadoop1.pom
4/5 KB   
5/5 KB   
         
Downloaded: https://repository.apache.org/content/repositories/releases/org/apache/hbase/hbase-hadoop1-compat/0.98.4-hadoop1/hbase-hadoop1-compat-0.98.4-hadoop1.pom
(5 KB at 10.4 KB/sec)
Downloading: https://repository.apache.org/content/repositories/releases/com/yammer/metrics/metrics-core/2.2.0/metrics-core-2.2.0.pom
         
Downloading: http://conjars.org/repo/com/yammer/metrics/metrics-core/2.2.0/metrics-core-2.2.0.pom
         
Downloading: https://repository.apache.org/content/repositories/snapshots/com/yammer/metrics/metrics-core/2.2.0/metrics-core-2.2.0.pom
         
Downloading: http://repo.maven.apache.org/maven2/com/yammer/metrics/metrics-core/2.2.0/metrics-core-2.2.0.pom
2/2 KB   
         
Downloaded: http://repo.maven.apache.org/maven2/com/yammer/metrics/metrics-core/2.2.0/metrics-core-2.2.0.pom
(2 KB at 94.1 KB/sec)
Downloading: https://repository.apache.org/content/repositories/releases/com/yammer/metrics/metrics-parent/2.2.0/metrics-parent-2.2.0.pom
         
Downloading: http://conjars.org/repo/com/yammer/metrics/metrics-parent/2.2.0/metrics-parent-2.2.0.pom
         
Downloading: https://repository.apache.org/content/repositories/snapshots/com/yammer/metrics/metrics-parent/2.2.0/metrics-parent-2.2.0.pom
         
Downloading: http://repo.maven.apache.org/maven2/com/yammer/metrics/metrics-parent/2.2.0/metrics-parent-2.2.0.pom
4/10 KB   
8/10 KB   
10/10 KB   
           
Downloaded: http://repo.maven.apache.org/maven2/com/yammer/metrics/metrics-parent/2.2.0/metrics-parent-2.2.0.pom
(10 KB at 186.3 KB/sec)
Downloading: https://repository.apache.org/content/repositories/releases/org/mortbay/jetty/jetty-sslengine/6.1.26/jetty-sslengine-6.1.26.pom
           
Downloading: http://conjars.org/repo/org/mortbay/jetty/jetty-sslengine/6.1.26/jetty-sslengine-6.1.26.pom
           
Downloading: https://repository.apache.org/content/repositories/snapshots/org/mortbay/jetty/jetty-sslengine/6.1.26/jetty-sslengine-6.1.26.pom
           
Downloading: http://repo.maven.apache.org/maven2/org/mortbay/jetty/jetty-sslengine/6.1.26/jetty-sslengine-6.1.26.pom
4/4 KB     
         
Downloaded: http://repo.maven.apache.org/maven2/org/mortbay/jetty/jetty-sslengine/6.1.26/jetty-sslengine-6.1.26.pom
(4 KB at 37.1 KB/sec)
Downloading: https://repository.apache.org/content/repositories/releases/org/slf4j/slf4j-log4j12/1.6.4/slf4j-log4j12-1.6.4.pom
         
Downloading: http://conjars.org/repo/org/slf4j/slf4j-log4j12/1.6.4/slf4j-log4j12-1.6.4.pom
         
Downloading: https://repository.apache.org/content/repositories/snapshots/org/slf4j/slf4j-log4j12/1.6.4/slf4j-log4j12-1.6.4.pom
         
Downloading: http://repo.maven.apache.org/maven2/org/slf4j/slf4j-log4j12/1.6.4/slf4j-log4j12-1.6.4.pom
2/2 KB   
         
Downloaded: http://repo.maven.apache.org/maven2/org/slf4j/slf4j-log4j12/1.6.4/slf4j-log4j12-1.6.4.pom
(2 KB at 57.7 KB/sec)
Downloading: https://repository.apache.org/content/repositories/releases/org/apache/hbase/hbase-it/0.98.4-hadoop1/hbase-it-0.98.4-hadoop1.pom
4/13 KB   
8/13 KB   
12/13 KB   
13/13 KB   
           
Downloaded: https://repository.apache.org/content/repositories/releases/org/apache/hbase/hbase-it/0.98.4-hadoop1/hbase-it-0.98.4-hadoop1.pom
(13 KB at 22.5 KB/sec)
Downloading: https://repository.apache.org/content/repositories/releases/org/apache/hbase/hbase-shell/0.98.4-hadoop1/hbase-shell-0.98.4-hadoop1.pom
4/14 KB    
8/14 KB   
12/14 KB   
14/14 KB   
14/14 KB   
           
Downloaded: https://repository.apache.org/content/repositories/releases/org/apache/hbase/hbase-shell/0.98.4-hadoop1/hbase-shell-0.98.4-hadoop1.pom
(14 KB at 30.3 KB/sec)
[INFO] ------------------------------------------------------------------------
[INFO] Reactor Summary:
[INFO] 
[INFO] Apache Phoenix .................................... SUCCESS [2:11.676s]
[INFO] Phoenix Hadoop Compatibility ...................... SUCCESS [59:39.742s]
[INFO] Phoenix Hadoop1 Compatibility ..................... SUCCESS [0.309s]
[INFO] Phoenix Core ...................................... FAILURE [46:57.380s]
[INFO] Phoenix - Flume ................................... SKIPPED
[INFO] Phoenix - Pig ..................................... SKIPPED
[INFO] Phoenix Assembly .................................. SKIPPED
[INFO] ------------------------------------------------------------------------
[INFO] BUILD FAILURE
[INFO] ------------------------------------------------------------------------
[INFO] Total time: 1:48:50.599s
[INFO] Finished at: Fri Sep 19 20:35:50 UTC 2014
[INFO] Final Memory: 23M/139M
[INFO] ------------------------------------------------------------------------
[ERROR] Failed to execute goal on project phoenix-core: Could not resolve dependencies for
project org.apache.phoenix:phoenix-core:jar:5.0.0-SNAPSHOT: Failed to collect dependencies
for [org.apache.phoenix:phoenix-hadoop-compat:jar:5.0.0-SNAPSHOT (compile), org.apache.phoenix:phoenix-hadoop-compat:jar:tests:5.0.0-SNAPSHOT
(test), org.antlr:antlr:jar:3.5 (compile), org.antlr:antlr-runtime:jar:3.5 (compile), jline:jline:jar:2.11
(compile), sqlline:sqlline:jar:1.1.2 (compile), com.google.guava:guava:jar:12.0.1 (compile),
net.sourceforge.findbugs:annotations:jar:1.3.2 (compile), org.codehaus.jackson:jackson-core-asl:jar:1.8.8
(compile), org.codehaus.jackson:jackson-mapper-asl:jar:1.8.8 (compile), org.codehaus.jackson:jackson-jaxrs:jar:1.8.8
(test), org.codehaus.jackson:jackson-xc:jar:1.8.8 (test), junit:junit:jar:4.11 (compile),
org.mockito:mockito-all:jar:1.8.5 (test), com.google.protobuf:protobuf-java:jar:2.5.0 (compile),
org.apache.httpcomponents:httpclient:jar:4.0.1 (compile), log4j:log4j:jar:1.2.17 (compile),
org.slf4j:slf4j-api:jar:1.6.4 (compile), org.xerial.snappy:snappy-java:jar:1.1.0.1 (compile),
com.github.stephenc.high-scale-lib:high-scale-lib:jar:1.1.1 (test), com.yammer.metrics:metrics-core:jar:2.1.2
(test), com.lmax:disruptor:jar:3.2.0 (test), org.cloudera.htrace:htrace-core:jar:2.04 (compile),
io.netty:netty:jar:3.6.6.Final (compile), commons-codec:commons-codec:jar:1.7 (compile), commons-collections:commons-collections:jar:3.2.1
(compile), org.apache.commons:commons-csv:jar:1.0 (compile), com.google.code.findbugs:jsr305:jar:2.0.1
(compile), org.apache.hbase:hbase-testing-util:jar:0.98.4-hadoop1 (compile), org.apache.hbase:hbase-it:jar:tests:0.98.4-hadoop1
(test), org.apache.hbase:hbase-common:jar:0.98.4-hadoop1 (compile), org.apache.hbase:hbase-protocol:jar:0.98.4-hadoop1
(compile), org.apache.hbase:hbase-client:jar:0.98.4-hadoop1 (compile), org.apache.hadoop:hadoop-core:jar:1.0.4
(compile), org.apache.hadoop:hadoop-test:jar:1.0.4 (test?), org.apache.phoenix:phoenix-hadoop1-compat:jar:5.0.0-SNAPSHOT
(compile)]: Failed to read artifact descriptor for sqlline:sqlline:jar:1.1.2: Could not transfer
artifact sqlline:sqlline:pom:1.1.2 from/to conjars.org (http://conjars.org/repo): Connection
to http://conjars.org refused: Connection timed out -> [Help 1]
[ERROR] 
[ERROR] To see the full stack trace of the errors, re-run Maven with the -e switch.
[ERROR] Re-run Maven using the -X switch to enable full debug logging.
[ERROR] 
[ERROR] For more information about the errors and possible solutions, please read the following
articles:
[ERROR] [Help 1] http://cwiki.apache.org/confluence/display/MAVEN/DependencyResolutionException
[ERROR] 
[ERROR] After correcting the problems, you can resume the build with the command
[ERROR]   mvn <goals> -rf :phoenix-core
Build step 'Invoke top-level Maven targets' marked build as failure
Archiving artifacts
Sending artifact delta relative to Phoenix | Master | Hadoop1 #368
Archived 19 artifacts
Archive block size is 32768
Received 0 blocks and 91176 bytes
Compression is 0.0%
Took 30 sec
Updating PHOENIX-1262
Recording test results

Mime
View raw message