phoenix-commits mailing list archives

Site index · List index
Message view « Date » · « Thread »
Top « Date » · « Thread »
From Apache Jenkins Server <jenk...@builds.apache.org>
Subject Build failed in Jenkins: Phoenix | 4.0 | Hadoop1 #307
Date Fri, 05 Sep 2014 23:55:24 GMT
See <https://builds.apache.org/job/Phoenix-4.0-hadoop1/307/changes>

Changes:

[jyates] PHOENIX-1226 Exception in Tracing

------------------------------------------
[...truncated 29876 lines...]
  ReverseFunctionIT>BaseHBaseManagedTimeIT.doSetup:73->BaseHBaseManagedTimeIT.getUrl:58->BaseHBaseManagedTimeIT.checkClusterInitialized:87->BaseTest.setUpTestCluster:449->BaseTest.initMiniCluster:488
» Runtime
  ServerExceptionIT>BaseHBaseManagedTimeIT.doSetup:73->BaseHBaseManagedTimeIT.getUrl:58->BaseHBaseManagedTimeIT.checkClusterInitialized:87->BaseTest.setUpTestCluster:449->BaseTest.initMiniCluster:488
» Runtime
  DropViewIT.doSetup:57->BaseHBaseManagedTimeIT.getUrl:58->BaseHBaseManagedTimeIT.checkClusterInitialized:87->BaseTest.setUpTestCluster:449->BaseTest.initMiniCluster:488
» Runtime
  SaltedIndexIT.doSetup:63->BaseHBaseManagedTimeIT.getUrl:58->BaseHBaseManagedTimeIT.checkClusterInitialized:87->BaseTest.setUpTestCluster:449->BaseTest.initMiniCluster:488
» Runtime
  IndexMetadataIT>BaseHBaseManagedTimeIT.doSetup:73->BaseHBaseManagedTimeIT.getUrl:58->BaseHBaseManagedTimeIT.checkClusterInitialized:87->BaseTest.setUpTestCluster:449->BaseTest.initMiniCluster:488
» Runtime
  ViewIndexIT.doSetup:50->BaseHBaseManagedTimeIT.getUrl:58->BaseHBaseManagedTimeIT.checkClusterInitialized:87->BaseTest.setUpTestCluster:449->BaseTest.initMiniCluster:488
» Runtime
  ImmutableIndexIT>BaseHBaseManagedTimeIT.doSetup:73->BaseHBaseManagedTimeIT.getUrl:58->BaseHBaseManagedTimeIT.checkClusterInitialized:87->BaseTest.setUpTestCluster:449->BaseTest.initMiniCluster:488
» Runtime
  MutableIndexIT.doSetup:66->BaseHBaseManagedTimeIT.getUrl:58->BaseHBaseManagedTimeIT.checkClusterInitialized:87->BaseTest.setUpTestCluster:449->BaseTest.initMiniCluster:488
» Runtime
  LocalIndexIT.doSetup:74->BaseHBaseManagedTimeIT.getUrl:58->BaseHBaseManagedTimeIT.checkClusterInitialized:87->BaseTest.setUpTestCluster:449->BaseTest.initMiniCluster:488
» Runtime
  SkipScanQueryIT>BaseHBaseManagedTimeIT.doSetup:73->BaseHBaseManagedTimeIT.getUrl:58->BaseHBaseManagedTimeIT.checkClusterInitialized:87->BaseTest.setUpTestCluster:449->BaseTest.initMiniCluster:488
» Runtime
  SaltedViewIT>BaseViewIT.doSetup:48->BaseHBaseManagedTimeIT.getUrl:58->BaseHBaseManagedTimeIT.checkClusterInitialized:87->BaseTest.setUpTestCluster:449->BaseTest.initMiniCluster:488
» Runtime
  MD5FunctionIT>BaseHBaseManagedTimeIT.doSetup:73->BaseHBaseManagedTimeIT.getUrl:58->BaseHBaseManagedTimeIT.checkClusterInitialized:87->BaseTest.setUpTestCluster:449->BaseTest.initMiniCluster:488
» Runtime
  QueryMoreIT>BaseHBaseManagedTimeIT.doSetup:73->BaseHBaseManagedTimeIT.getUrl:58->BaseHBaseManagedTimeIT.checkClusterInitialized:87->BaseTest.setUpTestCluster:449->BaseTest.initMiniCluster:488
» Runtime
  UpsertBigValuesIT>BaseHBaseManagedTimeIT.doSetup:73->BaseHBaseManagedTimeIT.getUrl:58->BaseHBaseManagedTimeIT.checkClusterInitialized:87->BaseTest.setUpTestCluster:449->BaseTest.initMiniCluster:488
» Runtime
  ExecuteStatementsIT>BaseHBaseManagedTimeIT.doSetup:73->BaseHBaseManagedTimeIT.getUrl:58->BaseHBaseManagedTimeIT.checkClusterInitialized:87->BaseTest.setUpTestCluster:449->BaseTest.initMiniCluster:488
» Runtime
  TenantSpecificViewIndexSaltedIT>BaseHBaseManagedTimeIT.doSetup:73->BaseHBaseManagedTimeIT.getUrl:58->BaseHBaseManagedTimeIT.checkClusterInitialized:87->BaseTest.setUpTestCluster:449->BaseTest.initMiniCluster:488
» Runtime
  AlterTableIT>BaseHBaseManagedTimeIT.doSetup:73->BaseHBaseManagedTimeIT.getUrl:58->BaseHBaseManagedTimeIT.checkClusterInitialized:87->BaseTest.setUpTestCluster:449->BaseTest.initMiniCluster:488
» Runtime
  LastValueFunctionIT>BaseHBaseManagedTimeIT.doSetup:73->BaseHBaseManagedTimeIT.getUrl:58->BaseHBaseManagedTimeIT.checkClusterInitialized:87->BaseTest.setUpTestCluster:449->BaseTest.initMiniCluster:488
» Runtime
  SortOrderFIT>BaseHBaseManagedTimeIT.doSetup:73->BaseHBaseManagedTimeIT.getUrl:58->BaseHBaseManagedTimeIT.checkClusterInitialized:87->BaseTest.setUpTestCluster:449->BaseTest.initMiniCluster:488
» Runtime
  ViewIT>BaseViewIT.doSetup:48->BaseHBaseManagedTimeIT.getUrl:58->BaseHBaseManagedTimeIT.checkClusterInitialized:87->BaseTest.setUpTestCluster:449->BaseTest.initMiniCluster:488
» Runtime
  PhoenixEncodeDecodeIT>BaseHBaseManagedTimeIT.doSetup:73->BaseHBaseManagedTimeIT.getUrl:58->BaseHBaseManagedTimeIT.checkClusterInitialized:87->BaseTest.setUpTestCluster:449->BaseTest.initMiniCluster:488
» Runtime
  FirstValueFunctionIT>BaseHBaseManagedTimeIT.doSetup:73->BaseHBaseManagedTimeIT.getUrl:58->BaseHBaseManagedTimeIT.checkClusterInitialized:87->BaseTest.setUpTestCluster:449->BaseTest.initMiniCluster:488
» Runtime
  ArithmeticQueryIT>BaseHBaseManagedTimeIT.doSetup:73->BaseHBaseManagedTimeIT.getUrl:58->BaseHBaseManagedTimeIT.checkClusterInitialized:87->BaseTest.setUpTestCluster:449->BaseTest.initMiniCluster:488
» Runtime
  SaltedTableUpsertSelectIT>BaseHBaseManagedTimeIT.doSetup:73->BaseHBaseManagedTimeIT.getUrl:58->BaseHBaseManagedTimeIT.checkClusterInitialized:87->BaseTest.setUpTestCluster:449->BaseTest.initMiniCluster:488
» Runtime
  ConvertTimezoneFunctionIT>BaseHBaseManagedTimeIT.doSetup:73->BaseHBaseManagedTimeIT.getUrl:58->BaseHBaseManagedTimeIT.checkClusterInitialized:87->BaseTest.setUpTestCluster:449->BaseTest.initMiniCluster:488
» Runtime
  BinaryRowKeyIT>BaseHBaseManagedTimeIT.doSetup:73->BaseHBaseManagedTimeIT.getUrl:58->BaseHBaseManagedTimeIT.checkClusterInitialized:87->BaseTest.setUpTestCluster:449->BaseTest.initMiniCluster:488
» Runtime
  TenantSpecificViewIndexIT>BaseHBaseManagedTimeIT.doSetup:73->BaseHBaseManagedTimeIT.getUrl:58->BaseHBaseManagedTimeIT.checkClusterInitialized:87->BaseTest.setUpTestCluster:449->BaseTest.initMiniCluster:488
» Runtime
  DecodeFunctionIT>BaseHBaseManagedTimeIT.doSetup:73->BaseHBaseManagedTimeIT.getUrl:58->BaseHBaseManagedTimeIT.checkClusterInitialized:87->BaseTest.setUpTestCluster:449->BaseTest.initMiniCluster:488
» Runtime
  TimezoneOffsetFunctionIT>BaseHBaseManagedTimeIT.doSetup:73->BaseHBaseManagedTimeIT.getUrl:58->BaseHBaseManagedTimeIT.checkClusterInitialized:87->BaseTest.setUpTestCluster:449->BaseTest.initMiniCluster:488
» Runtime
  UpsertSelectAutoCommitIT>BaseHBaseManagedTimeIT.doSetup:73->BaseHBaseManagedTimeIT.getUrl:58->BaseHBaseManagedTimeIT.checkClusterInitialized:87->BaseTest.setUpTestCluster:449->BaseTest.initMiniCluster:488
» Runtime
  NthValueFunctionIT>BaseHBaseManagedTimeIT.doSetup:73->BaseHBaseManagedTimeIT.getUrl:58->BaseHBaseManagedTimeIT.checkClusterInitialized:87->BaseTest.setUpTestCluster:449->BaseTest.initMiniCluster:488
» Runtime
  PhoenixTraceReaderIT>BaseHBaseManagedTimeIT.doSetup:73->BaseHBaseManagedTimeIT.getUrl:58->BaseHBaseManagedTimeIT.checkClusterInitialized:87->BaseTest.setUpTestCluster:449->BaseTest.initMiniCluster:488
» Runtime
  AutoCommitIT>BaseHBaseManagedTimeIT.doSetup:73->BaseHBaseManagedTimeIT.getUrl:58->BaseHBaseManagedTimeIT.checkClusterInitialized:87->BaseTest.setUpTestCluster:449->BaseTest.initMiniCluster:488
» Runtime
  HashJoinIT.doSetup:90->BaseHBaseManagedTimeIT.getUrl:58->BaseHBaseManagedTimeIT.checkClusterInitialized:87->BaseTest.setUpTestCluster:449->BaseTest.initMiniCluster:488
» Runtime
  InListIT>BaseHBaseManagedTimeIT.doSetup:73->BaseHBaseManagedTimeIT.getUrl:58->BaseHBaseManagedTimeIT.checkClusterInitialized:87->BaseTest.setUpTestCluster:449->BaseTest.initMiniCluster:488
» Runtime
  PhoenixTracingEndToEndIT>BaseHBaseManagedTimeIT.doSetup:73->BaseHBaseManagedTimeIT.getUrl:58->BaseHBaseManagedTimeIT.checkClusterInitialized:87->BaseTest.setUpTestCluster:449->BaseTest.initMiniCluster:488
» Runtime
  PhoenixTableMetricsWriterIT>BaseHBaseManagedTimeIT.doSetup:73->BaseHBaseManagedTimeIT.getUrl:58->BaseHBaseManagedTimeIT.checkClusterInitialized:87->BaseTest.setUpTestCluster:449->BaseTest.initMiniCluster:488
» Runtime

Tests run: 102, Failures: 51, Errors: 51, Skipped: 0

[INFO] 
[INFO] --- maven-failsafe-plugin:2.17:integration-test (NeedTheirOwnClusterTests) @ phoenix-core
---
[INFO] Failsafe report directory: <https://builds.apache.org/job/Phoenix-4.0-hadoop1/ws/phoenix-core/target/failsafe-reports>
[INFO] parallel='none', perCoreThreadCount=true, threadCount=0, useUnlimitedThreads=false,
threadCountSuites=0, threadCountClasses=0, threadCountMethods=0, parallelOptimized=true

-------------------------------------------------------
 T E S T S
-------------------------------------------------------

-------------------------------------------------------
 T E S T S
-------------------------------------------------------
Running org.apache.phoenix.end2end.index.MutableIndexFailureIT
Tests run: 1, Failures: 0, Errors: 1, Skipped: 0, Time elapsed: 1,211,857.722 sec <<<
FAILURE! - in org.apache.phoenix.end2end.ContextClassloaderIT
org.apache.phoenix.end2end.ContextClassloaderIT  Time elapsed: 1,211,857.701 sec  <<<
ERROR!
java.lang.NullPointerException: null
	at org.apache.hadoop.hdfs.MiniDFSCluster.startDataNodes(MiniDFSCluster.java:422)
	at org.apache.hadoop.hdfs.MiniDFSCluster.<init>(MiniDFSCluster.java:280)
	at org.apache.hadoop.hbase.HBaseTestingUtility.startMiniDFSCluster(HBaseTestingUtility.java:517)
	at org.apache.hadoop.hbase.HBaseTestingUtility.startMiniCluster(HBaseTestingUtility.java:846)
	at org.apache.hadoop.hbase.HBaseTestingUtility.startMiniCluster(HBaseTestingUtility.java:771)
	at org.apache.hadoop.hbase.HBaseTestingUtility.startMiniCluster(HBaseTestingUtility.java:742)
	at org.apache.hadoop.hbase.HBaseTestingUtility.startMiniCluster(HBaseTestingUtility.java:711)
	at org.apache.phoenix.end2end.ContextClassloaderIT.setUpBeforeClass(ContextClassloaderIT.java:62)

Tests run: 1, Failures: 0, Errors: 1, Skipped: 0, Time elapsed: 1,211,857.894 sec <<<
FAILURE! - in org.apache.phoenix.hbase.index.covered.example.EndToEndCoveredIndexingIT
org.apache.phoenix.hbase.index.covered.example.EndToEndCoveredIndexingIT  Time elapsed: 1,211,857.879
sec  <<< ERROR!
java.lang.NullPointerException: null
	at org.apache.hadoop.hdfs.MiniDFSCluster.startDataNodes(MiniDFSCluster.java:422)
	at org.apache.hadoop.hdfs.MiniDFSCluster.<init>(MiniDFSCluster.java:280)
	at org.apache.hadoop.hbase.HBaseTestingUtility.startMiniDFSCluster(HBaseTestingUtility.java:517)
	at org.apache.hadoop.hbase.HBaseTestingUtility.startMiniCluster(HBaseTestingUtility.java:846)
	at org.apache.hadoop.hbase.HBaseTestingUtility.startMiniCluster(HBaseTestingUtility.java:771)
	at org.apache.hadoop.hbase.HBaseTestingUtility.startMiniCluster(HBaseTestingUtility.java:742)
	at org.apache.hadoop.hbase.HBaseTestingUtility.startMiniCluster(HBaseTestingUtility.java:711)
	at org.apache.phoenix.hbase.index.covered.example.EndToEndCoveredIndexingIT.setupCluster(EndToEndCoveredIndexingIT.java:112)

Running org.apache.phoenix.hbase.index.FailForUnsupportedHBaseVersionsIT
Tests run: 1, Failures: 0, Errors: 1, Skipped: 0, Time elapsed: 1,211,858.271 sec <<<
FAILURE! - in org.apache.phoenix.hbase.index.covered.example.EndtoEndIndexingWithCompressionIT
org.apache.phoenix.hbase.index.covered.example.EndtoEndIndexingWithCompressionIT  Time elapsed:
1,211,858.269 sec  <<< ERROR!
java.lang.NullPointerException: null
	at org.apache.hadoop.hdfs.MiniDFSCluster.startDataNodes(MiniDFSCluster.java:422)
	at org.apache.hadoop.hdfs.MiniDFSCluster.<init>(MiniDFSCluster.java:280)
	at org.apache.hadoop.hbase.HBaseTestingUtility.startMiniDFSCluster(HBaseTestingUtility.java:517)
	at org.apache.hadoop.hbase.HBaseTestingUtility.startMiniCluster(HBaseTestingUtility.java:846)
	at org.apache.hadoop.hbase.HBaseTestingUtility.startMiniCluster(HBaseTestingUtility.java:771)
	at org.apache.hadoop.hbase.HBaseTestingUtility.startMiniCluster(HBaseTestingUtility.java:742)
	at org.apache.hadoop.hbase.HBaseTestingUtility.startMiniCluster(HBaseTestingUtility.java:711)
	at org.apache.phoenix.hbase.index.covered.example.EndtoEndIndexingWithCompressionIT.setupCluster(EndtoEndIndexingWithCompressionIT.java:52)

Tests run: 1, Failures: 0, Errors: 1, Skipped: 0, Time elapsed: 1,211,858.257 sec <<<
FAILURE! - in org.apache.phoenix.hbase.index.covered.EndToEndCoveredColumnsIndexBuilderIT
org.apache.phoenix.hbase.index.covered.EndToEndCoveredColumnsIndexBuilderIT  Time elapsed:
1,211,858.256 sec  <<< ERROR!
java.lang.NullPointerException: null
	at org.apache.hadoop.hdfs.MiniDFSCluster.startDataNodes(MiniDFSCluster.java:422)
	at org.apache.hadoop.hdfs.MiniDFSCluster.<init>(MiniDFSCluster.java:280)
	at org.apache.hadoop.hbase.HBaseTestingUtility.startMiniDFSCluster(HBaseTestingUtility.java:517)
	at org.apache.hadoop.hbase.HBaseTestingUtility.startMiniCluster(HBaseTestingUtility.java:846)
	at org.apache.hadoop.hbase.HBaseTestingUtility.startMiniCluster(HBaseTestingUtility.java:771)
	at org.apache.hadoop.hbase.HBaseTestingUtility.startMiniCluster(HBaseTestingUtility.java:742)
	at org.apache.hadoop.hbase.HBaseTestingUtility.startMiniCluster(HBaseTestingUtility.java:711)
	at org.apache.phoenix.hbase.index.covered.EndToEndCoveredColumnsIndexBuilderIT.setupCluster(EndToEndCoveredColumnsIndexBuilderIT.java:106)

Tests run: 2, Failures: 0, Errors: 2, Skipped: 0, Time elapsed: 1,211,858.386 sec <<<
FAILURE! - in org.apache.phoenix.mapreduce.CsvBulkLoadToolIT
org.apache.phoenix.mapreduce.CsvBulkLoadToolIT  Time elapsed: 1,211,858.384 sec  <<<
ERROR!
java.lang.NullPointerException: null
	at org.apache.hadoop.hdfs.MiniDFSCluster.startDataNodes(MiniDFSCluster.java:422)
	at org.apache.hadoop.hdfs.MiniDFSCluster.<init>(MiniDFSCluster.java:280)
	at org.apache.hadoop.hbase.HBaseTestingUtility.startMiniDFSCluster(HBaseTestingUtility.java:517)
	at org.apache.hadoop.hbase.HBaseTestingUtility.startMiniCluster(HBaseTestingUtility.java:846)
	at org.apache.hadoop.hbase.HBaseTestingUtility.startMiniCluster(HBaseTestingUtility.java:771)
	at org.apache.hadoop.hbase.HBaseTestingUtility.startMiniCluster(HBaseTestingUtility.java:742)
	at org.apache.hadoop.hbase.HBaseTestingUtility.startMiniCluster(HBaseTestingUtility.java:711)
	at org.apache.phoenix.mapreduce.CsvBulkLoadToolIT.setUp(CsvBulkLoadToolIT.java:59)

org.apache.phoenix.mapreduce.CsvBulkLoadToolIT  Time elapsed: 1,211,858.385 sec  <<<
ERROR!
java.lang.NullPointerException: null
	at org.apache.phoenix.mapreduce.CsvBulkLoadToolIT.tearDownAfterClass(CsvBulkLoadToolIT.java:70)

Tests run: 1, Failures: 0, Errors: 1, Skipped: 0, Time elapsed: 1,211,858.65 sec <<<
FAILURE! - in org.apache.phoenix.hbase.index.covered.example.FailWithoutRetriesIT
org.apache.phoenix.hbase.index.covered.example.FailWithoutRetriesIT  Time elapsed: 1,211,858.649
sec  <<< ERROR!
java.lang.NullPointerException: null
	at org.apache.hadoop.hdfs.MiniDFSCluster.startDataNodes(MiniDFSCluster.java:422)
	at org.apache.hadoop.hdfs.MiniDFSCluster.<init>(MiniDFSCluster.java:280)
	at org.apache.hadoop.hbase.HBaseTestingUtility.startMiniDFSCluster(HBaseTestingUtility.java:517)
	at org.apache.hadoop.hbase.HBaseTestingUtility.startMiniCluster(HBaseTestingUtility.java:846)
	at org.apache.hadoop.hbase.HBaseTestingUtility.startMiniCluster(HBaseTestingUtility.java:771)
	at org.apache.hadoop.hbase.HBaseTestingUtility.startMiniCluster(HBaseTestingUtility.java:742)
	at org.apache.hadoop.hbase.HBaseTestingUtility.startMiniCluster(HBaseTestingUtility.java:711)
	at org.apache.phoenix.hbase.index.covered.example.FailWithoutRetriesIT.setupCluster(FailWithoutRetriesIT.java:94)

Tests run: 1, Failures: 0, Errors: 1, Skipped: 0, Time elapsed: 1,211,858.83 sec <<<
FAILURE! - in org.apache.phoenix.hbase.index.balancer.IndexLoadBalancerIT
org.apache.phoenix.hbase.index.balancer.IndexLoadBalancerIT  Time elapsed: 1,211,858.83 sec
 <<< ERROR!
java.lang.NullPointerException: null
	at org.apache.hadoop.hdfs.MiniDFSCluster.startDataNodes(MiniDFSCluster.java:422)
	at org.apache.hadoop.hdfs.MiniDFSCluster.<init>(MiniDFSCluster.java:280)
	at org.apache.hadoop.hbase.HBaseTestingUtility.startMiniDFSCluster(HBaseTestingUtility.java:517)
	at org.apache.hadoop.hbase.HBaseTestingUtility.startMiniCluster(HBaseTestingUtility.java:846)
	at org.apache.hadoop.hbase.HBaseTestingUtility.startMiniCluster(HBaseTestingUtility.java:771)
	at org.apache.hadoop.hbase.HBaseTestingUtility.startMiniCluster(HBaseTestingUtility.java:742)
	at org.apache.hadoop.hbase.HBaseTestingUtility.startMiniCluster(HBaseTestingUtility.java:729)
	at org.apache.phoenix.hbase.index.balancer.IndexLoadBalancerIT.setupCluster(IndexLoadBalancerIT.java:81)

Tests run: 2, Failures: 0, Errors: 1, Skipped: 0, Time elapsed: 0.936 sec <<< FAILURE!
- in org.apache.phoenix.hbase.index.FailForUnsupportedHBaseVersionsIT
testDoesNotStartRegionServerForUnsupportedCompressionAndVersion(org.apache.phoenix.hbase.index.FailForUnsupportedHBaseVersionsIT)
 Time elapsed: 0.787 sec  <<< ERROR!
java.lang.NullPointerException: null
	at org.apache.hadoop.hdfs.MiniDFSCluster.startDataNodes(MiniDFSCluster.java:422)
	at org.apache.hadoop.hdfs.MiniDFSCluster.<init>(MiniDFSCluster.java:280)
	at org.apache.hadoop.hbase.HBaseTestingUtility.startMiniDFSCluster(HBaseTestingUtility.java:517)
	at org.apache.hadoop.hbase.HBaseTestingUtility.startMiniCluster(HBaseTestingUtility.java:846)
	at org.apache.hadoop.hbase.HBaseTestingUtility.startMiniCluster(HBaseTestingUtility.java:771)
	at org.apache.hadoop.hbase.HBaseTestingUtility.startMiniCluster(HBaseTestingUtility.java:742)
	at org.apache.hadoop.hbase.HBaseTestingUtility.startMiniCluster(HBaseTestingUtility.java:711)
	at org.apache.phoenix.hbase.index.FailForUnsupportedHBaseVersionsIT.testDoesNotStartRegionServerForUnsupportedCompressionAndVersion(FailForUnsupportedHBaseVersionsIT.java:125)

Tests run: 3, Failures: 0, Errors: 3, Skipped: 0, Time elapsed: 8.16 sec <<< FAILURE!
- in org.apache.phoenix.end2end.index.MutableIndexFailureIT
testWriteFailureWithRegionServerDown(org.apache.phoenix.end2end.index.MutableIndexFailureIT)
 Time elapsed: 6.735 sec  <<< ERROR!
java.lang.NullPointerException: null
	at org.apache.hadoop.hdfs.MiniDFSCluster.startDataNodes(MiniDFSCluster.java:422)
	at org.apache.hadoop.hdfs.MiniDFSCluster.<init>(MiniDFSCluster.java:280)
	at org.apache.hadoop.hbase.HBaseTestingUtility.startMiniDFSCluster(HBaseTestingUtility.java:517)
	at org.apache.hadoop.hbase.HBaseTestingUtility.startMiniCluster(HBaseTestingUtility.java:846)
	at org.apache.hadoop.hbase.HBaseTestingUtility.startMiniCluster(HBaseTestingUtility.java:771)
	at org.apache.hadoop.hbase.HBaseTestingUtility.startMiniCluster(HBaseTestingUtility.java:742)
	at org.apache.hadoop.hbase.HBaseTestingUtility.startMiniCluster(HBaseTestingUtility.java:729)
	at org.apache.phoenix.end2end.index.MutableIndexFailureIT.doSetup(MutableIndexFailureIT.java:110)

testWriteFailureDisablesIndex(org.apache.phoenix.end2end.index.MutableIndexFailureIT)  Time
elapsed: 0.923 sec  <<< ERROR!
java.lang.NullPointerException: null
	at org.apache.hadoop.hdfs.MiniDFSCluster.startDataNodes(MiniDFSCluster.java:422)
	at org.apache.hadoop.hdfs.MiniDFSCluster.<init>(MiniDFSCluster.java:280)
	at org.apache.hadoop.hbase.HBaseTestingUtility.startMiniDFSCluster(HBaseTestingUtility.java:517)
	at org.apache.hadoop.hbase.HBaseTestingUtility.startMiniCluster(HBaseTestingUtility.java:846)
	at org.apache.hadoop.hbase.HBaseTestingUtility.startMiniCluster(HBaseTestingUtility.java:771)
	at org.apache.hadoop.hbase.HBaseTestingUtility.startMiniCluster(HBaseTestingUtility.java:742)
	at org.apache.hadoop.hbase.HBaseTestingUtility.startMiniCluster(HBaseTestingUtility.java:729)
	at org.apache.phoenix.end2end.index.MutableIndexFailureIT.doSetup(MutableIndexFailureIT.java:110)

testWriteFailureDisablesLocalIndex(org.apache.phoenix.end2end.index.MutableIndexFailureIT)
 Time elapsed: 0.493 sec  <<< ERROR!
java.lang.NullPointerException: null
	at org.apache.hadoop.hdfs.MiniDFSCluster.startDataNodes(MiniDFSCluster.java:422)
	at org.apache.hadoop.hdfs.MiniDFSCluster.<init>(MiniDFSCluster.java:280)
	at org.apache.hadoop.hbase.HBaseTestingUtility.startMiniDFSCluster(HBaseTestingUtility.java:517)
	at org.apache.hadoop.hbase.HBaseTestingUtility.startMiniCluster(HBaseTestingUtility.java:846)
	at org.apache.hadoop.hbase.HBaseTestingUtility.startMiniCluster(HBaseTestingUtility.java:771)
	at org.apache.hadoop.hbase.HBaseTestingUtility.startMiniCluster(HBaseTestingUtility.java:742)
	at org.apache.hadoop.hbase.HBaseTestingUtility.startMiniCluster(HBaseTestingUtility.java:729)
	at org.apache.phoenix.end2end.index.MutableIndexFailureIT.doSetup(MutableIndexFailureIT.java:110)


Results :

Tests in error: 
  MutableIndexFailureIT.doSetup:110 » NullPointer
  ContextClassloaderIT.setUpBeforeClass:62 » NullPointer
  EndToEndCoveredIndexingIT.setupCluster:112 » NullPointer
  EndToEndCoveredColumnsIndexBuilderIT.setupCluster:106 » NullPointer
  EndtoEndIndexingWithCompressionIT.setupCluster:52 » NullPointer
  CsvBulkLoadToolIT.setUp:59 » NullPointer
  CsvBulkLoadToolIT.tearDownAfterClass:70 NullPointer
  MutableIndexFailureIT.doSetup:110 » NullPointer
  FailWithoutRetriesIT.setupCluster:94 » NullPointer
  IndexLoadBalancerIT.setupCluster:81 » NullPointer
  FailForUnsupportedHBaseVersionsIT.testDoesNotStartRegionServerForUnsupportedCompressionAndVersion:125
» NullPointer
  MutableIndexFailureIT.doSetup:110 » NullPointer

Tests run: 13, Failures: 0, Errors: 12, Skipped: 0

[INFO] 
[INFO] --- maven-failsafe-plugin:2.17:verify (ClientManagedTimeTests) @ phoenix-core ---
[INFO] Failsafe report directory: <https://builds.apache.org/job/Phoenix-4.0-hadoop1/ws/phoenix-core/target/failsafe-reports>
[INFO] ------------------------------------------------------------------------
[INFO] Reactor Summary:
[INFO] 
[INFO] Apache Phoenix .................................... SUCCESS [3.248s]
[INFO] Phoenix Hadoop Compatibility ...................... SUCCESS [25.061s]
[INFO] Phoenix Hadoop1 Compatibility ..................... SUCCESS [0.349s]
[INFO] Phoenix Core ...................................... FAILURE [2:04.650s]
[INFO] Phoenix - Flume ................................... SKIPPED
[INFO] Phoenix - Pig ..................................... SKIPPED
[INFO] Phoenix Assembly .................................. SKIPPED
[INFO] ------------------------------------------------------------------------
[INFO] BUILD FAILURE
[INFO] ------------------------------------------------------------------------
[INFO] Total time: 2:33.892s
[INFO] Finished at: Fri Sep 05 23:52:12 UTC 2014
[INFO] Final Memory: 43M/440M
[INFO] ------------------------------------------------------------------------
[ERROR] Failed to execute goal org.apache.maven.plugins:maven-failsafe-plugin:2.17:verify
(ClientManagedTimeTests) on project phoenix-core: There are test failures.
[ERROR] 
[ERROR] Please refer to <https://builds.apache.org/job/Phoenix-4.0-hadoop1/ws/phoenix-core/target/failsafe-reports>
for the individual test results.
[ERROR] -> [Help 1]
[ERROR] 
[ERROR] To see the full stack trace of the errors, re-run Maven with the -e switch.
[ERROR] Re-run Maven using the -X switch to enable full debug logging.
[ERROR] 
[ERROR] For more information about the errors and possible solutions, please read the following
articles:
[ERROR] [Help 1] http://cwiki.apache.org/confluence/display/MAVEN/MojoFailureException
[ERROR] 
[ERROR] After correcting the problems, you can resume the build with the command
[ERROR]   mvn <goals> -rf :phoenix-core
Build step 'Invoke top-level Maven targets' marked build as failure
Archiving artifacts
Sending artifact delta relative to Phoenix | 4.0 | Hadoop1 #306
Archived 434 artifacts
Archive block size is 32768
Received 8 blocks and 10925121 bytes
Compression is 2.3%
Took 41 sec
Recording test results

Mime
View raw message