phoenix-commits mailing list archives

Site index · List index
Message view « Date » · « Thread »
Top « Date » · « Thread »
From Apache Jenkins Server <jenk...@builds.apache.org>
Subject Build failed in Jenkins: Phoenix | Master | Hadoop1 #354
Date Wed, 03 Sep 2014 05:17:36 GMT
See <https://builds.apache.org/job/Phoenix-master-hadoop1/354/changes>

Changes:

[rajeshbabu] PHOENIX-1139 Failed to disable local index when index update fails(Rajeshbabu)

------------------------------------------
[...truncated 1411 lines...]
  QueryIT.testPartiallyQualifiedRVCInList:458->BaseQueryIT.assertValueEqualsResultSet:131->BaseTest.assertValuesEqualsResultSet:1287
expected:<0> but was:<2>
  QueryIT.testValidStringConcatExpression:652 null
  CastAndCoerceIT.testCoerceDateToBigInt:210 null
  QueryIT.testIntFilter:113->BaseQueryIT.assertValueEqualsResultSet:131->BaseTest.assertValuesEqualsResultSet:1287
expected:<0> but was:<3>
  CastAndCoerceIT.testCastOperatorInSelect:69 null
  ClientTimeArithmeticQueryIT.testDateSubtract:593->BaseTest.assertValuesEqualsResultSet:1287
expected:<0> but was:<3>
  CastAndCoerceIT.testCoerceDateToBigInt:210 null
  ClientTimeArithmeticQueryIT.testIntMultiplyExpression:448 null
  ClientTimeArithmeticQueryIT.testConstantDivideExpression:397 null
  ClientTimeArithmeticQueryIT.testIntDivideExpression:331 null
  ClientTimeArithmeticQueryIT.testIntToDecimalMultiplyExpression:499->BaseQueryIT.assertValueEqualsResultSet:131->BaseTest.assertValuesEqualsResultSet:1287
expected:<0> but was:<3>
  ClientTimeArithmeticQueryIT.testIntSubtractionExpression:186->BaseQueryIT.assertValueEqualsResultSet:131->BaseTest.assertValuesEqualsResultSet:1287
expected:<0> but was:<4>
  QueryIT.testSumOverNullIntegerColumn:810 expected:<42> but was:<0>
  ClientTimeArithmeticQueryIT.testDecimalSubtraction1Expression:200->BaseQueryIT.assertValueEqualsResultSet:131->BaseTest.assertValuesEqualsResultSet:1287
expected:<0> but was:<3>
  QueryIT.testFullyQualifiedRVCInList:476->BaseQueryIT.assertValueEqualsResultSet:131->BaseTest.assertValuesEqualsResultSet:1287
expected:<0> but was:<2>
  ClientTimeArithmeticQueryIT.testNegateExpression:431 null
  QueryIT.testToDateOnString:173 null
  QueryIT.testSimpleInListStatement:443->BaseQueryIT.assertValueEqualsResultSet:131->BaseTest.assertValuesEqualsResultSet:1287
expected:<0> but was:<2>
  ClientTimeArithmeticQueryIT.testConstantSubtractionExpression:314 null
  QueryIT.testGroupByPlusOne:153 null
  ClientTimeArithmeticQueryIT.testIntToDecimalDivideExpression:382->BaseQueryIT.assertValueEqualsResultSet:131->BaseTest.assertValuesEqualsResultSet:1287
expected:<0> but was:<3>
  ClientTimeArithmeticQueryIT.testIntAddExpression:530 null
  QueryIT.testPointInTimeScan:280 null
  QueryIT.testPointInTimeSequence:307 null
  QueryIT.testColumnAliasMapping:787 null
  QueryIT.testDateInList:363 null
  QueryIT.testPartiallyQualifiedRVCInList:458->BaseQueryIT.assertValueEqualsResultSet:131->BaseTest.assertValuesEqualsResultSet:1287
expected:<0> but was:<2>
  ClientTimeArithmeticQueryIT.testSelectWithDivideExpression:413 null
  QueryIT.testValidStringConcatExpression:652 null
  ClientTimeArithmeticQueryIT.testDateAdd:88->BaseTest.assertValuesEqualsResultSet:1287
expected:<0> but was:<3>
  QueryIT.testIntFilter:113->BaseQueryIT.assertValueEqualsResultSet:131->BaseTest.assertValuesEqualsResultSet:1287
expected:<0> but was:<3>
  ClientTimeArithmeticQueryIT.testDateSubtract:593->BaseTest.assertValuesEqualsResultSet:1287
expected:<0> but was:<3>
  ClientTimeArithmeticQueryIT.testIntMultiplyExpression:448 null
  ClientTimeArithmeticQueryIT.testConstantDivideExpression:397 null
  ClientTimeArithmeticQueryIT.testIntDivideExpression:331 null
  ClientTimeArithmeticQueryIT.testIntToDecimalMultiplyExpression:499->BaseQueryIT.assertValueEqualsResultSet:131->BaseTest.assertValuesEqualsResultSet:1287
expected:<0> but was:<3>
  QueryIT.testSumOverNullIntegerColumn:810 expected:<42> but was:<0>
  QueryIT.testFullyQualifiedRVCInList:476->BaseQueryIT.assertValueEqualsResultSet:131->BaseTest.assertValuesEqualsResultSet:1287
expected:<0> but was:<2>
  QueryIT.testToDateOnString:173 null
  QueryIT.testSimpleInListStatement:443->BaseQueryIT.assertValueEqualsResultSet:131->BaseTest.assertValuesEqualsResultSet:1287
expected:<0> but was:<2>
  CaseStatementIT.testSimpleCaseStatement:87->BaseTest.assertValuesEqualsResultSet:1287
expected:<0> but was:<5>
  CaseStatementIT.testSimpleCaseStatement:87->BaseTest.assertValuesEqualsResultSet:1287
expected:<0> but was:<5>
  CaseStatementIT.testSimpleCaseStatement:87->BaseTest.assertValuesEqualsResultSet:1287
expected:<0> but was:<5>
  NotQueryIT.testNotEquals2:295 null
  NotQueryIT.testNotEquals:162 null
  NotQueryIT.testNotEquals2:295 null
  NotQueryIT.testNotEquals:162 null
  NotQueryIT.testNotEquals2:295 null
  NotQueryIT.testNotEquals:162 null

Tests run: 1266, Failures: 102, Errors: 0, Skipped: 0

[INFO] 
[INFO] --- maven-failsafe-plugin:2.17:integration-test (HBaseManagedTimeTests) @ phoenix-core
---
[INFO] Failsafe report directory: <https://builds.apache.org/job/Phoenix-master-hadoop1/ws/phoenix-core/target/failsafe-reports>
[INFO] parallel='none', perCoreThreadCount=true, threadCount=0, useUnlimitedThreads=false,
threadCountSuites=0, threadCountClasses=0, threadCountMethods=0, parallelOptimized=true

-------------------------------------------------------
 T E S T S
-------------------------------------------------------

-------------------------------------------------------
 T E S T S
-------------------------------------------------------
Running org.apache.phoenix.end2end.SortOrderFIT
Running org.apache.phoenix.trace.PhoenixTracingEndToEndIT
Running org.apache.phoenix.trace.PhoenixTableMetricsWriterIT
Tests run: 4, Failures: 0, Errors: 0, Skipped: 4, Time elapsed: 0.131 sec - in org.apache.phoenix.trace.PhoenixTracingEndToEndIT
Tests run: 2, Failures: 0, Errors: 0, Skipped: 2, Time elapsed: 0.134 sec - in org.apache.phoenix.trace.PhoenixTableMetricsWriterIT
Running org.apache.phoenix.end2end.UpsertSelectAutoCommitIT
Running org.apache.phoenix.end2end.DynamicFamilyIT
Running org.apache.phoenix.end2end.MD5FunctionIT
Running org.apache.phoenix.trace.PhoenixTraceReaderIT
Running org.apache.phoenix.end2end.BinaryRowKeyIT
Tests run: 2, Failures: 0, Errors: 0, Skipped: 2, Time elapsed: 0.172 sec - in org.apache.phoenix.trace.PhoenixTraceReaderIT
Running org.apache.phoenix.end2end.QueryPlanIT
Tests run: 3, Failures: 0, Errors: 0, Skipped: 0, Time elapsed: 3.006 sec - in org.apache.phoenix.end2end.BinaryRowKeyIT
Running org.apache.phoenix.end2end.SkipScanQueryIT
Tests run: 30, Failures: 0, Errors: 0, Skipped: 0, Time elapsed: 7.122 sec - in org.apache.phoenix.end2end.SortOrderFIT
Tests run: 2, Failures: 0, Errors: 0, Skipped: 0, Time elapsed: 5.315 sec - in org.apache.phoenix.end2end.MD5FunctionIT
Running org.apache.phoenix.end2end.RoundFloorCeilFunctionsEnd2EndIT
Running org.apache.phoenix.end2end.AlterTableIT
Tests run: 4, Failures: 0, Errors: 0, Skipped: 0, Time elapsed: 6.239 sec - in org.apache.phoenix.end2end.DynamicFamilyIT
Running org.apache.phoenix.end2end.TimezoneOffsetFunctionIT
Tests run: 2, Failures: 0, Errors: 0, Skipped: 0, Time elapsed: 9.576 sec - in org.apache.phoenix.end2end.UpsertSelectAutoCommitIT
Tests run: 6, Failures: 0, Errors: 0, Skipped: 0, Time elapsed: 3.173 sec - in org.apache.phoenix.end2end.TimezoneOffsetFunctionIT
Running org.apache.phoenix.end2end.index.LocalIndexIT
Running org.apache.phoenix.end2end.index.ViewIndexIT
Tests run: 1, Failures: 0, Errors: 0, Skipped: 0, Time elapsed: 8.77 sec - in org.apache.phoenix.end2end.QueryPlanIT
Running org.apache.phoenix.end2end.index.IndexMetadataIT
Tests run: 30, Failures: 0, Errors: 0, Skipped: 0, Time elapsed: 6.192 sec - in org.apache.phoenix.end2end.RoundFloorCeilFunctionsEnd2EndIT
Running org.apache.phoenix.end2end.index.MutableIndexIT
Tests run: 1, Failures: 0, Errors: 0, Skipped: 0, Time elapsed: 5.028 sec - in org.apache.phoenix.end2end.index.ViewIndexIT
Running org.apache.phoenix.end2end.index.DropViewIT
Tests run: 8, Failures: 0, Errors: 0, Skipped: 0, Time elapsed: 13.074 sec - in org.apache.phoenix.end2end.SkipScanQueryIT
Running org.apache.phoenix.end2end.index.SaltedIndexIT
Running org.apache.phoenix.end2end.ReverseScanIT
Tests run: 1, Failures: 0, Errors: 0, Skipped: 0, Time elapsed: 4.012 sec - in org.apache.phoenix.end2end.index.DropViewIT
Running org.apache.phoenix.end2end.index.ImmutableIndexIT
Tests run: 2, Failures: 0, Errors: 0, Skipped: 0, Time elapsed: 3.415 sec - in org.apache.phoenix.end2end.ReverseScanIT
Running org.apache.phoenix.end2end.CSVCommonsLoaderIT
Tests run: 13, Failures: 0, Errors: 0, Skipped: 0, Time elapsed: 10.212 sec - in org.apache.phoenix.end2end.CSVCommonsLoaderIT
Running org.apache.phoenix.end2end.ExecuteStatementsIT
Tests run: 4, Failures: 0, Errors: 0, Skipped: 0, Time elapsed: 21.498 sec - in org.apache.phoenix.end2end.index.IndexMetadataIT
Running org.apache.phoenix.end2end.ModulusExpressionIT
Tests run: 7, Failures: 0, Errors: 0, Skipped: 0, Time elapsed: 13.194 sec - in org.apache.phoenix.end2end.index.ImmutableIndexIT
Running org.apache.phoenix.end2end.AutoCommitIT
Tests run: 3, Failures: 0, Errors: 0, Skipped: 0, Time elapsed: 17.025 sec - in org.apache.phoenix.end2end.index.SaltedIndexIT
Running org.apache.phoenix.end2end.PhoenixEncodeDecodeIT
Tests run: 1, Failures: 0, Errors: 0, Skipped: 0, Time elapsed: 2.161 sec - in org.apache.phoenix.end2end.AutoCommitIT
Running org.apache.phoenix.end2end.ViewIT
Tests run: 11, Failures: 0, Errors: 0, Skipped: 0, Time elapsed: 4.54 sec - in org.apache.phoenix.end2end.ModulusExpressionIT
Running org.apache.phoenix.end2end.QueryExecWithoutSCNIT
Tests run: 15, Failures: 0, Errors: 0, Skipped: 0, Time elapsed: 33.762 sec - in org.apache.phoenix.end2end.AlterTableIT
Running org.apache.phoenix.end2end.LastValueFunctionIT
Tests run: 1, Failures: 0, Errors: 0, Skipped: 0, Time elapsed: 2.92 sec - in org.apache.phoenix.end2end.QueryExecWithoutSCNIT
Running org.apache.phoenix.end2end.DecodeFunctionIT
Tests run: 5, Failures: 0, Errors: 0, Skipped: 0, Time elapsed: 7.348 sec - in org.apache.phoenix.end2end.PhoenixEncodeDecodeIT
Running org.apache.phoenix.end2end.TenantSpecificViewIndexIT
Tests run: 2, Failures: 0, Errors: 0, Skipped: 0, Time elapsed: 10.445 sec - in org.apache.phoenix.end2end.ExecuteStatementsIT
Running org.apache.phoenix.end2end.SkipScanAfterManualSplitIT
Tests run: 6, Failures: 0, Errors: 0, Skipped: 0, Time elapsed: 2.652 sec - in org.apache.phoenix.end2end.DecodeFunctionIT
Running org.apache.phoenix.end2end.ServerExceptionIT
Tests run: 1, Failures: 0, Errors: 0, Skipped: 0, Time elapsed: 2.675 sec - in org.apache.phoenix.end2end.ServerExceptionIT
Running org.apache.phoenix.end2end.HashJoinIT
Tests run: 8, Failures: 0, Errors: 0, Skipped: 0, Time elapsed: 11.153 sec - in org.apache.phoenix.end2end.ViewIT
Tests run: 11, Failures: 0, Errors: 0, Skipped: 0, Time elapsed: 6.261 sec - in org.apache.phoenix.end2end.LastValueFunctionIT
Running org.apache.phoenix.end2end.SpillableGroupByIT
Running org.apache.phoenix.end2end.InListIT
Tests run: 1, Failures: 0, Errors: 0, Skipped: 0, Time elapsed: 3.809 sec - in org.apache.phoenix.end2end.SpillableGroupByIT
Running org.apache.phoenix.end2end.UpsertBigValuesIT
Tests run: 4, Failures: 0, Errors: 0, Skipped: 0, Time elapsed: 8.562 sec - in org.apache.phoenix.end2end.UpsertBigValuesIT
Running org.apache.phoenix.end2end.ReadOnlyIT
Tests run: 6, Failures: 0, Errors: 0, Skipped: 0, Time elapsed: 18.135 sec - in org.apache.phoenix.end2end.TenantSpecificViewIndexIT
Running org.apache.phoenix.end2end.SaltedViewIT
Tests run: 1, Failures: 0, Errors: 0, Skipped: 0, Time elapsed: 2.699 sec - in org.apache.phoenix.end2end.ReadOnlyIT
Running org.apache.phoenix.end2end.ReverseFunctionIT
Tests run: 2, Failures: 0, Errors: 0, Skipped: 0, Time elapsed: 21.937 sec - in org.apache.phoenix.end2end.SkipScanAfterManualSplitIT
Running org.apache.phoenix.end2end.EncodeFunctionIT
Tests run: 5, Failures: 0, Errors: 0, Skipped: 0, Time elapsed: 3.19 sec - in org.apache.phoenix.end2end.ReverseFunctionIT
Running org.apache.phoenix.end2end.NthValueFunctionIT
Tests run: 2, Failures: 0, Errors: 0, Skipped: 0, Time elapsed: 8.647 sec - in org.apache.phoenix.end2end.SaltedViewIT
Running org.apache.phoenix.end2end.salted.SaltedTableUpsertSelectIT
Tests run: 5, Failures: 0, Errors: 0, Skipped: 0, Time elapsed: 5.093 sec - in org.apache.phoenix.end2end.NthValueFunctionIT
Running org.apache.phoenix.end2end.ConvertTimezoneFunctionIT
Tests run: 6, Failures: 0, Errors: 0, Skipped: 0, Time elapsed: 8.426 sec - in org.apache.phoenix.end2end.EncodeFunctionIT
Running org.apache.phoenix.end2end.QueryMoreIT
Tests run: 6, Failures: 0, Errors: 0, Skipped: 0, Time elapsed: 2.872 sec - in org.apache.phoenix.end2end.ConvertTimezoneFunctionIT
Running org.apache.phoenix.end2end.TenantSpecificViewIndexSaltedIT
Tests run: 5, Failures: 0, Errors: 0, Skipped: 0, Time elapsed: 7.027 sec - in org.apache.phoenix.end2end.salted.SaltedTableUpsertSelectIT
Running org.apache.phoenix.end2end.ArithmeticQueryIT
Tests run: 4, Failures: 0, Errors: 0, Skipped: 0, Time elapsed: 9.655 sec - in org.apache.phoenix.end2end.TenantSpecificViewIndexSaltedIT
Running org.apache.phoenix.end2end.DeleteIT
Tests run: 20, Failures: 0, Errors: 0, Skipped: 0, Time elapsed: 16.625 sec - in org.apache.phoenix.end2end.ArithmeticQueryIT
Running org.apache.phoenix.end2end.LpadFunctionIT
Tests run: 10, Failures: 0, Errors: 0, Skipped: 0, Time elapsed: 7.269 sec - in org.apache.phoenix.end2end.LpadFunctionIT
Running org.apache.phoenix.end2end.StatementHintsIT
Tests run: 2, Failures: 0, Errors: 0, Skipped: 0, Time elapsed: 1.821 sec - in org.apache.phoenix.end2end.StatementHintsIT
Running org.apache.phoenix.end2end.FirstValueFunctionIT
Tests run: 19, Failures: 0, Errors: 0, Skipped: 0, Time elapsed: 22.091 sec - in org.apache.phoenix.end2end.DeleteIT
Tests run: 7, Failures: 0, Errors: 0, Skipped: 0, Time elapsed: 3.338 sec - in org.apache.phoenix.end2end.FirstValueFunctionIT
Tests run: 4, Failures: 0, Errors: 0, Skipped: 0, Time elapsed: 35.411 sec - in org.apache.phoenix.end2end.QueryMoreIT
Tests run: 16, Failures: 0, Errors: 0, Skipped: 0, Time elapsed: 101.238 sec - in org.apache.phoenix.end2end.index.LocalIndexIT
Tests run: 25, Failures: 0, Errors: 0, Skipped: 0, Time elapsed: 78.736 sec - in org.apache.phoenix.end2end.InListIT
Tests run: 26, Failures: 0, Errors: 0, Skipped: 0, Time elapsed: 125.713 sec - in org.apache.phoenix.end2end.index.MutableIndexIT
Tests run: 96, Failures: 0, Errors: 0, Skipped: 0, Time elapsed: 92.259 sec - in org.apache.phoenix.end2end.HashJoinIT

Results :

Tests run: 458, Failures: 0, Errors: 0, Skipped: 8

[INFO] 
[INFO] --- maven-failsafe-plugin:2.17:integration-test (NeedTheirOwnClusterTests) @ phoenix-core
---
[INFO] Failsafe report directory: <https://builds.apache.org/job/Phoenix-master-hadoop1/ws/phoenix-core/target/failsafe-reports>
[INFO] parallel='none', perCoreThreadCount=true, threadCount=0, useUnlimitedThreads=false,
threadCountSuites=0, threadCountClasses=0, threadCountMethods=0, parallelOptimized=true

-------------------------------------------------------
 T E S T S
-------------------------------------------------------

-------------------------------------------------------
 T E S T S
-------------------------------------------------------
Running org.apache.phoenix.hbase.index.FailForUnsupportedHBaseVersionsIT
Running org.apache.phoenix.hbase.index.covered.example.EndToEndCoveredIndexingIT
Running org.apache.phoenix.hbase.index.balancer.IndexLoadBalancerIT
Running org.apache.phoenix.hbase.index.covered.EndToEndCoveredColumnsIndexBuilderIT
Running org.apache.phoenix.hbase.index.covered.example.FailWithoutRetriesIT
Running org.apache.phoenix.hbase.index.covered.example.EndtoEndIndexingWithCompressionIT
Tests run: 1, Failures: 0, Errors: 0, Skipped: 0, Time elapsed: 8.487 sec - in org.apache.phoenix.hbase.index.covered.example.FailWithoutRetriesIT
Tests run: 2, Failures: 0, Errors: 0, Skipped: 0, Time elapsed: 8.936 sec - in org.apache.phoenix.hbase.index.covered.EndToEndCoveredColumnsIndexBuilderIT
Tests run: 2, Failures: 0, Errors: 0, Skipped: 0, Time elapsed: 18.811 sec - in org.apache.phoenix.hbase.index.FailForUnsupportedHBaseVersionsIT
Running org.apache.phoenix.end2end.index.MutableIndexFailureIT
Running org.apache.phoenix.mapreduce.CsvBulkLoadToolIT
Running org.apache.phoenix.end2end.ContextClassloaderIT
Tests run: 3, Failures: 0, Errors: 0, Skipped: 0, Time elapsed: 7.616 sec - in org.apache.phoenix.end2end.ContextClassloaderIT
Tests run: 11, Failures: 0, Errors: 0, Skipped: 0, Time elapsed: 59.1 sec - in org.apache.phoenix.hbase.index.covered.example.EndToEndCoveredIndexingIT
Tests run: 11, Failures: 0, Errors: 0, Skipped: 0, Time elapsed: 58.671 sec - in org.apache.phoenix.hbase.index.covered.example.EndtoEndIndexingWithCompressionIT
Tests run: 9, Failures: 0, Errors: 0, Skipped: 0, Time elapsed: 105.086 sec - in org.apache.phoenix.hbase.index.balancer.IndexLoadBalancerIT
Tests run: 3, Failures: 0, Errors: 0, Skipped: 0, Time elapsed: 168.439 sec - in org.apache.phoenix.end2end.index.MutableIndexFailureIT
Tests run: 4, Failures: 0, Errors: 0, Skipped: 0, Time elapsed: 244.317 sec - in org.apache.phoenix.mapreduce.CsvBulkLoadToolIT

Results :

Tests run: 46, Failures: 0, Errors: 0, Skipped: 0

[INFO] 
[INFO] --- maven-failsafe-plugin:2.17:verify (ClientManagedTimeTests) @ phoenix-core ---
[INFO] Failsafe report directory: <https://builds.apache.org/job/Phoenix-master-hadoop1/ws/phoenix-core/target/failsafe-reports>
[INFO] ------------------------------------------------------------------------
[INFO] Reactor Summary:
[INFO] 
[INFO] Apache Phoenix .................................... SUCCESS [2.564s]
[INFO] Phoenix Hadoop Compatibility ...................... SUCCESS [2.105s]
[INFO] Phoenix Hadoop1 Compatibility ..................... SUCCESS [0.438s]
[INFO] Phoenix Core ...................................... FAILURE [10:56.698s]
[INFO] Phoenix - Flume ................................... SKIPPED
[INFO] Phoenix - Pig ..................................... SKIPPED
[INFO] Phoenix Assembly .................................. SKIPPED
[INFO] ------------------------------------------------------------------------
[INFO] BUILD FAILURE
[INFO] ------------------------------------------------------------------------
[INFO] Total time: 11:02.252s
[INFO] Finished at: Wed Sep 03 05:14:48 UTC 2014
[INFO] Final Memory: 38M/835M
[INFO] ------------------------------------------------------------------------
[ERROR] Failed to execute goal org.apache.maven.plugins:maven-failsafe-plugin:2.17:verify
(ClientManagedTimeTests) on project phoenix-core: There are test failures.
[ERROR] 
[ERROR] Please refer to <https://builds.apache.org/job/Phoenix-master-hadoop1/ws/phoenix-core/target/failsafe-reports>
for the individual test results.
[ERROR] -> [Help 1]
[ERROR] 
[ERROR] To see the full stack trace of the errors, re-run Maven with the -e switch.
[ERROR] Re-run Maven using the -X switch to enable full debug logging.
[ERROR] 
[ERROR] For more information about the errors and possible solutions, please read the following
articles:
[ERROR] [Help 1] http://cwiki.apache.org/confluence/display/MAVEN/MojoFailureException
[ERROR] 
[ERROR] After correcting the problems, you can resume the build with the command
[ERROR]   mvn <goals> -rf :phoenix-core
Build step 'Invoke top-level Maven targets' marked build as failure
Archiving artifacts
Sending artifact delta relative to Phoenix | Master | Hadoop1 #353
Archived 588 artifacts
Archive block size is 32768
Received 1575 blocks and 192257501 bytes
Compression is 21.2%
Took 1 min 59 sec
Updating PHOENIX-1139
Recording test results

Mime
View raw message