phoenix-commits mailing list archives

Site index · List index
Message view « Date » · « Thread »
Top « Date » · « Thread »
From Apache Jenkins Server <jenk...@builds.apache.org>
Subject Build failed in Jenkins: Phoenix | 4.0 | Hadoop1 #279
Date Sat, 16 Aug 2014 00:17:21 GMT
See <https://builds.apache.org/job/Phoenix-4.0-hadoop1/279/changes>

Changes:

[jamestaylor] PHOENIX-1174 Rename and move properties using existing convention

[jeffreyz] PHOENIX-1173: MutableIndexFailureIT.java doesn't finish sometimes or is flappy.

------------------------------------------
[...truncated 459 lines...]
Running org.apache.phoenix.end2end.UpsertSelectIT
Tests run: 10, Failures: 0, Errors: 0, Skipped: 0, Time elapsed: 6.033 sec - in org.apache.phoenix.end2end.ToCharFunctionIT
Running org.apache.phoenix.end2end.VariableLengthPKIT
Tests run: 16, Failures: 0, Errors: 0, Skipped: 0, Time elapsed: 21.375 sec - in org.apache.phoenix.end2end.DerivedTableIT
Running org.apache.phoenix.end2end.MultiCfQueryExecIT
Tests run: 3, Failures: 0, Errors: 0, Skipped: 0, Time elapsed: 25.723 sec - in org.apache.phoenix.end2end.ColumnProjectionOptimizationIT
Running org.apache.phoenix.end2end.CoalesceFunctionIT
Tests run: 1, Failures: 0, Errors: 0, Skipped: 0, Time elapsed: 11.728 sec - in org.apache.phoenix.end2end.CoalesceFunctionIT
Running org.apache.phoenix.end2end.CreateTableIT
Tests run: 7, Failures: 0, Errors: 0, Skipped: 0, Time elapsed: 20.248 sec - in org.apache.phoenix.end2end.MultiCfQueryExecIT
Running org.apache.phoenix.end2end.IsNullIT
Tests run: 2, Failures: 0, Errors: 0, Skipped: 0, Time elapsed: 9.81 sec - in org.apache.phoenix.end2end.IsNullIT
Running org.apache.phoenix.end2end.StddevIT
Tests run: 77, Failures: 0, Errors: 0, Skipped: 0, Time elapsed: 62.213 sec - in org.apache.phoenix.end2end.NotQueryIT
Running org.apache.phoenix.end2end.RowValueConstructorIT
Tests run: 49, Failures: 0, Errors: 0, Skipped: 0, Time elapsed: 39.441 sec - in org.apache.phoenix.end2end.VariableLengthPKIT
Running org.apache.phoenix.end2end.ArrayIT
Tests run: 4, Failures: 0, Errors: 0, Skipped: 0, Time elapsed: 6.907 sec - in org.apache.phoenix.end2end.StddevIT
Running org.apache.phoenix.end2end.GroupByCaseIT
Tests run: 3, Failures: 0, Errors: 0, Skipped: 0, Time elapsed: 4.415 sec - in org.apache.phoenix.end2end.GroupByCaseIT
Running org.apache.phoenix.end2end.SpooledOrderByIT
Tests run: 63, Failures: 0, Errors: 0, Skipped: 0, Time elapsed: 55.651 sec - in org.apache.phoenix.end2end.CaseStatementIT
Running org.apache.phoenix.end2end.ClientTimeArithmeticQueryIT
Tests run: 3, Failures: 0, Errors: 0, Skipped: 1, Time elapsed: 9.247 sec - in org.apache.phoenix.end2end.SpooledOrderByIT
Running org.apache.phoenix.end2end.GroupByIT
Tests run: 12, Failures: 0, Errors: 0, Skipped: 0, Time elapsed: 63.682 sec - in org.apache.phoenix.end2end.UpsertSelectIT
Running org.apache.phoenix.end2end.ProductMetricsIT
Tests run: 10, Failures: 0, Errors: 0, Skipped: 0, Time elapsed: 49.8 sec - in org.apache.phoenix.end2end.CreateTableIT
Tests run: 48, Failures: 0, Errors: 0, Skipped: 0, Time elapsed: 34.586 sec - in org.apache.phoenix.end2end.ArrayIT
Tests run: 33, Failures: 0, Errors: 0, Skipped: 0, Time elapsed: 38.708 sec - in org.apache.phoenix.end2end.RowValueConstructorIT
Tests run: 61, Failures: 0, Errors: 0, Skipped: 0, Time elapsed: 32.933 sec - in org.apache.phoenix.end2end.ProductMetricsIT
Tests run: 91, Failures: 0, Errors: 0, Skipped: 0, Time elapsed: 75.776 sec - in org.apache.phoenix.end2end.GroupByIT
Tests run: 182, Failures: 0, Errors: 0, Skipped: 0, Time elapsed: 155.872 sec - in org.apache.phoenix.end2end.QueryIT
Tests run: 203, Failures: 0, Errors: 0, Skipped: 0, Time elapsed: 136.341 sec - in org.apache.phoenix.end2end.ClientTimeArithmeticQueryIT

Results :

Tests run: 1268, Failures: 0, Errors: 0, Skipped: 3

[INFO] 
[INFO] --- maven-failsafe-plugin:2.17:integration-test (HBaseManagedTimeTests) @ phoenix-core
---
[INFO] Failsafe report directory: /x1/jenkins/jenkins-slave/workspace/Phoenix-4.0-hadoop1/phoenix-core/target/failsafe-reports
[INFO] parallel='none', perCoreThreadCount=true, threadCount=0, useUnlimitedThreads=false,
threadCountSuites=0, threadCountClasses=0, threadCountMethods=0, parallelOptimized=true

-------------------------------------------------------
 T E S T S
-------------------------------------------------------

-------------------------------------------------------
 T E S T S
-------------------------------------------------------
Running org.apache.phoenix.end2end.QueryExecWithoutSCNIT
Running org.apache.phoenix.end2end.TenantSpecificViewIndexIT
Running org.apache.phoenix.end2end.PhoenixEncodeDecodeIT
Running org.apache.phoenix.end2end.DeleteIT
Running org.apache.phoenix.end2end.BinaryRowKeyIT
Running org.apache.phoenix.end2end.TenantSpecificViewIndexSaltedIT
Running org.apache.phoenix.end2end.SkipScanQueryIT
Tests run: 3, Failures: 0, Errors: 0, Skipped: 0, Time elapsed: 4.229 sec - in org.apache.phoenix.end2end.BinaryRowKeyIT
Running org.apache.phoenix.end2end.EncodeFunctionIT
Tests run: 1, Failures: 0, Errors: 0, Skipped: 0, Time elapsed: 9.065 sec - in org.apache.phoenix.end2end.QueryExecWithoutSCNIT
Running org.apache.phoenix.end2end.TimezoneOffsetFunctionIT
Tests run: 6, Failures: 0, Errors: 0, Skipped: 0, Time elapsed: 4.255 sec - in org.apache.phoenix.end2end.TimezoneOffsetFunctionIT
Running org.apache.phoenix.end2end.AlterTableIT
Tests run: 5, Failures: 0, Errors: 0, Skipped: 0, Time elapsed: 13.375 sec - in org.apache.phoenix.end2end.PhoenixEncodeDecodeIT
Running org.apache.phoenix.end2end.index.MutableIndexIT
Tests run: 6, Failures: 0, Errors: 0, Skipped: 0, Time elapsed: 13.187 sec - in org.apache.phoenix.end2end.EncodeFunctionIT
Running org.apache.phoenix.end2end.index.ViewIndexIT
Tests run: 4, Failures: 0, Errors: 0, Skipped: 0, Time elapsed: 21.463 sec - in org.apache.phoenix.end2end.TenantSpecificViewIndexSaltedIT
Running org.apache.phoenix.end2end.index.DropViewIT
Tests run: 1, Failures: 0, Errors: 0, Skipped: 0, Time elapsed: 8.763 sec - in org.apache.phoenix.end2end.index.ViewIndexIT
Running org.apache.phoenix.end2end.index.IndexMetadataIT
Tests run: 1, Failures: 0, Errors: 0, Skipped: 0, Time elapsed: 8.47 sec - in org.apache.phoenix.end2end.index.DropViewIT
Running org.apache.phoenix.end2end.index.SaltedIndexIT
Tests run: 8, Failures: 0, Errors: 0, Skipped: 0, Time elapsed: 27.466 sec - in org.apache.phoenix.end2end.SkipScanQueryIT
Running org.apache.phoenix.end2end.index.LocalIndexIT
Tests run: 6, Failures: 0, Errors: 0, Skipped: 0, Time elapsed: 32.967 sec - in org.apache.phoenix.end2end.TenantSpecificViewIndexIT
Running org.apache.phoenix.end2end.index.ImmutableIndexIT
Tests run: 19, Failures: 0, Errors: 0, Skipped: 0, Time elapsed: 38.23 sec - in org.apache.phoenix.end2end.DeleteIT
Running org.apache.phoenix.end2end.ServerExceptionIT
Tests run: 1, Failures: 0, Errors: 0, Skipped: 0, Time elapsed: 4.745 sec - in org.apache.phoenix.end2end.ServerExceptionIT
Running org.apache.phoenix.end2end.LastValueFunctionIT
Tests run: 11, Failures: 0, Errors: 0, Skipped: 0, Time elapsed: 12.299 sec - in org.apache.phoenix.end2end.LastValueFunctionIT
Running org.apache.phoenix.end2end.HashJoinIT
Tests run: 4, Failures: 0, Errors: 0, Skipped: 0, Time elapsed: 36.233 sec - in org.apache.phoenix.end2end.index.IndexMetadataIT
Running org.apache.phoenix.end2end.SortOrderFIT
Tests run: 7, Failures: 0, Errors: 0, Skipped: 0, Time elapsed: 33.318 sec - in org.apache.phoenix.end2end.index.ImmutableIndexIT
Running org.apache.phoenix.end2end.FirstValueFunctionIT
Tests run: 14, Failures: 0, Errors: 0, Skipped: 0, Time elapsed: 59.335 sec - in org.apache.phoenix.end2end.AlterTableIT
Running org.apache.phoenix.end2end.RoundFloorCeilFunctionsEnd2EndIT
Tests run: 30, Failures: 0, Errors: 0, Skipped: 0, Time elapsed: 7.965 sec - in org.apache.phoenix.end2end.SortOrderFIT
Tests run: 7, Failures: 0, Errors: 0, Skipped: 0, Time elapsed: 5.462 sec - in org.apache.phoenix.end2end.FirstValueFunctionIT
Running org.apache.phoenix.end2end.CSVCommonsLoaderIT
Running org.apache.phoenix.end2end.DynamicFamilyIT
Tests run: 3, Failures: 0, Errors: 0, Skipped: 0, Time elapsed: 44.44 sec - in org.apache.phoenix.end2end.index.SaltedIndexIT
Running org.apache.phoenix.end2end.UpsertBigValuesIT
Tests run: 30, Failures: 0, Errors: 0, Skipped: 0, Time elapsed: 7.092 sec - in org.apache.phoenix.end2end.RoundFloorCeilFunctionsEnd2EndIT
Running org.apache.phoenix.end2end.SaltedViewIT
Tests run: 4, Failures: 0, Errors: 0, Skipped: 0, Time elapsed: 9.078 sec - in org.apache.phoenix.end2end.DynamicFamilyIT
Running org.apache.phoenix.end2end.salted.SaltedTableUpsertSelectIT
Tests run: 13, Failures: 0, Errors: 0, Skipped: 0, Time elapsed: 16.578 sec - in org.apache.phoenix.end2end.CSVCommonsLoaderIT
Running org.apache.phoenix.end2end.StatementHintsIT
Tests run: 2, Failures: 0, Errors: 0, Skipped: 0, Time elapsed: 4.779 sec - in org.apache.phoenix.end2end.StatementHintsIT
Running org.apache.phoenix.end2end.ReverseFunctionIT
Tests run: 4, Failures: 0, Errors: 0, Skipped: 0, Time elapsed: 18.162 sec - in org.apache.phoenix.end2end.UpsertBigValuesIT
Running org.apache.phoenix.end2end.DecodeFunctionIT
Tests run: 5, Failures: 0, Errors: 0, Skipped: 0, Time elapsed: 16.5 sec - in org.apache.phoenix.end2end.salted.SaltedTableUpsertSelectIT
Running org.apache.phoenix.end2end.UpsertSelectAutoCommitIT
Tests run: 2, Failures: 0, Errors: 0, Skipped: 0, Time elapsed: 20.992 sec - in org.apache.phoenix.end2end.SaltedViewIT
Running org.apache.phoenix.end2end.LpadFunctionIT
Tests run: 5, Failures: 0, Errors: 0, Skipped: 0, Time elapsed: 7.327 sec - in org.apache.phoenix.end2end.ReverseFunctionIT
Running org.apache.phoenix.end2end.ViewIT
Tests run: 6, Failures: 0, Errors: 0, Skipped: 0, Time elapsed: 5.186 sec - in org.apache.phoenix.end2end.DecodeFunctionIT
Running org.apache.phoenix.end2end.QueryPlanIT
Tests run: 10, Failures: 0, Errors: 0, Skipped: 0, Time elapsed: 16.406 sec - in org.apache.phoenix.end2end.LpadFunctionIT
Running org.apache.phoenix.end2end.ModulusExpressionIT
Tests run: 8, Failures: 0, Errors: 0, Skipped: 0, Time elapsed: 18.835 sec - in org.apache.phoenix.end2end.ViewIT
Running org.apache.phoenix.end2end.ConvertTimezoneFunctionIT
Tests run: 2, Failures: 0, Errors: 0, Skipped: 0, Time elapsed: 22.873 sec - in org.apache.phoenix.end2end.UpsertSelectAutoCommitIT
Running org.apache.phoenix.end2end.InListIT
Tests run: 11, Failures: 0, Errors: 0, Skipped: 0, Time elapsed: 6.64 sec - in org.apache.phoenix.end2end.ModulusExpressionIT
Running org.apache.phoenix.end2end.ArithmeticQueryIT
Tests run: 1, Failures: 0, Errors: 0, Skipped: 0, Time elapsed: 22.545 sec - in org.apache.phoenix.end2end.QueryPlanIT
Running org.apache.phoenix.end2end.AutoCommitIT
Tests run: 6, Failures: 0, Errors: 0, Skipped: 0, Time elapsed: 5.057 sec - in org.apache.phoenix.end2end.ConvertTimezoneFunctionIT
Running org.apache.phoenix.end2end.ExecuteStatementsIT
Tests run: 1, Failures: 0, Errors: 0, Skipped: 0, Time elapsed: 6.827 sec - in org.apache.phoenix.end2end.AutoCommitIT
Running org.apache.phoenix.end2end.MD5FunctionIT
Tests run: 2, Failures: 0, Errors: 0, Skipped: 0, Time elapsed: 9.107 sec - in org.apache.phoenix.end2end.MD5FunctionIT
Running org.apache.phoenix.end2end.SpillableGroupByIT
Tests run: 1, Failures: 0, Errors: 0, Skipped: 0, Time elapsed: 6.837 sec - in org.apache.phoenix.end2end.SpillableGroupByIT
Running org.apache.phoenix.end2end.NthValueFunctionIT
Tests run: 2, Failures: 0, Errors: 0, Skipped: 0, Time elapsed: 23.294 sec - in org.apache.phoenix.end2end.ExecuteStatementsIT
Running org.apache.phoenix.end2end.SkipScanAfterManualSplitIT
Tests run: 20, Failures: 0, Errors: 0, Skipped: 0, Time elapsed: 30.734 sec - in org.apache.phoenix.end2end.ArithmeticQueryIT
Running org.apache.phoenix.end2end.QueryMoreIT
Tests run: 5, Failures: 0, Errors: 0, Skipped: 0, Time elapsed: 10.887 sec - in org.apache.phoenix.end2end.NthValueFunctionIT
Running org.apache.phoenix.trace.PhoenixTracingEndToEndIT
Tests run: 4, Failures: 0, Errors: 0, Skipped: 4, Time elapsed: 0.13 sec - in org.apache.phoenix.trace.PhoenixTracingEndToEndIT
Running org.apache.phoenix.trace.PhoenixTableMetricsWriterIT
Tests run: 2, Failures: 0, Errors: 0, Skipped: 2, Time elapsed: 0.123 sec - in org.apache.phoenix.trace.PhoenixTableMetricsWriterIT
Running org.apache.phoenix.trace.PhoenixTraceReaderIT
Tests run: 2, Failures: 0, Errors: 0, Skipped: 2, Time elapsed: 0.121 sec - in org.apache.phoenix.trace.PhoenixTraceReaderIT
Tests run: 93, Failures: 0, Errors: 0, Skipped: 0, Time elapsed: 112.894 sec - in org.apache.phoenix.end2end.HashJoinIT
Tests run: 2, Failures: 0, Errors: 0, Skipped: 0, Time elapsed: 58.061 sec - in org.apache.phoenix.end2end.SkipScanAfterManualSplitIT
Tests run: 4, Failures: 0, Errors: 0, Skipped: 0, Time elapsed: 83.998 sec - in org.apache.phoenix.end2end.QueryMoreIT
Tests run: 25, Failures: 0, Errors: 0, Skipped: 0, Time elapsed: 126.577 sec - in org.apache.phoenix.end2end.InListIT
Tests run: 16, Failures: 1, Errors: 0, Skipped: 0, Time elapsed: 216.875 sec <<<
FAILURE! - in org.apache.phoenix.end2end.index.LocalIndexIT
testLocalIndexScanAfterRegionSplit(org.apache.phoenix.end2end.index.LocalIndexIT)  Time elapsed:
24.389 sec  <<< FAILURE!
org.junit.ComparisonFailure: expected:<[a]> but was:<[d]>
	at org.junit.Assert.assertEquals(Assert.java:115)
	at org.junit.Assert.assertEquals(Assert.java:144)
	at org.apache.phoenix.end2end.index.LocalIndexIT.testLocalIndexScanAfterRegionSplit(LocalIndexIT.java:673)

Tests run: 26, Failures: 0, Errors: 0, Skipped: 0, Time elapsed: 260.138 sec - in org.apache.phoenix.end2end.index.MutableIndexIT

Results :

Failed tests: 
  LocalIndexIT.testLocalIndexScanAfterRegionSplit:673 expected:<[a]> but was:<[d]>

Tests run: 451, Failures: 1, Errors: 0, Skipped: 8

[INFO] 
[INFO] --- maven-failsafe-plugin:2.17:integration-test (NeedTheirOwnClusterTests) @ phoenix-core
---
[INFO] Failsafe report directory: /x1/jenkins/jenkins-slave/workspace/Phoenix-4.0-hadoop1/phoenix-core/target/failsafe-reports
[INFO] parallel='none', perCoreThreadCount=true, threadCount=0, useUnlimitedThreads=false,
threadCountSuites=0, threadCountClasses=0, threadCountMethods=0, parallelOptimized=true

-------------------------------------------------------
 T E S T S
-------------------------------------------------------

-------------------------------------------------------
 T E S T S
-------------------------------------------------------
Running org.apache.phoenix.end2end.index.MutableIndexFailureIT
Running org.apache.phoenix.hbase.index.covered.example.EndtoEndIndexingWithCompressionIT
Running org.apache.phoenix.hbase.index.covered.EndToEndCoveredColumnsIndexBuilderIT
Running org.apache.phoenix.hbase.index.covered.example.EndToEndCoveredIndexingIT
Running org.apache.phoenix.hbase.index.balancer.IndexLoadBalancerIT
Running org.apache.phoenix.end2end.ContextClassloaderIT
Tests run: 2, Failures: 0, Errors: 0, Skipped: 0, Time elapsed: 16.271 sec - in org.apache.phoenix.hbase.index.covered.EndToEndCoveredColumnsIndexBuilderIT
Running org.apache.phoenix.mapreduce.CsvBulkLoadToolIT
Tests run: 3, Failures: 0, Errors: 0, Skipped: 0, Time elapsed: 14.144 sec - in org.apache.phoenix.end2end.ContextClassloaderIT
Running org.apache.phoenix.hbase.index.FailForUnsupportedHBaseVersionsIT
Running org.apache.phoenix.hbase.index.covered.example.FailWithoutRetriesIT
Tests run: 1, Failures: 0, Errors: 0, Skipped: 0, Time elapsed: 5.441 sec - in org.apache.phoenix.hbase.index.covered.example.FailWithoutRetriesIT
Tests run: 2, Failures: 0, Errors: 0, Skipped: 0, Time elapsed: 25.747 sec - in org.apache.phoenix.hbase.index.FailForUnsupportedHBaseVersionsIT
Tests run: 11, Failures: 0, Errors: 0, Skipped: 0, Time elapsed: 120.013 sec - in org.apache.phoenix.hbase.index.covered.example.EndToEndCoveredIndexingIT
Tests run: 2, Failures: 0, Errors: 0, Skipped: 0, Time elapsed: 143.212 sec - in org.apache.phoenix.end2end.index.MutableIndexFailureIT
Tests run: 11, Failures: 0, Errors: 0, Skipped: 0, Time elapsed: 127.18 sec - in org.apache.phoenix.hbase.index.covered.example.EndtoEndIndexingWithCompressionIT
Tests run: 9, Failures: 1, Errors: 0, Skipped: 0, Time elapsed: 267.814 sec <<< FAILURE!
- in org.apache.phoenix.hbase.index.balancer.IndexLoadBalancerIT
testRoundRobinAssignmentAfterRegionServerDown(org.apache.phoenix.hbase.index.balancer.IndexLoadBalancerIT)
 Time elapsed: 15.212 sec  <<< FAILURE!
java.lang.AssertionError: User regions and index regions should colocate.
	at org.junit.Assert.fail(Assert.java:88)
	at org.junit.Assert.assertTrue(Assert.java:41)
	at org.apache.phoenix.hbase.index.balancer.IndexLoadBalancerIT.testRoundRobinAssignmentAfterRegionServerDown(IndexLoadBalancerIT.java:364)

Tests run: 4, Failures: 0, Errors: 0, Skipped: 0, Time elapsed: 299.24 sec - in org.apache.phoenix.mapreduce.CsvBulkLoadToolIT

Results :

Failed tests: 
  IndexLoadBalancerIT.testRoundRobinAssignmentAfterRegionServerDown:364 User regions and index
regions should colocate.

Tests run: 45, Failures: 1, Errors: 0, Skipped: 0

[INFO] 
[INFO] --- maven-failsafe-plugin:2.17:verify (ClientManagedTimeTests) @ phoenix-core ---
[INFO] Failsafe report directory: /x1/jenkins/jenkins-slave/workspace/Phoenix-4.0-hadoop1/phoenix-core/target/failsafe-reports
[INFO] ------------------------------------------------------------------------
[INFO] Reactor Summary:
[INFO] 
[INFO] Apache Phoenix .................................... SUCCESS [2.427s]
[INFO] Phoenix Hadoop Compatibility ...................... SUCCESS [3.107s]
[INFO] Phoenix Hadoop1 Compatibility ..................... SUCCESS [0.413s]
[INFO] Phoenix Core ...................................... FAILURE [16:45.925s]
[INFO] Phoenix - Flume ................................... SKIPPED
[INFO] Phoenix - Pig ..................................... SKIPPED
[INFO] Phoenix Assembly .................................. SKIPPED
[INFO] ------------------------------------------------------------------------
[INFO] BUILD FAILURE
[INFO] ------------------------------------------------------------------------
[INFO] Total time: 16:52.368s
[INFO] Finished at: Sat Aug 16 00:16:10 UTC 2014
[INFO] Final Memory: 41M/657M
[INFO] ------------------------------------------------------------------------
[ERROR] Failed to execute goal org.apache.maven.plugins:maven-failsafe-plugin:2.17:verify
(ClientManagedTimeTests) on project phoenix-core: There are test failures.
[ERROR] 
[ERROR] Please refer to /x1/jenkins/jenkins-slave/workspace/Phoenix-4.0-hadoop1/phoenix-core/target/failsafe-reports
for the individual test results.
[ERROR] -> [Help 1]
[ERROR] 
[ERROR] To see the full stack trace of the errors, re-run Maven with the -e switch.
[ERROR] Re-run Maven using the -X switch to enable full debug logging.
[ERROR] 
[ERROR] For more information about the errors and possible solutions, please read the following
articles:
[ERROR] [Help 1] http://cwiki.apache.org/confluence/display/MAVEN/MojoFailureException
[ERROR] 
[ERROR] After correcting the problems, you can resume the build with the command
[ERROR]   mvn <goals> -rf :phoenix-core
Build step 'Invoke top-level Maven targets' marked build as failure
Archiving artifacts
Sending artifact delta relative to Phoenix | 4.0 | Hadoop1 #278
Archived 566 artifacts
Archive block size is 32768
Received 1140 blocks and 199433486 bytes
Compression is 15.8%
Took 1 min 5 sec
Recording test results

Mime
View raw message