phoenix-commits mailing list archives

Site index · List index
Message view « Date » · « Thread »
Top « Date » · « Thread »
From Apache Jenkins Server <jenk...@builds.apache.org>
Subject Build failed in Jenkins: Phoenix | Master | Hadoop1 #301
Date Mon, 28 Jul 2014 19:49:49 GMT
See <https://builds.apache.org/job/Phoenix-master-hadoop1/301/changes>

Changes:

[jtaylor] PHOENIX-788 Support cast from/to DATE/TIME/TIMESTAMP to/from LONG/UNSIGNED_LONG

------------------------------------------
[...truncated 3719 lines...]
Tests run: 3, Failures: 0, Errors: 0, Skipped: 0, Time elapsed: 0 sec - in org.apache.phoenix.query.HBaseFactoryProviderTest
Running org.apache.phoenix.query.ConnectionlessTest
Tests run: 4, Failures: 0, Errors: 0, Skipped: 0, Time elapsed: 0.065 sec - in org.apache.phoenix.query.ConnectionlessTest
Running org.apache.phoenix.trace.TraceReaderTest
Tests run: 5, Failures: 0, Errors: 0, Skipped: 0, Time elapsed: 0.294 sec - in org.apache.phoenix.util.csv.CsvUpsertExecutorTest
Running org.apache.phoenix.index.IndexMaintainerTest
Tests run: 23, Failures: 0, Errors: 0, Skipped: 0, Time elapsed: 0.414 sec - in org.apache.phoenix.index.IndexMaintainerTest
Running org.apache.phoenix.filter.SkipScanFilterTest
Tests run: 13, Failures: 0, Errors: 0, Skipped: 0, Time elapsed: 0.038 sec - in org.apache.phoenix.filter.SkipScanFilterTest
Running org.apache.phoenix.filter.SkipScanFilterIntersectTest
Tests run: 17, Failures: 0, Errors: 0, Skipped: 0, Time elapsed: 0.017 sec - in org.apache.phoenix.filter.SkipScanFilterIntersectTest
Running org.apache.phoenix.iterate.AggregateResultScannerTest
Tests run: 1, Failures: 0, Errors: 0, Skipped: 0, Time elapsed: 0.083 sec - in org.apache.phoenix.iterate.AggregateResultScannerTest
Running org.apache.phoenix.iterate.ConcatResultIteratorTest
Tests run: 2, Failures: 0, Errors: 0, Skipped: 0, Time elapsed: 0.002 sec - in org.apache.phoenix.iterate.ConcatResultIteratorTest
Running org.apache.phoenix.iterate.SpoolingResultIteratorTest
Tests run: 3, Failures: 0, Errors: 0, Skipped: 0, Time elapsed: 0.328 sec - in org.apache.phoenix.iterate.SpoolingResultIteratorTest
Running org.apache.phoenix.iterate.MergeSortResultIteratorTest
Tests run: 1, Failures: 0, Errors: 0, Skipped: 0, Time elapsed: 0.002 sec - in org.apache.phoenix.iterate.MergeSortResultIteratorTest
Running org.apache.phoenix.arithmetic.ArithmeticOperationTest
Tests run: 5, Failures: 0, Errors: 0, Skipped: 0, Time elapsed: 0.007 sec - in org.apache.phoenix.arithmetic.ArithmeticOperationTest
Running org.apache.phoenix.schema.RowKeyValueAccessorTest
Tests run: 1, Failures: 0, Errors: 0, Skipped: 0, Time elapsed: 0.09 sec - in org.apache.phoenix.schema.RowKeyValueAccessorTest
Running org.apache.phoenix.schema.SchemaUtilTest
Tests run: 4, Failures: 0, Errors: 0, Skipped: 0, Time elapsed: 0.002 sec - in org.apache.phoenix.schema.SchemaUtilTest
Running org.apache.phoenix.schema.PDataTypeTest
Tests run: 23, Failures: 0, Errors: 0, Skipped: 0, Time elapsed: 0.022 sec - in org.apache.phoenix.schema.PDataTypeTest
Running org.apache.phoenix.schema.SortOrderTest
Tests run: 8, Failures: 0, Errors: 0, Skipped: 0, Time elapsed: 0.005 sec - in org.apache.phoenix.schema.SortOrderTest
Running org.apache.phoenix.schema.ValueBitSetTest
Tests run: 3, Failures: 0, Errors: 0, Skipped: 0, Time elapsed: 0.004 sec - in org.apache.phoenix.schema.ValueBitSetTest
Running org.apache.phoenix.schema.PDataTypeForArraysTest
Tests run: 60, Failures: 0, Errors: 0, Skipped: 0, Time elapsed: 0.037 sec - in org.apache.phoenix.schema.PDataTypeForArraysTest
Running org.apache.phoenix.schema.RowKeySchemaTest
Tests run: 6, Failures: 0, Errors: 0, Skipped: 0, Time elapsed: 0.11 sec - in org.apache.phoenix.schema.RowKeySchemaTest
Running org.apache.phoenix.schema.PMetaDataImplTest
Tests run: 1, Failures: 0, Errors: 0, Skipped: 0, Time elapsed: 0.004 sec - in org.apache.phoenix.schema.PMetaDataImplTest
Running org.apache.phoenix.hbase.index.covered.TestCoveredColumns
Tests run: 1, Failures: 0, Errors: 0, Skipped: 0, Time elapsed: 0.001 sec - in org.apache.phoenix.hbase.index.covered.TestCoveredColumns
Running org.apache.phoenix.hbase.index.covered.data.TestIndexMemStore
Tests run: 2, Failures: 0, Errors: 0, Skipped: 0, Time elapsed: 0.008 sec - in org.apache.phoenix.hbase.index.covered.data.TestIndexMemStore
Running org.apache.phoenix.hbase.index.covered.TestLocalTableState
Tests run: 3, Failures: 0, Errors: 0, Skipped: 0, Time elapsed: 0.125 sec - in org.apache.phoenix.hbase.index.covered.TestLocalTableState
Running org.apache.phoenix.hbase.index.covered.filter.TestFamilyOnlyFilter
Tests run: 3, Failures: 0, Errors: 0, Skipped: 0, Time elapsed: 0.002 sec - in org.apache.phoenix.hbase.index.covered.filter.TestFamilyOnlyFilter
Running org.apache.phoenix.hbase.index.covered.filter.TestApplyAndFilterDeletesFilter
Tests run: 6, Failures: 0, Errors: 0, Skipped: 0, Time elapsed: 0.002 sec - in org.apache.phoenix.hbase.index.covered.filter.TestApplyAndFilterDeletesFilter
Running org.apache.phoenix.hbase.index.covered.filter.TestNewerTimestampFilter
Tests run: 1, Failures: 0, Errors: 0, Skipped: 0, Time elapsed: 0.001 sec - in org.apache.phoenix.hbase.index.covered.filter.TestNewerTimestampFilter
Running org.apache.phoenix.hbase.index.covered.update.TestIndexUpdateManager
Tests run: 2, Failures: 0, Errors: 0, Skipped: 0, Time elapsed: 0.225 sec - in org.apache.phoenix.hbase.index.covered.update.TestIndexUpdateManager
Running org.apache.phoenix.hbase.index.covered.example.TestCoveredColumnIndexCodec
Tests run: 3, Failures: 0, Errors: 0, Skipped: 0, Time elapsed: 0.009 sec - in org.apache.phoenix.hbase.index.covered.example.TestCoveredColumnIndexCodec
Running org.apache.phoenix.hbase.index.covered.example.TestColumnTracker
Tests run: 3, Failures: 0, Errors: 0, Skipped: 0, Time elapsed: 0.001 sec - in org.apache.phoenix.hbase.index.covered.example.TestColumnTracker
Running org.apache.phoenix.hbase.index.covered.example.TestCoveredIndexSpecifierBuilder
Tests run: 1, Failures: 0, Errors: 0, Skipped: 0, Time elapsed: 0.001 sec - in org.apache.phoenix.hbase.index.covered.example.TestCoveredIndexSpecifierBuilder
Running org.apache.phoenix.hbase.index.parallel.TestThreadPoolBuilder
Tests run: 2, Failures: 0, Errors: 0, Skipped: 0, Time elapsed: 0.005 sec - in org.apache.phoenix.hbase.index.parallel.TestThreadPoolBuilder
Running org.apache.phoenix.hbase.index.parallel.TestThreadPoolManager
Tests run: 3, Failures: 0, Errors: 0, Skipped: 0, Time elapsed: 0.006 sec - in org.apache.phoenix.hbase.index.parallel.TestThreadPoolManager
Running org.apache.phoenix.hbase.index.util.TestIndexManagementUtil
Tests run: 3, Failures: 0, Errors: 0, Skipped: 0, Time elapsed: 0.011 sec - in org.apache.phoenix.hbase.index.util.TestIndexManagementUtil
Running org.apache.phoenix.hbase.index.write.TestParalleWriterIndexCommitter
Tests run: 2, Failures: 0, Errors: 0, Skipped: 0, Time elapsed: 0.047 sec - in org.apache.phoenix.hbase.index.write.TestParalleWriterIndexCommitter
Running org.apache.phoenix.hbase.index.write.TestWALRecoveryCaching
Tests run: 1, Failures: 0, Errors: 0, Skipped: 1, Time elapsed: 0.007 sec - in org.apache.phoenix.hbase.index.write.TestWALRecoveryCaching
Running org.apache.phoenix.hbase.index.write.recovery.TestPerRegionIndexWriteCache
Tests run: 3, Failures: 0, Errors: 0, Skipped: 0, Time elapsed: 0.438 sec - in org.apache.phoenix.hbase.index.write.recovery.TestPerRegionIndexWriteCache
Running org.apache.phoenix.hbase.index.write.TestCachingHTableFactory
Tests run: 1, Failures: 0, Errors: 0, Skipped: 0, Time elapsed: 0.009 sec - in org.apache.phoenix.hbase.index.write.TestCachingHTableFactory
Running org.apache.phoenix.hbase.index.write.TestParalleIndexWriter
Tests run: 2, Failures: 0, Errors: 0, Skipped: 0, Time elapsed: 0.006 sec - in org.apache.phoenix.hbase.index.write.TestParalleIndexWriter
Running org.apache.phoenix.hbase.index.write.TestIndexWriter
Tests run: 5, Failures: 0, Errors: 0, Skipped: 0, Time elapsed: 0.024 sec - in org.apache.phoenix.hbase.index.write.TestIndexWriter
Running org.apache.hadoop.hbase.ipc.PhoenixIndexRpcSchedulerTest
Tests run: 2, Failures: 0, Errors: 0, Skipped: 0, Time elapsed: 0.102 sec - in org.apache.hadoop.hbase.ipc.PhoenixIndexRpcSchedulerTest
Running org.apache.hadoop.hbase.regionserver.PhoenixIndexRpcSchedulerFactoryTest
Tests run: 2, Failures: 0, Errors: 0, Skipped: 0, Time elapsed: 0.008 sec - in org.apache.hadoop.hbase.regionserver.PhoenixIndexRpcSchedulerFactoryTest
Tests run: 2, Failures: 1, Errors: 1, Skipped: 0, Time elapsed: 2.696 sec <<< FAILURE!
- in org.apache.phoenix.trace.TraceReaderTest
org.apache.phoenix.trace.TraceReaderTest  Time elapsed: 2.696 sec  <<< ERROR!
java.lang.RuntimeException: java.net.UnknownHostException: asf901.ygridcore.net: asf901.ygridcore.net:
Name or service not known
	at org.apache.phoenix.query.BaseTest.initMiniCluster(BaseTest.java:497)
	at org.apache.phoenix.query.BaseTest.setUpTestCluster(BaseTest.java:455)
	at org.apache.phoenix.end2end.BaseHBaseManagedTimeIT.checkClusterInitialized(BaseHBaseManagedTimeIT.java:87)
	at org.apache.phoenix.end2end.BaseHBaseManagedTimeIT.getUrl(BaseHBaseManagedTimeIT.java:58)
	at org.apache.phoenix.end2end.BaseHBaseManagedTimeIT.doSetup(BaseHBaseManagedTimeIT.java:73)
	at sun.reflect.NativeMethodAccessorImpl.invoke0(Native Method)
	at sun.reflect.NativeMethodAccessorImpl.invoke(NativeMethodAccessorImpl.java:57)
	at sun.reflect.DelegatingMethodAccessorImpl.invoke(DelegatingMethodAccessorImpl.java:43)
	at java.lang.reflect.Method.invoke(Method.java:606)
	at org.junit.runners.model.FrameworkMethod$1.runReflectiveCall(FrameworkMethod.java:47)
	at org.junit.internal.runners.model.ReflectiveCallable.run(ReflectiveCallable.java:12)
	at org.junit.runners.model.FrameworkMethod.invokeExplosively(FrameworkMethod.java:44)
	at org.junit.internal.runners.statements.RunBefores.evaluate(RunBefores.java:24)
	at org.junit.internal.runners.statements.RunAfters.evaluate(RunAfters.java:27)
	at org.junit.runners.ParentRunner.run(ParentRunner.java:309)
	at org.apache.maven.surefire.junit4.JUnit4Provider.execute(JUnit4Provider.java:264)
	at org.apache.maven.surefire.junit4.JUnit4Provider.executeTestSet(JUnit4Provider.java:153)
	at org.apache.maven.surefire.junit4.JUnit4Provider.invoke(JUnit4Provider.java:124)
	at org.apache.maven.surefire.booter.ForkedBooter.invokeProviderInSameClassLoader(ForkedBooter.java:200)
	at org.apache.maven.surefire.booter.ForkedBooter.runSuitesInProcess(ForkedBooter.java:153)
	at org.apache.maven.surefire.booter.ForkedBooter.main(ForkedBooter.java:103)
Caused by: java.net.UnknownHostException: asf901.ygridcore.net: asf901.ygridcore.net: Name
or service not known
	at java.net.InetAddress.getLocalHost(InetAddress.java:1466)
	at org.apache.hadoop.security.SecurityUtil.getLocalHostName(SecurityUtil.java:227)
	at org.apache.hadoop.security.SecurityUtil.login(SecurityUtil.java:247)
	at org.apache.hadoop.hdfs.server.datanode.DataNode.instantiateDataNode(DataNode.java:1640)
	at org.apache.hadoop.hdfs.MiniDFSCluster.startDataNodes(MiniDFSCluster.java:1188)
	at org.apache.hadoop.hdfs.MiniDFSCluster.initMiniDFSCluster(MiniDFSCluster.java:663)
	at org.apache.hadoop.hdfs.MiniDFSCluster.<init>(MiniDFSCluster.java:585)
	at org.apache.hadoop.hbase.HBaseTestingUtility.startMiniDFSCluster(HBaseTestingUtility.java:517)
	at org.apache.hadoop.hbase.HBaseTestingUtility.startMiniCluster(HBaseTestingUtility.java:846)
	at org.apache.hadoop.hbase.HBaseTestingUtility.startMiniCluster(HBaseTestingUtility.java:771)
	at org.apache.hadoop.hbase.HBaseTestingUtility.startMiniCluster(HBaseTestingUtility.java:742)
	at org.apache.hadoop.hbase.HBaseTestingUtility.startMiniCluster(HBaseTestingUtility.java:711)
	at org.apache.phoenix.query.BaseTest.initMiniCluster(BaseTest.java:480)
	at org.apache.phoenix.query.BaseTest.setUpTestCluster(BaseTest.java:455)
	at org.apache.phoenix.end2end.BaseHBaseManagedTimeIT.checkClusterInitialized(BaseHBaseManagedTimeIT.java:87)
	at org.apache.phoenix.end2end.BaseHBaseManagedTimeIT.getUrl(BaseHBaseManagedTimeIT.java:58)
	at org.apache.phoenix.end2end.BaseHBaseManagedTimeIT.doSetup(BaseHBaseManagedTimeIT.java:73)
	at sun.reflect.NativeMethodAccessorImpl.invoke0(Native Method)
	at sun.reflect.NativeMethodAccessorImpl.invoke(NativeMethodAccessorImpl.java:57)
	at sun.reflect.DelegatingMethodAccessorImpl.invoke(DelegatingMethodAccessorImpl.java:43)
	at java.lang.reflect.Method.invoke(Method.java:606)
	at org.junit.runners.model.FrameworkMethod$1.runReflectiveCall(FrameworkMethod.java:47)
	at org.junit.internal.runners.model.ReflectiveCallable.run(ReflectiveCallable.java:12)
	at org.junit.runners.model.FrameworkMethod.invokeExplosively(FrameworkMethod.java:44)
	at org.junit.internal.runners.statements.RunBefores.evaluate(RunBefores.java:24)
	at org.junit.internal.runners.statements.RunAfters.evaluate(RunAfters.java:27)
	at org.junit.runners.ParentRunner.run(ParentRunner.java:309)
	at org.apache.maven.surefire.junit4.JUnit4Provider.execute(JUnit4Provider.java:264)
	at org.apache.maven.surefire.junit4.JUnit4Provider.executeTestSet(JUnit4Provider.java:153)
	at org.apache.maven.surefire.junit4.JUnit4Provider.invoke(JUnit4Provider.java:124)
	at org.apache.maven.surefire.booter.ForkedBooter.invokeProviderInSameClassLoader(ForkedBooter.java:200)
	at org.apache.maven.surefire.booter.ForkedBooter.runSuitesInProcess(ForkedBooter.java:153)
	at org.apache.maven.surefire.booter.ForkedBooter.main(ForkedBooter.java:103)
Caused by: java.net.UnknownHostException: asf901.ygridcore.net: Name or service not known
	at java.net.Inet6AddressImpl.lookupAllHostAddr(Native Method)
	at java.net.InetAddress$1.lookupAllHostAddr(InetAddress.java:894)
	at java.net.InetAddress.getAddressesFromNameService(InetAddress.java:1286)
	at java.net.InetAddress.getLocalHost(InetAddress.java:1462)
	at org.apache.hadoop.security.SecurityUtil.getLocalHostName(SecurityUtil.java:227)
	at org.apache.hadoop.security.SecurityUtil.login(SecurityUtil.java:247)
	at org.apache.hadoop.hdfs.server.datanode.DataNode.instantiateDataNode(DataNode.java:1640)
	at org.apache.hadoop.hdfs.MiniDFSCluster.startDataNodes(MiniDFSCluster.java:1188)
	at org.apache.hadoop.hdfs.MiniDFSCluster.initMiniDFSCluster(MiniDFSCluster.java:663)
	at org.apache.hadoop.hdfs.MiniDFSCluster.<init>(MiniDFSCluster.java:585)
	at org.apache.hadoop.hbase.HBaseTestingUtility.startMiniDFSCluster(HBaseTestingUtility.java:517)
	at org.apache.hadoop.hbase.HBaseTestingUtility.startMiniCluster(HBaseTestingUtility.java:846)
	at org.apache.hadoop.hbase.HBaseTestingUtility.startMiniCluster(HBaseTestingUtility.java:771)
	at org.apache.hadoop.hbase.HBaseTestingUtility.startMiniCluster(HBaseTestingUtility.java:742)
	at org.apache.hadoop.hbase.HBaseTestingUtility.startMiniCluster(HBaseTestingUtility.java:711)
	at org.apache.phoenix.query.BaseTest.initMiniCluster(BaseTest.java:480)
	at org.apache.phoenix.query.BaseTest.setUpTestCluster(BaseTest.java:455)
	at org.apache.phoenix.end2end.BaseHBaseManagedTimeIT.checkClusterInitialized(BaseHBaseManagedTimeIT.java:87)
	at org.apache.phoenix.end2end.BaseHBaseManagedTimeIT.getUrl(BaseHBaseManagedTimeIT.java:58)
	at org.apache.phoenix.end2end.BaseHBaseManagedTimeIT.doSetup(BaseHBaseManagedTimeIT.java:73)
	at sun.reflect.NativeMethodAccessorImpl.invoke0(Native Method)
	at sun.reflect.NativeMethodAccessorImpl.invoke(NativeMethodAccessorImpl.java:57)
	at sun.reflect.DelegatingMethodAccessorImpl.invoke(DelegatingMethodAccessorImpl.java:43)
	at java.lang.reflect.Method.invoke(Method.java:606)
	at org.junit.runners.model.FrameworkMethod$1.runReflectiveCall(FrameworkMethod.java:47)
	at org.junit.internal.runners.model.ReflectiveCallable.run(ReflectiveCallable.java:12)
	at org.junit.runners.model.FrameworkMethod.invokeExplosively(FrameworkMethod.java:44)
	at org.junit.internal.runners.statements.RunBefores.evaluate(RunBefores.java:24)
	at org.junit.internal.runners.statements.RunAfters.evaluate(RunAfters.java:27)
	at org.junit.runners.ParentRunner.run(ParentRunner.java:309)
	at org.apache.maven.surefire.junit4.JUnit4Provider.execute(JUnit4Provider.java:264)
	at org.apache.maven.surefire.junit4.JUnit4Provider.executeTestSet(JUnit4Provider.java:153)
	at org.apache.maven.surefire.junit4.JUnit4Provider.invoke(JUnit4Provider.java:124)
	at org.apache.maven.surefire.booter.ForkedBooter.invokeProviderInSameClassLoader(ForkedBooter.java:200)
	at org.apache.maven.surefire.booter.ForkedBooter.runSuitesInProcess(ForkedBooter.java:153)
	at org.apache.maven.surefire.booter.ForkedBooter.main(ForkedBooter.java:103)

org.apache.phoenix.trace.TraceReaderTest  Time elapsed: 2.696 sec  <<< FAILURE!
java.lang.AssertionError: null
	at org.junit.Assert.fail(Assert.java:86)
	at org.junit.Assert.assertTrue(Assert.java:41)
	at org.junit.Assert.assertTrue(Assert.java:52)
	at org.apache.phoenix.end2end.BaseHBaseManagedTimeIT.dropTables(BaseHBaseManagedTimeIT.java:99)
	at sun.reflect.NativeMethodAccessorImpl.invoke0(Native Method)
	at sun.reflect.NativeMethodAccessorImpl.invoke(NativeMethodAccessorImpl.java:57)
	at sun.reflect.DelegatingMethodAccessorImpl.invoke(DelegatingMethodAccessorImpl.java:43)
	at java.lang.reflect.Method.invoke(Method.java:606)
	at org.junit.runners.model.FrameworkMethod$1.runReflectiveCall(FrameworkMethod.java:47)
	at org.junit.internal.runners.model.ReflectiveCallable.run(ReflectiveCallable.java:12)
	at org.junit.runners.model.FrameworkMethod.invokeExplosively(FrameworkMethod.java:44)
	at org.junit.internal.runners.statements.RunAfters.evaluate(RunAfters.java:33)
	at org.junit.runners.ParentRunner.run(ParentRunner.java:309)
	at org.apache.maven.surefire.junit4.JUnit4Provider.execute(JUnit4Provider.java:264)
	at org.apache.maven.surefire.junit4.JUnit4Provider.executeTestSet(JUnit4Provider.java:153)
	at org.apache.maven.surefire.junit4.JUnit4Provider.invoke(JUnit4Provider.java:124)
	at org.apache.maven.surefire.booter.ForkedBooter.invokeProviderInSameClassLoader(ForkedBooter.java:200)
	at org.apache.maven.surefire.booter.ForkedBooter.runSuitesInProcess(ForkedBooter.java:153)
	at org.apache.maven.surefire.booter.ForkedBooter.main(ForkedBooter.java:103)

Tests run: 5, Failures: 0, Errors: 0, Skipped: 1, Time elapsed: 6.017 sec - in org.apache.phoenix.memory.MemoryManagerTest

Results :

Failed tests: 
  TraceReaderTest>BaseHBaseManagedTimeIT.dropTables:99 null

Tests in error: 
  TraceReaderTest>BaseHBaseManagedTimeIT.doSetup:73->BaseHBaseManagedTimeIT.getUrl:58->BaseHBaseManagedTimeIT.checkClusterInitialized:87->BaseTest.setUpTestCluster:455->BaseTest.initMiniCluster:497
? Runtime

Tests run: 746, Failures: 1, Errors: 1, Skipped: 3

[INFO] ------------------------------------------------------------------------
[INFO] Reactor Summary:
[INFO] 
[INFO] Apache Phoenix .................................... SUCCESS [2.190s]
[INFO] Phoenix Hadoop Compatibility ...................... SUCCESS [7.555s]
[INFO] Phoenix Hadoop2 Compatibility ..................... SUCCESS [2.977s]
[INFO] Phoenix Core ...................................... FAILURE [29.659s]
[INFO] Phoenix - Flume ................................... SKIPPED
[INFO] Phoenix - Pig ..................................... SKIPPED
[INFO] Phoenix Assembly .................................. SKIPPED
[INFO] ------------------------------------------------------------------------
[INFO] BUILD FAILURE
[INFO] ------------------------------------------------------------------------
[INFO] Total time: 42.804s
[INFO] Finished at: Mon Jul 28 19:47:23 UTC 2014
[INFO] Final Memory: 58M/898M
[INFO] ------------------------------------------------------------------------
[ERROR] Failed to execute goal org.apache.maven.plugins:maven-surefire-plugin:2.16:test (default-test)
on project phoenix-core: There are test failures.
[ERROR] 
[ERROR] Please refer to <https://builds.apache.org/job/Phoenix-master-hadoop1/ws/phoenix-core/target/surefire-reports>
for the individual test results.
[ERROR] -> [Help 1]
[ERROR] 
[ERROR] To see the full stack trace of the errors, re-run Maven with the -e switch.
[ERROR] Re-run Maven using the -X switch to enable full debug logging.
[ERROR] 
[ERROR] For more information about the errors and possible solutions, please read the following
articles:
[ERROR] [Help 1] http://cwiki.apache.org/confluence/display/MAVEN/MojoFailureException
[ERROR] 
[ERROR] After correcting the problems, you can resume the build with the command
[ERROR]   mvn <goals> -rf :phoenix-core
Build step 'Invoke top-level Maven targets' marked build as failure
Archiving artifacts
Sending artifact delta relative to Phoenix | Master | Hadoop1 #299
Archived 255 artifacts
Archive block size is 32768
Received 1087 blocks and 12801240 bytes
Compression is 73.6%
Took 32 sec
Updating PHOENIX-788
Recording test results

Mime
View raw message