phoenix-commits mailing list archives

Site index · List index
Message view « Date » · « Thread »
Top « Date » · « Thread »
From Apache Jenkins Server <jenk...@builds.apache.org>
Subject Build failed in Jenkins: Phoenix | 3.0 | Hadoop1 #149
Date Fri, 25 Jul 2014 07:16:25 GMT
See <https://builds.apache.org/job/Phoenix-3.0-hadoop1/149/changes>

Changes:

[jtaylor] Remove 2.2.x->3.0/4.0 upgrade code

------------------------------------------
[...truncated 217 lines...]
Tests run: 1, Failures: 0, Errors: 0, Skipped: 0, Time elapsed: 0.052 sec - in org.apache.phoenix.iterate.AggregateResultScannerTest
Running org.apache.phoenix.iterate.SpoolingResultIteratorTest
Tests run: 3, Failures: 0, Errors: 0, Skipped: 0, Time elapsed: 0.091 sec - in org.apache.phoenix.iterate.SpoolingResultIteratorTest
Running org.apache.phoenix.hbase.index.util.TestIndexManagementUtil
Tests run: 3, Failures: 0, Errors: 0, Skipped: 0, Time elapsed: 0.009 sec - in org.apache.phoenix.hbase.index.util.TestIndexManagementUtil
Running org.apache.phoenix.hbase.index.parallel.TestThreadPoolBuilder
Tests run: 2, Failures: 0, Errors: 0, Skipped: 0, Time elapsed: 0.006 sec - in org.apache.phoenix.hbase.index.parallel.TestThreadPoolBuilder
Running org.apache.phoenix.hbase.index.parallel.TestThreadPoolManager
Tests run: 3, Failures: 0, Errors: 0, Skipped: 0, Time elapsed: 0.007 sec - in org.apache.phoenix.hbase.index.parallel.TestThreadPoolManager
Running org.apache.phoenix.hbase.index.write.recovery.TestPerRegionIndexWriteCache
Tests run: 3, Failures: 0, Errors: 0, Skipped: 0, Time elapsed: 0.031 sec - in org.apache.phoenix.hbase.index.write.recovery.TestPerRegionIndexWriteCache
Running org.apache.phoenix.hbase.index.write.TestCachingHTableFactory
Tests run: 1, Failures: 0, Errors: 0, Skipped: 0, Time elapsed: 0.044 sec - in org.apache.phoenix.hbase.index.write.TestCachingHTableFactory
Running org.apache.phoenix.hbase.index.write.TestParalleIndexWriter
Tests run: 2, Failures: 0, Errors: 0, Skipped: 0, Time elapsed: 0.254 sec - in org.apache.phoenix.hbase.index.write.TestParalleIndexWriter
Running org.apache.phoenix.hbase.index.write.TestWALRecoveryCaching
Tests run: 1, Failures: 0, Errors: 0, Skipped: 1, Time elapsed: 0.015 sec - in org.apache.phoenix.hbase.index.write.TestWALRecoveryCaching
Running org.apache.phoenix.hbase.index.write.TestParalleWriterIndexCommitter
Tests run: 2, Failures: 0, Errors: 0, Skipped: 0, Time elapsed: 0.012 sec - in org.apache.phoenix.hbase.index.write.TestParalleWriterIndexCommitter
Running org.apache.phoenix.hbase.index.write.TestIndexWriter
Tests run: 5, Failures: 0, Errors: 0, Skipped: 0, Time elapsed: 0.05 sec - in org.apache.phoenix.hbase.index.write.TestIndexWriter
Running org.apache.phoenix.hbase.index.covered.TestLocalTableState
Tests run: 3, Failures: 0, Errors: 0, Skipped: 0, Time elapsed: 0.109 sec - in org.apache.phoenix.hbase.index.covered.TestLocalTableState
Running org.apache.phoenix.hbase.index.covered.example.TestCoveredIndexSpecifierBuilder
Tests run: 1, Failures: 0, Errors: 0, Skipped: 0, Time elapsed: 0.002 sec - in org.apache.phoenix.hbase.index.covered.example.TestCoveredIndexSpecifierBuilder
Running org.apache.phoenix.hbase.index.covered.example.TestCoveredColumnIndexCodec
Tests run: 3, Failures: 0, Errors: 0, Skipped: 0, Time elapsed: 0.008 sec - in org.apache.phoenix.hbase.index.covered.example.TestCoveredColumnIndexCodec
Running org.apache.phoenix.hbase.index.covered.example.TestColumnTracker
Tests run: 3, Failures: 0, Errors: 0, Skipped: 0, Time elapsed: 0.001 sec - in org.apache.phoenix.hbase.index.covered.example.TestColumnTracker
Running org.apache.phoenix.hbase.index.covered.update.TestIndexUpdateManager
Tests run: 2, Failures: 0, Errors: 0, Skipped: 0, Time elapsed: 0.021 sec - in org.apache.phoenix.hbase.index.covered.update.TestIndexUpdateManager
Running org.apache.phoenix.hbase.index.covered.TestCoveredColumns
Tests run: 1, Failures: 0, Errors: 0, Skipped: 0, Time elapsed: 0.001 sec - in org.apache.phoenix.hbase.index.covered.TestCoveredColumns
Running org.apache.phoenix.hbase.index.covered.filter.TestNewerTimestampFilter
Tests run: 1, Failures: 0, Errors: 0, Skipped: 0, Time elapsed: 0.001 sec - in org.apache.phoenix.hbase.index.covered.filter.TestNewerTimestampFilter
Running org.apache.phoenix.hbase.index.covered.filter.TestApplyAndFilterDeletesFilter
Tests run: 6, Failures: 0, Errors: 0, Skipped: 0, Time elapsed: 0.003 sec - in org.apache.phoenix.hbase.index.covered.filter.TestApplyAndFilterDeletesFilter
Running org.apache.phoenix.hbase.index.covered.filter.TestFamilyOnlyFilter
Tests run: 3, Failures: 0, Errors: 0, Skipped: 0, Time elapsed: 0.002 sec - in org.apache.phoenix.hbase.index.covered.filter.TestFamilyOnlyFilter
Running org.apache.phoenix.hbase.index.covered.data.TestIndexMemStore
Tests run: 2, Failures: 0, Errors: 0, Skipped: 0, Time elapsed: 0.003 sec - in org.apache.phoenix.hbase.index.covered.data.TestIndexMemStore
Running org.apache.phoenix.filter.SkipScanFilterTest
Tests run: 13, Failures: 0, Errors: 0, Skipped: 0, Time elapsed: 0.057 sec - in org.apache.phoenix.filter.SkipScanFilterTest
Running org.apache.phoenix.filter.SkipScanFilterIntersectTest
Tests run: 17, Failures: 0, Errors: 0, Skipped: 0, Time elapsed: 0.018 sec - in org.apache.phoenix.filter.SkipScanFilterIntersectTest
Running org.apache.phoenix.query.ConnectionlessUpsertTest
Tests run: 3, Failures: 0, Errors: 0, Skipped: 0, Time elapsed: 0.046 sec - in org.apache.phoenix.query.ConnectionlessUpsertTest
Running org.apache.phoenix.query.HBaseFactoryProviderTest
Tests run: 3, Failures: 0, Errors: 0, Skipped: 0, Time elapsed: 0.001 sec - in org.apache.phoenix.query.HBaseFactoryProviderTest
Running org.apache.phoenix.compile.WhereOptimizerTest
Tests run: 91, Failures: 0, Errors: 0, Skipped: 0, Time elapsed: 0.354 sec - in org.apache.phoenix.compile.WhereOptimizerTest
Running org.apache.phoenix.compile.HavingCompilerTest
Tests run: 10, Failures: 0, Errors: 0, Skipped: 0, Time elapsed: 0.065 sec - in org.apache.phoenix.compile.HavingCompilerTest
Running org.apache.phoenix.compile.QueryCompilerTest
Tests run: 83, Failures: 0, Errors: 0, Skipped: 0, Time elapsed: 0.318 sec - in org.apache.phoenix.compile.QueryCompilerTest
Running org.apache.phoenix.compile.SelectStatementRewriterTest
Tests run: 5, Failures: 0, Errors: 0, Skipped: 0, Time elapsed: 0.071 sec - in org.apache.phoenix.compile.SelectStatementRewriterTest
Running org.apache.phoenix.compile.ViewCompilerTest
Tests run: 3, Failures: 0, Errors: 3, Skipped: 0, Time elapsed: 0.081 sec <<< FAILURE!
- in org.apache.phoenix.compile.ViewCompilerTest
testViewTypeCalculation(org.apache.phoenix.compile.ViewCompilerTest)  Time elapsed: 0.009
sec  <<< ERROR!
java.sql.SQLException: ERROR 1030 (42Y89): Cannot create table for tenant-specific connection
tableName=T
	at org.apache.phoenix.exception.SQLExceptionCode$Factory$1.newException(SQLExceptionCode.java:318)
	at org.apache.phoenix.exception.SQLExceptionInfo.buildException(SQLExceptionInfo.java:133)
	at org.apache.phoenix.schema.MetaDataClient.createTableInternal(MetaDataClient.java:882)
	at org.apache.phoenix.schema.MetaDataClient.createTable(MetaDataClient.java:422)
	at org.apache.phoenix.compile.CreateTableCompiler$2.execute(CreateTableCompiler.java:183)
	at org.apache.phoenix.jdbc.PhoenixStatement$2.call(PhoenixStatement.java:246)
	at org.apache.phoenix.jdbc.PhoenixStatement$2.call(PhoenixStatement.java:237)
	at org.apache.phoenix.util.PhoenixContextExecutor.call(PhoenixContextExecutor.java:54)
	at org.apache.phoenix.jdbc.PhoenixStatement.executeMutation(PhoenixStatement.java:236)
	at org.apache.phoenix.jdbc.PhoenixStatement.execute(PhoenixStatement.java:959)
	at org.apache.phoenix.compile.ViewCompilerTest.assertViewType(ViewCompilerTest.java:58)
	at org.apache.phoenix.compile.ViewCompilerTest.testViewTypeCalculation(ViewCompilerTest.java:40)

testInvalidUpsertSelect(org.apache.phoenix.compile.ViewCompilerTest)  Time elapsed: 0.001
sec  <<< ERROR!
java.sql.SQLException: ERROR 1030 (42Y89): Cannot create table for tenant-specific connection
tableName=T1
	at org.apache.phoenix.exception.SQLExceptionCode$Factory$1.newException(SQLExceptionCode.java:318)
	at org.apache.phoenix.exception.SQLExceptionInfo.buildException(SQLExceptionInfo.java:133)
	at org.apache.phoenix.schema.MetaDataClient.createTableInternal(MetaDataClient.java:882)
	at org.apache.phoenix.schema.MetaDataClient.createTable(MetaDataClient.java:422)
	at org.apache.phoenix.compile.CreateTableCompiler$2.execute(CreateTableCompiler.java:183)
	at org.apache.phoenix.jdbc.PhoenixStatement$2.call(PhoenixStatement.java:246)
	at org.apache.phoenix.jdbc.PhoenixStatement$2.call(PhoenixStatement.java:237)
	at org.apache.phoenix.util.PhoenixContextExecutor.call(PhoenixContextExecutor.java:54)
	at org.apache.phoenix.jdbc.PhoenixStatement.executeMutation(PhoenixStatement.java:236)
	at org.apache.phoenix.jdbc.PhoenixStatement.execute(PhoenixStatement.java:959)
	at org.apache.phoenix.compile.ViewCompilerTest.testInvalidUpsertSelect(ViewCompilerTest.java:105)

testViewInvalidation(org.apache.phoenix.compile.ViewCompilerTest)  Time elapsed: 0 sec  <<<
ERROR!
java.sql.SQLException: ERROR 1030 (42Y89): Cannot create table for tenant-specific connection
tableName=T
	at org.apache.phoenix.exception.SQLExceptionCode$Factory$1.newException(SQLExceptionCode.java:318)
	at org.apache.phoenix.exception.SQLExceptionInfo.buildException(SQLExceptionInfo.java:133)
	at org.apache.phoenix.schema.MetaDataClient.createTableInternal(MetaDataClient.java:882)
	at org.apache.phoenix.schema.MetaDataClient.createTable(MetaDataClient.java:422)
	at org.apache.phoenix.compile.CreateTableCompiler$2.execute(CreateTableCompiler.java:183)
	at org.apache.phoenix.jdbc.PhoenixStatement$2.call(PhoenixStatement.java:246)
	at org.apache.phoenix.jdbc.PhoenixStatement$2.call(PhoenixStatement.java:237)
	at org.apache.phoenix.util.PhoenixContextExecutor.call(PhoenixContextExecutor.java:54)
	at org.apache.phoenix.jdbc.PhoenixStatement.executeMutation(PhoenixStatement.java:236)
	at org.apache.phoenix.jdbc.PhoenixStatement.execute(PhoenixStatement.java:959)
	at org.apache.phoenix.compile.ViewCompilerTest.testViewInvalidation(ViewCompilerTest.java:80)

Running org.apache.phoenix.compile.QueryOptimizerTest
Tests run: 25, Failures: 0, Errors: 0, Skipped: 0, Time elapsed: 0.254 sec - in org.apache.phoenix.compile.QueryOptimizerTest
Running org.apache.phoenix.compile.ScanRangesTest
Tests run: 34, Failures: 0, Errors: 0, Skipped: 0, Time elapsed: 0.022 sec - in org.apache.phoenix.compile.ScanRangesTest
Running org.apache.phoenix.compile.StatementHintsCompilationTest
Tests run: 3, Failures: 0, Errors: 0, Skipped: 0, Time elapsed: 0.039 sec - in org.apache.phoenix.compile.StatementHintsCompilationTest
Running org.apache.phoenix.compile.WhereCompilerTest
Tests run: 41, Failures: 0, Errors: 5, Skipped: 1, Time elapsed: 0.131 sec <<< FAILURE!
- in org.apache.phoenix.compile.WhereCompilerTest
testSingleVariableFullPkSalted(org.apache.phoenix.compile.WhereCompilerTest)  Time elapsed:
0.001 sec  <<< ERROR!
java.sql.SQLException: ERROR 1030 (42Y89): Cannot create table for tenant-specific connection
tableName=T
	at org.apache.phoenix.exception.SQLExceptionCode$Factory$1.newException(SQLExceptionCode.java:318)
	at org.apache.phoenix.exception.SQLExceptionInfo.buildException(SQLExceptionInfo.java:133)
	at org.apache.phoenix.schema.MetaDataClient.createTableInternal(MetaDataClient.java:882)
	at org.apache.phoenix.schema.MetaDataClient.createTable(MetaDataClient.java:422)
	at org.apache.phoenix.compile.CreateTableCompiler$2.execute(CreateTableCompiler.java:183)
	at org.apache.phoenix.jdbc.PhoenixStatement$2.call(PhoenixStatement.java:246)
	at org.apache.phoenix.jdbc.PhoenixStatement$2.call(PhoenixStatement.java:237)
	at org.apache.phoenix.util.PhoenixContextExecutor.call(PhoenixContextExecutor.java:54)
	at org.apache.phoenix.jdbc.PhoenixStatement.executeMutation(PhoenixStatement.java:236)
	at org.apache.phoenix.jdbc.PhoenixStatement.execute(PhoenixStatement.java:959)
	at org.apache.phoenix.compile.WhereCompilerTest.testSingleVariableFullPkSalted(WhereCompilerTest.java:119)

testTenantConstraintsAddedToScanWithNullTenantTypeId(org.apache.phoenix.compile.WhereCompilerTest)
 Time elapsed: 0.007 sec  <<< ERROR!
org.apache.phoenix.schema.TableNotFoundException: ERROR 1012 (42M03): Table undefined. tableName=TENANT_FILTER_TEST
	at org.apache.phoenix.compile.FromCompiler$BaseColumnResolver.createTableRef(FromCompiler.java:283)
	at org.apache.phoenix.compile.FromCompiler$SingleTableColumnResolver.<init>(FromCompiler.java:200)
	at org.apache.phoenix.compile.FromCompiler.getResolverForQuery(FromCompiler.java:157)
	at org.apache.phoenix.jdbc.PhoenixStatement$ExecutableSelectStatement.compilePlan(PhoenixStatement.java:289)
	at org.apache.phoenix.jdbc.PhoenixStatement$ExecutableSelectStatement.compilePlan(PhoenixStatement.java:279)
	at org.apache.phoenix.jdbc.PhoenixStatement.optimizeQuery(PhoenixStatement.java:198)
	at org.apache.phoenix.jdbc.PhoenixPreparedStatement.optimizeQuery(PhoenixPreparedStatement.java:173)
	at org.apache.phoenix.compile.WhereCompilerTest.testTenantConstraintsAddedToScanWithNullTenantTypeId(WhereCompilerTest.java:903)

testTenantConstraintsAddedToScan(org.apache.phoenix.compile.WhereCompilerTest)  Time elapsed:
0.01 sec  <<< ERROR!
org.apache.phoenix.schema.TableNotFoundException: ERROR 1012 (42M03): Table undefined. tableName=TENANT_FILTER_TEST
	at org.apache.phoenix.compile.FromCompiler$BaseColumnResolver.createTableRef(FromCompiler.java:283)
	at org.apache.phoenix.compile.FromCompiler$SingleTableColumnResolver.<init>(FromCompiler.java:200)
	at org.apache.phoenix.compile.FromCompiler.getResolverForQuery(FromCompiler.java:157)
	at org.apache.phoenix.jdbc.PhoenixStatement$ExecutableSelectStatement.compilePlan(PhoenixStatement.java:289)
	at org.apache.phoenix.jdbc.PhoenixStatement$ExecutableSelectStatement.compilePlan(PhoenixStatement.java:279)
	at org.apache.phoenix.jdbc.PhoenixStatement.optimizeQuery(PhoenixStatement.java:198)
	at org.apache.phoenix.jdbc.PhoenixPreparedStatement.optimizeQuery(PhoenixPreparedStatement.java:173)
	at org.apache.phoenix.compile.WhereCompilerTest.testTenantConstraintsAddedToScan(WhereCompilerTest.java:871)

testSingleFixedFullPkSalted(org.apache.phoenix.compile.WhereCompilerTest)  Time elapsed: 0.001
sec  <<< ERROR!
java.sql.SQLException: ERROR 1030 (42Y89): Cannot create table for tenant-specific connection
tableName=T
	at org.apache.phoenix.exception.SQLExceptionCode$Factory$1.newException(SQLExceptionCode.java:318)
	at org.apache.phoenix.exception.SQLExceptionInfo.buildException(SQLExceptionInfo.java:133)
	at org.apache.phoenix.schema.MetaDataClient.createTableInternal(MetaDataClient.java:882)
	at org.apache.phoenix.schema.MetaDataClient.createTable(MetaDataClient.java:422)
	at org.apache.phoenix.compile.CreateTableCompiler$2.execute(CreateTableCompiler.java:183)
	at org.apache.phoenix.jdbc.PhoenixStatement$2.call(PhoenixStatement.java:246)
	at org.apache.phoenix.jdbc.PhoenixStatement$2.call(PhoenixStatement.java:237)
	at org.apache.phoenix.util.PhoenixContextExecutor.call(PhoenixContextExecutor.java:54)
	at org.apache.phoenix.jdbc.PhoenixStatement.executeMutation(PhoenixStatement.java:236)
	at org.apache.phoenix.jdbc.PhoenixStatement.execute(PhoenixStatement.java:959)
	at org.apache.phoenix.compile.WhereCompilerTest.testSingleFixedFullPkSalted(WhereCompilerTest.java:98)

testMultiFixedFullPkSalted(org.apache.phoenix.compile.WhereCompilerTest)  Time elapsed: 0.001
sec  <<< ERROR!
java.sql.SQLException: ERROR 1030 (42Y89): Cannot create table for tenant-specific connection
tableName=T
	at org.apache.phoenix.exception.SQLExceptionCode$Factory$1.newException(SQLExceptionCode.java:318)
	at org.apache.phoenix.exception.SQLExceptionInfo.buildException(SQLExceptionInfo.java:133)
	at org.apache.phoenix.schema.MetaDataClient.createTableInternal(MetaDataClient.java:882)
	at org.apache.phoenix.schema.MetaDataClient.createTable(MetaDataClient.java:422)
	at org.apache.phoenix.compile.CreateTableCompiler$2.execute(CreateTableCompiler.java:183)
	at org.apache.phoenix.jdbc.PhoenixStatement$2.call(PhoenixStatement.java:246)
	at org.apache.phoenix.jdbc.PhoenixStatement$2.call(PhoenixStatement.java:237)
	at org.apache.phoenix.util.PhoenixContextExecutor.call(PhoenixContextExecutor.java:54)
	at org.apache.phoenix.jdbc.PhoenixStatement.executeMutation(PhoenixStatement.java:236)
	at org.apache.phoenix.jdbc.PhoenixStatement.execute(PhoenixStatement.java:959)
	at org.apache.phoenix.compile.WhereCompilerTest.testMultiFixedFullPkSalted(WhereCompilerTest.java:140)

Running org.apache.phoenix.compile.QueryMetaDataTest
Tests run: 32, Failures: 0, Errors: 0, Skipped: 0, Time elapsed: 0.084 sec - in org.apache.phoenix.compile.QueryMetaDataTest
Running org.apache.phoenix.compile.TenantSpecificViewIndexCompileTest
Tests run: 3, Failures: 0, Errors: 0, Skipped: 0, Time elapsed: 0.077 sec - in org.apache.phoenix.compile.TenantSpecificViewIndexCompileTest
Running org.apache.phoenix.compile.LimitCompilerTest
Tests run: 6, Failures: 0, Errors: 0, Skipped: 0, Time elapsed: 0.036 sec - in org.apache.phoenix.compile.LimitCompilerTest
Running org.apache.phoenix.compile.JoinQueryCompilerTest
Tests run: 2, Failures: 0, Errors: 0, Skipped: 0, Time elapsed: 0.049 sec - in org.apache.phoenix.compile.JoinQueryCompilerTest
Running org.apache.phoenix.expression.CoerceExpressionTest
Tests run: 5, Failures: 0, Errors: 0, Skipped: 0, Time elapsed: 0.003 sec - in org.apache.phoenix.expression.CoerceExpressionTest
Running org.apache.phoenix.expression.SortOrderExpressionTest
Tests run: 24, Failures: 0, Errors: 0, Skipped: 0, Time elapsed: 0.015 sec - in org.apache.phoenix.expression.SortOrderExpressionTest
Running org.apache.phoenix.expression.function.ExternalSqlTypeIdFunctionTest
Tests run: 2, Failures: 0, Errors: 0, Skipped: 0, Time elapsed: 0.001 sec - in org.apache.phoenix.expression.function.ExternalSqlTypeIdFunctionTest
Running org.apache.phoenix.expression.LikeExpressionTest
Tests run: 1, Failures: 0, Errors: 0, Skipped: 0, Time elapsed: 0.001 sec - in org.apache.phoenix.expression.LikeExpressionTest
Running org.apache.phoenix.expression.ColumnExpressionTest
Tests run: 4, Failures: 0, Errors: 0, Skipped: 0, Time elapsed: 0.001 sec - in org.apache.phoenix.expression.ColumnExpressionTest
Running org.apache.phoenix.arithmetic.ArithmeticOperationTest
Tests run: 5, Failures: 0, Errors: 0, Skipped: 0, Time elapsed: 0.007 sec - in org.apache.phoenix.arithmetic.ArithmeticOperationTest
Tests run: 5, Failures: 0, Errors: 0, Skipped: 1, Time elapsed: 6.014 sec - in org.apache.phoenix.memory.MemoryManagerTest

Results :

Tests in error: 
  ViewCompilerTest.testViewTypeCalculation:40->assertViewType:58 ? SQL ERROR 103...
  ViewCompilerTest.testInvalidUpsertSelect:105 ? SQL ERROR 1030 (42Y89): Cannot ...
  ViewCompilerTest.testViewInvalidation:80 ? SQL ERROR 1030 (42Y89): Cannot crea...
  WhereCompilerTest.testSingleVariableFullPkSalted:119 ? SQL ERROR 1030 (42Y89):...
  WhereCompilerTest.testTenantConstraintsAddedToScanWithNullTenantTypeId:903 ? TableNotFound
  WhereCompilerTest.testTenantConstraintsAddedToScan:871 ? TableNotFound ERROR 1...
  WhereCompilerTest.testSingleFixedFullPkSalted:98 ? SQL ERROR 1030 (42Y89): Can...
  WhereCompilerTest.testMultiFixedFullPkSalted:140 ? SQL ERROR 1030 (42Y89): Can...

Tests run: 745, Failures: 0, Errors: 8, Skipped: 3

[INFO] ------------------------------------------------------------------------
[INFO] Reactor Summary:
[INFO] 
[INFO] Apache Phoenix .................................... SUCCESS [2.020s]
[INFO] Phoenix Hadoop Compatibility ...................... SUCCESS [0.590s]
[INFO] Phoenix Core ...................................... FAILURE [26.156s]
[INFO] Phoenix - Flume ................................... SKIPPED
[INFO] Phoenix - Pig ..................................... SKIPPED
[INFO] Phoenix Hadoop1 Compatibility ..................... SKIPPED
[INFO] Phoenix Assembly .................................. SKIPPED
[INFO] ------------------------------------------------------------------------
[INFO] BUILD FAILURE
[INFO] ------------------------------------------------------------------------
[INFO] Total time: 29.184s
[INFO] Finished at: Fri Jul 25 07:15:20 UTC 2014
[INFO] Final Memory: 33M/456M
[INFO] ------------------------------------------------------------------------
[ERROR] Failed to execute goal org.apache.maven.plugins:maven-surefire-plugin:2.17:test (default-test)
on project phoenix-core: There are test failures.
[ERROR] 
[ERROR] Please refer to <https://builds.apache.org/job/Phoenix-3.0-hadoop1/ws/phoenix-core/target/surefire-reports>
for the individual test results.
[ERROR] -> [Help 1]
[ERROR] 
[ERROR] To see the full stack trace of the errors, re-run Maven with the -e switch.
[ERROR] Re-run Maven using the -X switch to enable full debug logging.
[ERROR] 
[ERROR] For more information about the errors and possible solutions, please read the following
articles:
[ERROR] [Help 1] http://cwiki.apache.org/confluence/display/MAVEN/MojoFailureException
[ERROR] 
[ERROR] After correcting the problems, you can resume the build with the command
[ERROR]   mvn <goals> -rf :phoenix-core
Build step 'Invoke top-level Maven targets' marked build as failure
Archiving artifacts
Sending artifact delta relative to Phoenix | 3.0 | Hadoop1 #147
Archived 192 artifacts
Archive block size is 32768
Received 0 blocks and 901036 bytes
Compression is 0.0%
Took 15 sec
Recording test results

Mime
View raw message