phoenix-commits mailing list archives

Site index · List index
Message view « Date » · « Thread »
Top « Date » · « Thread »
From Apache Jenkins Server <jenk...@builds.apache.org>
Subject Build failed in Jenkins: Phoenix | Master | Hadoop1 #259
Date Wed, 02 Jul 2014 14:17:20 GMT
See <https://builds.apache.org/job/Phoenix-master-hadoop1/259/changes>

Changes:

[anoopsamjohn] PHOENIX-1000 Support FIRST_VALUE, LAST_VALUE, and NTH_VALUE aggregate functions.
(Vaclav)

------------------------------------------
[...truncated 402 lines...]
Tests run: 100, Failures: 0, Errors: 0, Skipped: 0, Time elapsed: 72.109 sec - in org.apache.phoenix.end2end.QueryIT
Running org.apache.phoenix.end2end.CoalesceFunctionIT
Tests run: 1, Failures: 0, Errors: 0, Skipped: 0, Time elapsed: 6.887 sec - in org.apache.phoenix.end2end.CoalesceFunctionIT
Running org.apache.phoenix.end2end.CreateTableIT
Tests run: 49, Failures: 0, Errors: 0, Skipped: 0, Time elapsed: 32.24 sec - in org.apache.phoenix.end2end.VariableLengthPKIT
Running org.apache.phoenix.end2end.IsNullIT
Tests run: 7, Failures: 0, Errors: 0, Skipped: 0, Time elapsed: 18.547 sec - in org.apache.phoenix.end2end.MultiCfQueryExecIT
Running org.apache.phoenix.end2end.StddevIT
Tests run: 136, Failures: 0, Errors: 0, Skipped: 0, Time elapsed: 92.752 sec - in org.apache.phoenix.end2end.CaseStatementIT
Running org.apache.phoenix.end2end.RowValueConstructorIT
Tests run: 2, Failures: 0, Errors: 0, Skipped: 0, Time elapsed: 9.223 sec - in org.apache.phoenix.end2end.IsNullIT
Running org.apache.phoenix.end2end.ArrayIT
Tests run: 4, Failures: 0, Errors: 0, Skipped: 0, Time elapsed: 6.717 sec - in org.apache.phoenix.end2end.StddevIT
Running org.apache.phoenix.end2end.GroupByCaseIT
Tests run: 3, Failures: 0, Errors: 0, Skipped: 0, Time elapsed: 4.776 sec - in org.apache.phoenix.end2end.GroupByCaseIT
Running org.apache.phoenix.end2end.SpooledOrderByIT
Tests run: 3, Failures: 0, Errors: 0, Skipped: 1, Time elapsed: 5.219 sec - in org.apache.phoenix.end2end.SpooledOrderByIT
Running org.apache.phoenix.end2end.ClientTimeArithmeticQueryIT
Tests run: 25, Failures: 0, Errors: 0, Skipped: 0, Time elapsed: 25.492 sec - in org.apache.phoenix.end2end.RowValueConstructorIT
Running org.apache.phoenix.end2end.GroupByIT
Tests run: 42, Failures: 0, Errors: 0, Skipped: 0, Time elapsed: 27.239 sec - in org.apache.phoenix.end2end.ArrayIT
Running org.apache.phoenix.end2end.ProductMetricsIT
Tests run: 10, Failures: 0, Errors: 0, Skipped: 0, Time elapsed: 41.925 sec - in org.apache.phoenix.end2end.CreateTableIT
Tests run: 61, Failures: 0, Errors: 0, Skipped: 0, Time elapsed: 33.432 sec - in org.apache.phoenix.end2end.ProductMetricsIT
Tests run: 152, Failures: 0, Errors: 0, Skipped: 0, Time elapsed: 119.906 sec - in org.apache.phoenix.end2end.GroupByIT
Tests run: 216, Failures: 0, Errors: 0, Skipped: 0, Time elapsed: 145.599 sec - in org.apache.phoenix.end2end.ClientTimeArithmeticQueryIT

Results :

Tests run: 1482, Failures: 0, Errors: 0, Skipped: 3

[INFO] 
[INFO] --- maven-failsafe-plugin:2.17:integration-test (HBaseManagedTimeTests) @ phoenix-core
---
[INFO] Failsafe report directory: /x1/jenkins/jenkins-slave/workspace/Phoenix-master-hadoop1/phoenix-core/target/failsafe-reports
[INFO] parallel='none', perCoreThreadCount=true, threadCount=0, useUnlimitedThreads=false,
threadCountSuites=0, threadCountClasses=0, threadCountMethods=0, parallelOptimized=true

-------------------------------------------------------
 T E S T S
-------------------------------------------------------

-------------------------------------------------------
 T E S T S
-------------------------------------------------------
Running org.apache.phoenix.end2end.QueryExecWithoutSCNIT
Running org.apache.phoenix.end2end.DeleteIT
Running org.apache.phoenix.end2end.TenantSpecificViewIndexIT
Running org.apache.phoenix.end2end.SkipScanQueryIT
Tests run: 1, Failures: 0, Errors: 0, Skipped: 0, Time elapsed: 6.752 sec - in org.apache.phoenix.end2end.QueryExecWithoutSCNIT
Running org.apache.phoenix.end2end.BinaryRowKeyIT
Tests run: 3, Failures: 0, Errors: 0, Skipped: 0, Time elapsed: 4.336 sec - in org.apache.phoenix.end2end.BinaryRowKeyIT
Running org.apache.phoenix.end2end.TenantSpecificViewIndexSaltedIT
Tests run: 7, Failures: 0, Errors: 0, Skipped: 0, Time elapsed: 17.381 sec - in org.apache.phoenix.end2end.SkipScanQueryIT
Running org.apache.phoenix.end2end.EncodeFunctionIT
Tests run: 2, Failures: 0, Errors: 0, Skipped: 0, Time elapsed: 10.916 sec - in org.apache.phoenix.end2end.TenantSpecificViewIndexSaltedIT
Tests run: 3, Failures: 0, Errors: 0, Skipped: 0, Time elapsed: 21.278 sec - in org.apache.phoenix.end2end.TenantSpecificViewIndexIT
Running org.apache.phoenix.end2end.TimezoneOffsetFunctionIT
Running org.apache.phoenix.end2end.AlterTableIT
Tests run: 15, Failures: 0, Errors: 0, Skipped: 0, Time elapsed: 24.298 sec - in org.apache.phoenix.end2end.DeleteIT
Running org.apache.phoenix.end2end.index.MutableIndexIT
Tests run: 6, Failures: 0, Errors: 0, Skipped: 0, Time elapsed: 4.959 sec - in org.apache.phoenix.end2end.TimezoneOffsetFunctionIT
Running org.apache.phoenix.end2end.index.DropViewIT
Tests run: 6, Failures: 0, Errors: 0, Skipped: 0, Time elapsed: 13.858 sec - in org.apache.phoenix.end2end.EncodeFunctionIT
Running org.apache.phoenix.end2end.index.IndexMetadataIT
Tests run: 1, Failures: 0, Errors: 0, Skipped: 0, Time elapsed: 6.478 sec - in org.apache.phoenix.end2end.index.DropViewIT
Running org.apache.phoenix.end2end.index.SaltedIndexIT
Tests run: 3, Failures: 0, Errors: 0, Skipped: 0, Time elapsed: 29.111 sec - in org.apache.phoenix.end2end.index.SaltedIndexIT
Running org.apache.phoenix.end2end.index.ImmutableIndexIT
Tests run: 4, Failures: 0, Errors: 0, Skipped: 0, Time elapsed: 30.207 sec - in org.apache.phoenix.end2end.index.IndexMetadataIT
Running org.apache.phoenix.end2end.ServerExceptionIT
Tests run: 13, Failures: 0, Errors: 0, Skipped: 0, Time elapsed: 45.399 sec - in org.apache.phoenix.end2end.AlterTableIT
Running org.apache.phoenix.end2end.LastValueFunctionIT
Tests run: 1, Failures: 0, Errors: 0, Skipped: 0, Time elapsed: 4.343 sec - in org.apache.phoenix.end2end.ServerExceptionIT
Running org.apache.phoenix.end2end.HashJoinIT
Tests run: 11, Failures: 0, Errors: 0, Skipped: 0, Time elapsed: 8.572 sec - in org.apache.phoenix.end2end.LastValueFunctionIT
Running org.apache.phoenix.end2end.SortOrderFIT
Tests run: 7, Failures: 0, Errors: 0, Skipped: 0, Time elapsed: 20.59 sec - in org.apache.phoenix.end2end.index.ImmutableIndexIT
Running org.apache.phoenix.end2end.FirstValueFunctionIT
Tests run: 30, Failures: 0, Errors: 0, Skipped: 0, Time elapsed: 7.501 sec - in org.apache.phoenix.end2end.SortOrderFIT
Running org.apache.phoenix.end2end.RoundFloorCeilFunctionsEnd2EndIT
Tests run: 7, Failures: 0, Errors: 2, Skipped: 0, Time elapsed: 4.805 sec <<< FAILURE!
- in org.apache.phoenix.end2end.FirstValueFunctionIT
testSortOrderInDataCol(org.apache.phoenix.end2end.FirstValueFunctionIT)  Time elapsed: 0.06
sec  <<< ERROR!
java.sql.SQLException: ERROR 517 (42895): Invalid not null constraint on non primary key column
columnName=PAGE_ID
	at org.apache.phoenix.exception.SQLExceptionCode$Factory$1.newException(SQLExceptionCode.java:310)
	at org.apache.phoenix.exception.SQLExceptionInfo.buildException(SQLExceptionInfo.java:133)
	at org.apache.phoenix.schema.MetaDataClient.createTableInternal(MetaDataClient.java:948)
	at org.apache.phoenix.schema.MetaDataClient.createTable(MetaDataClient.java:422)
	at org.apache.phoenix.compile.CreateTableCompiler$2.execute(CreateTableCompiler.java:183)
	at org.apache.phoenix.jdbc.PhoenixStatement$2.call(PhoenixStatement.java:246)
	at org.apache.phoenix.jdbc.PhoenixStatement$2.call(PhoenixStatement.java:237)
	at org.apache.phoenix.util.PhoenixContextExecutor.call(PhoenixContextExecutor.java:54)
	at org.apache.phoenix.jdbc.PhoenixStatement.executeMutation(PhoenixStatement.java:236)
	at org.apache.phoenix.jdbc.PhoenixStatement.execute(PhoenixStatement.java:952)
	at org.apache.phoenix.end2end.FirstValueFunctionIT.testSortOrderInDataCol(FirstValueFunctionIT.java:82)

testSortOrderInSortCol(org.apache.phoenix.end2end.FirstValueFunctionIT)  Time elapsed: 0.053
sec  <<< ERROR!
java.sql.SQLException: ERROR 517 (42895): Invalid not null constraint on non primary key column
columnName=PAGE_ID
	at org.apache.phoenix.exception.SQLExceptionCode$Factory$1.newException(SQLExceptionCode.java:310)
	at org.apache.phoenix.exception.SQLExceptionInfo.buildException(SQLExceptionInfo.java:133)
	at org.apache.phoenix.schema.MetaDataClient.createTableInternal(MetaDataClient.java:948)
	at org.apache.phoenix.schema.MetaDataClient.createTable(MetaDataClient.java:422)
	at org.apache.phoenix.compile.CreateTableCompiler$2.execute(CreateTableCompiler.java:183)
	at org.apache.phoenix.jdbc.PhoenixStatement$2.call(PhoenixStatement.java:246)
	at org.apache.phoenix.jdbc.PhoenixStatement$2.call(PhoenixStatement.java:237)
	at org.apache.phoenix.util.PhoenixContextExecutor.call(PhoenixContextExecutor.java:54)
	at org.apache.phoenix.jdbc.PhoenixStatement.executeMutation(PhoenixStatement.java:236)
	at org.apache.phoenix.jdbc.PhoenixStatement.execute(PhoenixStatement.java:952)
	at org.apache.phoenix.end2end.FirstValueFunctionIT.testSortOrderInSortCol(FirstValueFunctionIT.java:58)

Running org.apache.phoenix.end2end.CSVCommonsLoaderIT
Tests run: 30, Failures: 0, Errors: 0, Skipped: 0, Time elapsed: 7.465 sec - in org.apache.phoenix.end2end.RoundFloorCeilFunctionsEnd2EndIT
Running org.apache.phoenix.end2end.DynamicFamilyIT
Tests run: 4, Failures: 0, Errors: 0, Skipped: 0, Time elapsed: 11.2 sec - in org.apache.phoenix.end2end.DynamicFamilyIT
Running org.apache.phoenix.end2end.UpsertBigValuesIT
Tests run: 13, Failures: 0, Errors: 0, Skipped: 0, Time elapsed: 15.369 sec - in org.apache.phoenix.end2end.CSVCommonsLoaderIT
Running org.apache.phoenix.end2end.SaltedViewIT
Tests run: 1, Failures: 0, Errors: 0, Skipped: 0, Time elapsed: 12.785 sec - in org.apache.phoenix.end2end.SaltedViewIT
Running org.apache.phoenix.end2end.salted.SaltedTableUpsertSelectIT
Tests run: 4, Failures: 0, Errors: 0, Skipped: 0, Time elapsed: 16.58 sec - in org.apache.phoenix.end2end.UpsertBigValuesIT
Running org.apache.phoenix.end2end.StatementHintsIT
Tests run: 2, Failures: 0, Errors: 0, Skipped: 0, Time elapsed: 4.565 sec - in org.apache.phoenix.end2end.StatementHintsIT
Running org.apache.phoenix.end2end.ReverseFunctionIT
Tests run: 5, Failures: 0, Errors: 0, Skipped: 0, Time elapsed: 10.646 sec - in org.apache.phoenix.end2end.salted.SaltedTableUpsertSelectIT
Running org.apache.phoenix.end2end.DecodeFunctionIT
Tests run: 5, Failures: 0, Errors: 0, Skipped: 0, Time elapsed: 5.08 sec - in org.apache.phoenix.end2end.ReverseFunctionIT
Running org.apache.phoenix.end2end.UpsertSelectAutoCommitIT
Tests run: 6, Failures: 0, Errors: 0, Skipped: 0, Time elapsed: 4.732 sec - in org.apache.phoenix.end2end.DecodeFunctionIT
Running org.apache.phoenix.end2end.LpadFunctionIT
Tests run: 60, Failures: 0, Errors: 0, Skipped: 0, Time elapsed: 70.867 sec - in org.apache.phoenix.end2end.HashJoinIT
Running org.apache.phoenix.end2end.ViewIT
Tests run: 10, Failures: 0, Errors: 0, Skipped: 0, Time elapsed: 8.114 sec - in org.apache.phoenix.end2end.LpadFunctionIT
Running org.apache.phoenix.end2end.QueryPlanIT
Tests run: 2, Failures: 0, Errors: 0, Skipped: 0, Time elapsed: 16.49 sec - in org.apache.phoenix.end2end.UpsertSelectAutoCommitIT
Running org.apache.phoenix.end2end.ConvertTimezoneFunctionIT
Tests run: 14, Failures: 0, Errors: 0, Skipped: 0, Time elapsed: 122.996 sec - in org.apache.phoenix.end2end.index.MutableIndexIT
Running org.apache.phoenix.end2end.ArithmeticQueryIT
Tests run: 6, Failures: 0, Errors: 0, Skipped: 0, Time elapsed: 4.969 sec - in org.apache.phoenix.end2end.ConvertTimezoneFunctionIT
Running org.apache.phoenix.end2end.AutoCommitIT
Tests run: 7, Failures: 0, Errors: 0, Skipped: 0, Time elapsed: 13.205 sec - in org.apache.phoenix.end2end.ViewIT
Running org.apache.phoenix.end2end.ExecuteStatementsIT
Tests run: 1, Failures: 0, Errors: 0, Skipped: 0, Time elapsed: 3.262 sec - in org.apache.phoenix.end2end.AutoCommitIT
Running org.apache.phoenix.end2end.MD5FunctionIT
Tests run: 1, Failures: 0, Errors: 0, Skipped: 0, Time elapsed: 13.552 sec - in org.apache.phoenix.end2end.QueryPlanIT
Running org.apache.phoenix.end2end.SpillableGroupByIT
Tests run: 1, Failures: 0, Errors: 0, Skipped: 0, Time elapsed: 4.227 sec - in org.apache.phoenix.end2end.SpillableGroupByIT
Running org.apache.phoenix.end2end.NthValueFunctionIT
Tests run: 2, Failures: 0, Errors: 0, Skipped: 0, Time elapsed: 8.746 sec - in org.apache.phoenix.end2end.MD5FunctionIT
Tests run: 8, Failures: 0, Errors: 0, Skipped: 0, Time elapsed: 17.23 sec - in org.apache.phoenix.end2end.ArithmeticQueryIT
Tests run: 5, Failures: 0, Errors: 1, Skipped: 0, Time elapsed: 7.161 sec <<< FAILURE!
- in org.apache.phoenix.end2end.NthValueFunctionIT
testSortOrderInDataColWithOffset(org.apache.phoenix.end2end.NthValueFunctionIT)  Time elapsed:
0.053 sec  <<< ERROR!
java.sql.SQLException: ERROR 517 (42895): Invalid not null constraint on non primary key column
columnName=PAGE_ID
	at org.apache.phoenix.exception.SQLExceptionCode$Factory$1.newException(SQLExceptionCode.java:310)
	at org.apache.phoenix.exception.SQLExceptionInfo.buildException(SQLExceptionInfo.java:133)
	at org.apache.phoenix.schema.MetaDataClient.createTableInternal(MetaDataClient.java:948)
	at org.apache.phoenix.schema.MetaDataClient.createTable(MetaDataClient.java:422)
	at org.apache.phoenix.compile.CreateTableCompiler$2.execute(CreateTableCompiler.java:183)
	at org.apache.phoenix.jdbc.PhoenixStatement$2.call(PhoenixStatement.java:246)
	at org.apache.phoenix.jdbc.PhoenixStatement$2.call(PhoenixStatement.java:237)
	at org.apache.phoenix.util.PhoenixContextExecutor.call(PhoenixContextExecutor.java:54)
	at org.apache.phoenix.jdbc.PhoenixStatement.executeMutation(PhoenixStatement.java:236)
	at org.apache.phoenix.jdbc.PhoenixStatement.execute(PhoenixStatement.java:952)
	at org.apache.phoenix.end2end.NthValueFunctionIT.testSortOrderInDataColWithOffset(NthValueFunctionIT.java:131)

Tests run: 2, Failures: 0, Errors: 0, Skipped: 0, Time elapsed: 19.654 sec - in org.apache.phoenix.end2end.ExecuteStatementsIT

Results :

Tests in error: 
  FirstValueFunctionIT.testSortOrderInDataCol:82 ? SQL ERROR 517 (42895): Invali...
  FirstValueFunctionIT.testSortOrderInSortCol:58 ? SQL ERROR 517 (42895): Invali...
  NthValueFunctionIT.testSortOrderInDataColWithOffset:131 ? SQL ERROR 517 (42895...

Tests run: 309, Failures: 0, Errors: 3, Skipped: 0

[INFO] 
[INFO] --- maven-failsafe-plugin:2.17:integration-test (NeedTheirOwnClusterTests) @ phoenix-core
---
[INFO] Failsafe report directory: /x1/jenkins/jenkins-slave/workspace/Phoenix-master-hadoop1/phoenix-core/target/failsafe-reports
[INFO] parallel='none', perCoreThreadCount=true, threadCount=0, useUnlimitedThreads=false,
threadCountSuites=0, threadCountClasses=0, threadCountMethods=0, parallelOptimized=true

-------------------------------------------------------
 T E S T S
-------------------------------------------------------

-------------------------------------------------------
 T E S T S
-------------------------------------------------------
Running org.apache.phoenix.hbase.index.covered.EndToEndCoveredColumnsIndexBuilderIT
Running org.apache.phoenix.end2end.index.MutableIndexFailureIT
Running org.apache.phoenix.end2end.ContextClassloaderIT
Tests run: 2, Failures: 0, Errors: 0, Skipped: 0, Time elapsed: 18.714 sec - in org.apache.phoenix.hbase.index.covered.EndToEndCoveredColumnsIndexBuilderIT
Tests run: 3, Failures: 0, Errors: 0, Skipped: 0, Time elapsed: 5.569 sec - in org.apache.phoenix.end2end.ContextClassloaderIT
Running org.apache.phoenix.mapreduce.CsvBulkLoadToolIT
Tests run: 1, Failures: 0, Errors: 0, Skipped: 0, Time elapsed: 17.008 sec - in org.apache.phoenix.end2end.index.MutableIndexFailureIT
Running org.apache.phoenix.hbase.index.covered.example.EndtoEndIndexingWithCompressionIT
Running org.apache.phoenix.hbase.index.covered.example.EndToEndCoveredIndexingIT
Running org.apache.phoenix.hbase.index.covered.example.FailWithoutRetriesIT
Tests run: 1, Failures: 0, Errors: 0, Skipped: 0, Time elapsed: 9.193 sec - in org.apache.phoenix.hbase.index.covered.example.FailWithoutRetriesIT
Running org.apache.phoenix.hbase.index.FailForUnsupportedHBaseVersionsIT
Tests run: 2, Failures: 0, Errors: 0, Skipped: 0, Time elapsed: 24.407 sec - in org.apache.phoenix.hbase.index.FailForUnsupportedHBaseVersionsIT
Tests run: 11, Failures: 0, Errors: 0, Skipped: 0, Time elapsed: 108.412 sec - in org.apache.phoenix.hbase.index.covered.example.EndToEndCoveredIndexingIT
Tests run: 11, Failures: 0, Errors: 0, Skipped: 0, Time elapsed: 108.749 sec - in org.apache.phoenix.hbase.index.covered.example.EndtoEndIndexingWithCompressionIT
Tests run: 2, Failures: 0, Errors: 0, Skipped: 0, Time elapsed: 169.19 sec - in org.apache.phoenix.mapreduce.CsvBulkLoadToolIT

Results :

Tests run: 33, Failures: 0, Errors: 0, Skipped: 0

[INFO] 
[INFO] --- maven-failsafe-plugin:2.17:verify (ClientManagedTimeTests) @ phoenix-core ---
[INFO] Failsafe report directory: /x1/jenkins/jenkins-slave/workspace/Phoenix-master-hadoop1/phoenix-core/target/failsafe-reports
[INFO] ------------------------------------------------------------------------
[INFO] Reactor Summary:
[INFO] 
[INFO] Apache Phoenix .................................... SUCCESS [7.142s]
[INFO] Phoenix Hadoop Compatibility ...................... SUCCESS [1.394s]
[INFO] Phoenix Core ...................................... FAILURE [14:47.716s]
[INFO] Phoenix - Flume ................................... SKIPPED
[INFO] Phoenix - Pig ..................................... SKIPPED
[INFO] Phoenix Hadoop1 Compatibility ..................... SKIPPED
[INFO] Phoenix Assembly .................................. SKIPPED
[INFO] ------------------------------------------------------------------------
[INFO] BUILD FAILURE
[INFO] ------------------------------------------------------------------------
[INFO] Total time: 14:56.708s
[INFO] Finished at: Wed Jul 02 14:16:09 UTC 2014
[INFO] Final Memory: 31M/358M
[INFO] ------------------------------------------------------------------------
[ERROR] Failed to execute goal org.apache.maven.plugins:maven-failsafe-plugin:2.17:verify
(ClientManagedTimeTests) on project phoenix-core: There are test failures.
[ERROR] 
[ERROR] Please refer to /x1/jenkins/jenkins-slave/workspace/Phoenix-master-hadoop1/phoenix-core/target/failsafe-reports
for the individual test results.
[ERROR] -> [Help 1]
[ERROR] 
[ERROR] To see the full stack trace of the errors, re-run Maven with the -e switch.
[ERROR] Re-run Maven using the -X switch to enable full debug logging.
[ERROR] 
[ERROR] For more information about the errors and possible solutions, please read the following
articles:
[ERROR] [Help 1] http://cwiki.apache.org/confluence/display/MAVEN/MojoFailureException
[ERROR] 
[ERROR] After correcting the problems, you can resume the build with the command
[ERROR]   mvn <goals> -rf :phoenix-core
Build step 'Invoke top-level Maven targets' marked build as failure
Archiving artifacts
Sending artifact delta relative to Phoenix | Master | Hadoop1 #258
Archived 522 artifacts
Archive block size is 32768
Received 762 blocks and 135295388 bytes
Compression is 15.6%
Took 56 sec
Updating PHOENIX-1000
Recording test results

Mime
View raw message