phoenix-commits mailing list archives

Site index · List index
Message view « Date » · « Thread »
Top « Date » · « Thread »
From Apache Jenkins Server <jenk...@builds.apache.org>
Subject Build failed in Jenkins: Phoenix | Master | Hadoop1 #272
Date Tue, 15 Jul 2014 17:40:28 GMT
See <https://builds.apache.org/job/Phoenix-master-hadoop1/272/>

------------------------------------------
[...truncated 6619 lines...]
	at org.apache.phoenix.index.IndexMaintainerTest.testIndexRowKeyBuilding(IndexMaintainerTest.java:140)
	at org.apache.phoenix.index.IndexMaintainerTest.testIndexRowKeyBuilding(IndexMaintainerTest.java:85)
	at org.apache.phoenix.index.IndexMaintainerTest.testIndexRowKeyBuilding(IndexMaintainerTest.java:61)
	at org.apache.phoenix.index.IndexMaintainerTest.testCompositeRowKeyVarFixedDescIndex(IndexMaintainerTest.java:198)

testCompositeRowKeyBytesIndex(org.apache.phoenix.index.IndexMaintainerTest)  Time elapsed:
0.015 sec  <<< FAILURE!
java.lang.AssertionError: null
	at org.apache.phoenix.index.IndexMaintainer.buildDataRowKey(IndexMaintainer.java:511)
	at org.apache.phoenix.index.IndexMaintainerTest.testIndexRowKeyBuilding(IndexMaintainerTest.java:140)
	at org.apache.phoenix.index.IndexMaintainerTest.testIndexRowKeyBuilding(IndexMaintainerTest.java:85)
	at org.apache.phoenix.index.IndexMaintainerTest.testIndexRowKeyBuilding(IndexMaintainerTest.java:61)
	at org.apache.phoenix.index.IndexMaintainerTest.testCompositeRowKeyBytesIndex(IndexMaintainerTest.java:216)

tesIndexWithAscFalseBoolean(org.apache.phoenix.index.IndexMaintainerTest)  Time elapsed: 0.018
sec  <<< FAILURE!
java.lang.AssertionError: null
	at org.apache.phoenix.index.IndexMaintainer.buildDataRowKey(IndexMaintainer.java:511)
	at org.apache.phoenix.index.IndexMaintainerTest.testIndexRowKeyBuilding(IndexMaintainerTest.java:140)
	at org.apache.phoenix.index.IndexMaintainerTest.testIndexRowKeyBuilding(IndexMaintainerTest.java:85)
	at org.apache.phoenix.index.IndexMaintainerTest.testIndexRowKeyBuilding(IndexMaintainerTest.java:61)
	at org.apache.phoenix.index.IndexMaintainerTest.tesIndexWithAscFalseBoolean(IndexMaintainerTest.java:272)

tesIndexWithAscNullBoolean(org.apache.phoenix.index.IndexMaintainerTest)  Time elapsed: 0.018
sec  <<< FAILURE!
java.lang.AssertionError: null
	at org.apache.phoenix.index.IndexMaintainer.buildDataRowKey(IndexMaintainer.java:511)
	at org.apache.phoenix.index.IndexMaintainerTest.testIndexRowKeyBuilding(IndexMaintainerTest.java:140)
	at org.apache.phoenix.index.IndexMaintainerTest.testIndexRowKeyBuilding(IndexMaintainerTest.java:85)
	at org.apache.phoenix.index.IndexMaintainerTest.testIndexRowKeyBuilding(IndexMaintainerTest.java:61)
	at org.apache.phoenix.index.IndexMaintainerTest.tesIndexWithAscNullBoolean(IndexMaintainerTest.java:265)

tesIndexWithBigInt(org.apache.phoenix.index.IndexMaintainerTest)  Time elapsed: 0.018 sec
 <<< FAILURE!
java.lang.AssertionError: null
	at org.apache.phoenix.index.IndexMaintainer.buildDataRowKey(IndexMaintainer.java:511)
	at org.apache.phoenix.index.IndexMaintainerTest.testIndexRowKeyBuilding(IndexMaintainerTest.java:140)
	at org.apache.phoenix.index.IndexMaintainerTest.testIndexRowKeyBuilding(IndexMaintainerTest.java:85)
	at org.apache.phoenix.index.IndexMaintainerTest.testIndexRowKeyBuilding(IndexMaintainerTest.java:61)
	at org.apache.phoenix.index.IndexMaintainerTest.tesIndexWithBigInt(IndexMaintainerTest.java:251)

testCompositeDescRowKeyVarAscIndex(org.apache.phoenix.index.IndexMaintainerTest)  Time elapsed:
0.016 sec  <<< FAILURE!
java.lang.AssertionError: null
	at org.apache.phoenix.index.IndexMaintainer.buildDataRowKey(IndexMaintainer.java:511)
	at org.apache.phoenix.index.IndexMaintainerTest.testIndexRowKeyBuilding(IndexMaintainerTest.java:140)
	at org.apache.phoenix.index.IndexMaintainerTest.testIndexRowKeyBuilding(IndexMaintainerTest.java:85)
	at org.apache.phoenix.index.IndexMaintainerTest.testIndexRowKeyBuilding(IndexMaintainerTest.java:61)
	at org.apache.phoenix.index.IndexMaintainerTest.testCompositeDescRowKeyVarAscIndex(IndexMaintainerTest.java:231)

testMultiKeyValueCoveredIndex(org.apache.phoenix.index.IndexMaintainerTest)  Time elapsed:
0.022 sec  <<< FAILURE!
java.lang.AssertionError: null
	at org.apache.phoenix.index.IndexMaintainer.buildDataRowKey(IndexMaintainer.java:511)
	at org.apache.phoenix.index.IndexMaintainerTest.testIndexRowKeyBuilding(IndexMaintainerTest.java:140)
	at org.apache.phoenix.index.IndexMaintainerTest.testIndexRowKeyBuilding(IndexMaintainerTest.java:85)
	at org.apache.phoenix.index.IndexMaintainerTest.testIndexRowKeyBuilding(IndexMaintainerTest.java:65)
	at org.apache.phoenix.index.IndexMaintainerTest.testMultiKeyValueCoveredIndex(IndexMaintainerTest.java:188)

testCompositeDescRowKeyVarDescIndex(org.apache.phoenix.index.IndexMaintainerTest)  Time elapsed:
0.016 sec  <<< FAILURE!
java.lang.AssertionError: null
	at org.apache.phoenix.index.IndexMaintainer.buildDataRowKey(IndexMaintainer.java:511)
	at org.apache.phoenix.index.IndexMaintainerTest.testIndexRowKeyBuilding(IndexMaintainerTest.java:140)
	at org.apache.phoenix.index.IndexMaintainerTest.testIndexRowKeyBuilding(IndexMaintainerTest.java:85)
	at org.apache.phoenix.index.IndexMaintainerTest.testIndexRowKeyBuilding(IndexMaintainerTest.java:61)
	at org.apache.phoenix.index.IndexMaintainerTest.testCompositeDescRowKeyVarDescIndex(IndexMaintainerTest.java:226)

testCompositeRowKeyTimeIndex(org.apache.phoenix.index.IndexMaintainerTest)  Time elapsed:
0.017 sec  <<< FAILURE!
java.lang.AssertionError: null
	at org.apache.phoenix.index.IndexMaintainer.buildDataRowKey(IndexMaintainer.java:511)
	at org.apache.phoenix.index.IndexMaintainerTest.testIndexRowKeyBuilding(IndexMaintainerTest.java:140)
	at org.apache.phoenix.index.IndexMaintainerTest.testIndexRowKeyBuilding(IndexMaintainerTest.java:85)
	at org.apache.phoenix.index.IndexMaintainerTest.testIndexRowKeyBuilding(IndexMaintainerTest.java:61)
	at org.apache.phoenix.index.IndexMaintainerTest.testCompositeRowKeyTimeIndex(IndexMaintainerTest.java:207)

testMultiKeyValueIndex(org.apache.phoenix.index.IndexMaintainerTest)  Time elapsed: 0.02 sec
 <<< FAILURE!
java.lang.AssertionError: null
	at org.apache.phoenix.index.IndexMaintainer.buildDataRowKey(IndexMaintainer.java:511)
	at org.apache.phoenix.index.IndexMaintainerTest.testIndexRowKeyBuilding(IndexMaintainerTest.java:140)
	at org.apache.phoenix.index.IndexMaintainerTest.testIndexRowKeyBuilding(IndexMaintainerTest.java:85)
	at org.apache.phoenix.index.IndexMaintainerTest.testIndexRowKeyBuilding(IndexMaintainerTest.java:61)
	at org.apache.phoenix.index.IndexMaintainerTest.testMultiKeyValueIndex(IndexMaintainerTest.java:183)

testCompositeRowKeyVarFixedAtEndIndex(org.apache.phoenix.index.IndexMaintainerTest)  Time
elapsed: 0.015 sec  <<< FAILURE!
java.lang.AssertionError: null
	at org.apache.phoenix.index.IndexMaintainer.buildDataRowKey(IndexMaintainer.java:511)
	at org.apache.phoenix.index.IndexMaintainerTest.testIndexRowKeyBuilding(IndexMaintainerTest.java:140)
	at org.apache.phoenix.index.IndexMaintainerTest.testIndexRowKeyBuilding(IndexMaintainerTest.java:85)
	at org.apache.phoenix.index.IndexMaintainerTest.testIndexRowKeyBuilding(IndexMaintainerTest.java:61)
	at org.apache.phoenix.index.IndexMaintainerTest.testCompositeRowKeyVarFixedAtEndIndex(IndexMaintainerTest.java:172)

tesIndexWithDescFalseBoolean(org.apache.phoenix.index.IndexMaintainerTest)  Time elapsed:
0.015 sec  <<< FAILURE!
java.lang.AssertionError: null
	at org.apache.phoenix.index.IndexMaintainer.buildDataRowKey(IndexMaintainer.java:511)
	at org.apache.phoenix.index.IndexMaintainerTest.testIndexRowKeyBuilding(IndexMaintainerTest.java:140)
	at org.apache.phoenix.index.IndexMaintainerTest.testIndexRowKeyBuilding(IndexMaintainerTest.java:85)
	at org.apache.phoenix.index.IndexMaintainerTest.testIndexRowKeyBuilding(IndexMaintainerTest.java:61)
	at org.apache.phoenix.index.IndexMaintainerTest.tesIndexWithDescFalseBoolean(IndexMaintainerTest.java:286)

testCompositeDescRowKeyVarFixedDescSaltedIndexSaltedTable(org.apache.phoenix.index.IndexMaintainerTest)
 Time elapsed: 0.015 sec  <<< FAILURE!
java.lang.AssertionError: null
	at org.apache.phoenix.index.IndexMaintainer.buildDataRowKey(IndexMaintainer.java:511)
	at org.apache.phoenix.index.IndexMaintainerTest.testIndexRowKeyBuilding(IndexMaintainerTest.java:140)
	at org.apache.phoenix.index.IndexMaintainerTest.testIndexRowKeyBuilding(IndexMaintainerTest.java:85)
	at org.apache.phoenix.index.IndexMaintainerTest.testIndexRowKeyBuilding(IndexMaintainerTest.java:69)
	at org.apache.phoenix.index.IndexMaintainerTest.testCompositeDescRowKeyVarFixedDescSaltedIndexSaltedTable(IndexMaintainerTest.java:241)

testCompositeDescRowKeyVarFixedDescSaltedIndex(org.apache.phoenix.index.IndexMaintainerTest)
 Time elapsed: 0.014 sec  <<< FAILURE!
java.lang.AssertionError: null
	at org.apache.phoenix.index.IndexMaintainer.buildDataRowKey(IndexMaintainer.java:511)
	at org.apache.phoenix.index.IndexMaintainerTest.testIndexRowKeyBuilding(IndexMaintainerTest.java:140)
	at org.apache.phoenix.index.IndexMaintainerTest.testIndexRowKeyBuilding(IndexMaintainerTest.java:85)
	at org.apache.phoenix.index.IndexMaintainerTest.testIndexRowKeyBuilding(IndexMaintainerTest.java:69)
	at org.apache.phoenix.index.IndexMaintainerTest.testCompositeDescRowKeyVarFixedDescSaltedIndex(IndexMaintainerTest.java:236)

testMultiKeyValueCoveredSaltedIndex(org.apache.phoenix.index.IndexMaintainerTest)  Time elapsed:
0.017 sec  <<< FAILURE!
java.lang.AssertionError: null
	at org.apache.phoenix.index.IndexMaintainer.buildDataRowKey(IndexMaintainer.java:511)
	at org.apache.phoenix.index.IndexMaintainerTest.testIndexRowKeyBuilding(IndexMaintainerTest.java:140)
	at org.apache.phoenix.index.IndexMaintainerTest.testIndexRowKeyBuilding(IndexMaintainerTest.java:85)
	at org.apache.phoenix.index.IndexMaintainerTest.testIndexRowKeyBuilding(IndexMaintainerTest.java:69)
	at org.apache.phoenix.index.IndexMaintainerTest.testMultiKeyValueCoveredSaltedIndex(IndexMaintainerTest.java:246)

testSingleKeyValueDescIndex(org.apache.phoenix.index.IndexMaintainerTest)  Time elapsed: 0.014
sec  <<< FAILURE!
java.lang.AssertionError: null
	at org.apache.phoenix.index.IndexMaintainer.buildDataRowKey(IndexMaintainer.java:511)
	at org.apache.phoenix.index.IndexMaintainerTest.testIndexRowKeyBuilding(IndexMaintainerTest.java:140)
	at org.apache.phoenix.index.IndexMaintainerTest.testIndexRowKeyBuilding(IndexMaintainerTest.java:85)
	at org.apache.phoenix.index.IndexMaintainerTest.testIndexRowKeyBuilding(IndexMaintainerTest.java:61)
	at org.apache.phoenix.index.IndexMaintainerTest.testSingleKeyValueDescIndex(IndexMaintainerTest.java:193)

testSingleKeyValueIndex(org.apache.phoenix.index.IndexMaintainerTest)  Time elapsed: 0.015
sec  <<< FAILURE!
java.lang.AssertionError: null
	at org.apache.phoenix.index.IndexMaintainer.buildDataRowKey(IndexMaintainer.java:511)
	at org.apache.phoenix.index.IndexMaintainerTest.testIndexRowKeyBuilding(IndexMaintainerTest.java:140)
	at org.apache.phoenix.index.IndexMaintainerTest.testIndexRowKeyBuilding(IndexMaintainerTest.java:85)
	at org.apache.phoenix.index.IndexMaintainerTest.testIndexRowKeyBuilding(IndexMaintainerTest.java:61)
	at org.apache.phoenix.index.IndexMaintainerTest.testSingleKeyValueIndex(IndexMaintainerTest.java:178)

testCompositeDescRowKeyVarFixedDescIndex(org.apache.phoenix.index.IndexMaintainerTest)  Time
elapsed: 0.015 sec  <<< FAILURE!
java.lang.AssertionError: null
	at org.apache.phoenix.index.IndexMaintainer.buildDataRowKey(IndexMaintainer.java:511)
	at org.apache.phoenix.index.IndexMaintainerTest.testIndexRowKeyBuilding(IndexMaintainerTest.java:140)
	at org.apache.phoenix.index.IndexMaintainerTest.testIndexRowKeyBuilding(IndexMaintainerTest.java:85)
	at org.apache.phoenix.index.IndexMaintainerTest.testIndexRowKeyBuilding(IndexMaintainerTest.java:61)
	at org.apache.phoenix.index.IndexMaintainerTest.testCompositeDescRowKeyVarFixedDescIndex(IndexMaintainerTest.java:221)

testCompositeRowKeyVarFixedIndex(org.apache.phoenix.index.IndexMaintainerTest)  Time elapsed:
0.014 sec  <<< FAILURE!
java.lang.AssertionError: null
	at org.apache.phoenix.index.IndexMaintainer.buildDataRowKey(IndexMaintainer.java:511)
	at org.apache.phoenix.index.IndexMaintainerTest.testIndexRowKeyBuilding(IndexMaintainerTest.java:140)
	at org.apache.phoenix.index.IndexMaintainerTest.testIndexRowKeyBuilding(IndexMaintainerTest.java:85)
	at org.apache.phoenix.index.IndexMaintainerTest.testIndexRowKeyBuilding(IndexMaintainerTest.java:61)
	at org.apache.phoenix.index.IndexMaintainerTest.testCompositeRowKeyVarFixedIndex(IndexMaintainerTest.java:165)

testRowKeyVarOnlyIndex(org.apache.phoenix.index.IndexMaintainerTest)  Time elapsed: 0.013
sec  <<< FAILURE!
java.lang.AssertionError: null
	at org.apache.phoenix.index.IndexMaintainer.buildDataRowKey(IndexMaintainer.java:511)
	at org.apache.phoenix.index.IndexMaintainerTest.testIndexRowKeyBuilding(IndexMaintainerTest.java:140)
	at org.apache.phoenix.index.IndexMaintainerTest.testIndexRowKeyBuilding(IndexMaintainerTest.java:85)
	at org.apache.phoenix.index.IndexMaintainerTest.testIndexRowKeyBuilding(IndexMaintainerTest.java:61)
	at org.apache.phoenix.index.IndexMaintainerTest.testRowKeyVarOnlyIndex(IndexMaintainerTest.java:153)

tesIndexWithAscBoolean(org.apache.phoenix.index.IndexMaintainerTest)  Time elapsed: 0.016
sec  <<< FAILURE!
java.lang.AssertionError: null
	at org.apache.phoenix.index.IndexMaintainer.buildDataRowKey(IndexMaintainer.java:511)
	at org.apache.phoenix.index.IndexMaintainerTest.testIndexRowKeyBuilding(IndexMaintainerTest.java:140)
	at org.apache.phoenix.index.IndexMaintainerTest.testIndexRowKeyBuilding(IndexMaintainerTest.java:85)
	at org.apache.phoenix.index.IndexMaintainerTest.testIndexRowKeyBuilding(IndexMaintainerTest.java:61)
	at org.apache.phoenix.index.IndexMaintainerTest.tesIndexWithAscBoolean(IndexMaintainerTest.java:258)

Tests run: 3, Failures: 0, Errors: 0, Skipped: 0, Time elapsed: 0.013 sec - in org.apache.phoenix.hbase.index.util.TestIndexManagementUtil
Running org.apache.phoenix.hbase.index.write.TestIndexWriter
Running org.apache.phoenix.hbase.index.write.TestParalleIndexWriter
Tests run: 5, Failures: 0, Errors: 0, Skipped: 0, Time elapsed: 0.132 sec - in org.apache.phoenix.hbase.index.write.TestIndexWriter
Running org.apache.phoenix.hbase.index.write.TestCachingHTableFactory
Tests run: 1, Failures: 0, Errors: 0, Skipped: 0, Time elapsed: 0.01 sec - in org.apache.phoenix.hbase.index.write.TestCachingHTableFactory
Running org.apache.phoenix.hbase.index.write.TestParalleWriterIndexCommitter
Tests run: 2, Failures: 0, Errors: 0, Skipped: 0, Time elapsed: 0.008 sec - in org.apache.phoenix.hbase.index.write.TestParalleWriterIndexCommitter
Running org.apache.phoenix.hbase.index.write.TestWALRecoveryCaching
Tests run: 1, Failures: 0, Errors: 0, Skipped: 1, Time elapsed: 0.006 sec - in org.apache.phoenix.hbase.index.write.TestWALRecoveryCaching
Running org.apache.phoenix.hbase.index.write.recovery.TestPerRegionIndexWriteCache
Tests run: 2, Failures: 0, Errors: 0, Skipped: 0, Time elapsed: 0.293 sec - in org.apache.phoenix.hbase.index.write.TestParalleIndexWriter
Tests run: 3, Failures: 0, Errors: 0, Skipped: 0, Time elapsed: 0.82 sec - in org.apache.phoenix.hbase.index.write.recovery.TestPerRegionIndexWriteCache
Tests run: 5, Failures: 0, Errors: 0, Skipped: 1, Time elapsed: 6.013 sec - in org.apache.phoenix.memory.MemoryManagerTest
Tests run: 9, Failures: 0, Errors: 0, Skipped: 0, Time elapsed: 109.399 sec - in org.apache.phoenix.hbase.index.balancer.TestIndexLoadBalancer

Results :

Failed tests: 
  IndexMaintainerTest.tesIndexWithDescBoolean:279->testIndexRowKeyBuilding:61->testIndexRowKeyBuilding:85->testIndexRowKeyBuilding:140
null
  IndexMaintainerTest.testVarFixedndex:158->testIndexRowKeyBuilding:61->testIndexRowKeyBuilding:85->testIndexRowKeyBuilding:140
null
  IndexMaintainerTest.testCompositeRowKeyVarFixedDescIndex:198->testIndexRowKeyBuilding:61->testIndexRowKeyBuilding:85->testIndexRowKeyBuilding:140
null
  IndexMaintainerTest.testCompositeRowKeyBytesIndex:216->testIndexRowKeyBuilding:61->testIndexRowKeyBuilding:85->testIndexRowKeyBuilding:140
null
  IndexMaintainerTest.tesIndexWithAscFalseBoolean:272->testIndexRowKeyBuilding:61->testIndexRowKeyBuilding:85->testIndexRowKeyBuilding:140
null
  IndexMaintainerTest.tesIndexWithAscNullBoolean:265->testIndexRowKeyBuilding:61->testIndexRowKeyBuilding:85->testIndexRowKeyBuilding:140
null
  IndexMaintainerTest.tesIndexWithBigInt:251->testIndexRowKeyBuilding:61->testIndexRowKeyBuilding:85->testIndexRowKeyBuilding:140
null
  IndexMaintainerTest.testCompositeDescRowKeyVarAscIndex:231->testIndexRowKeyBuilding:61->testIndexRowKeyBuilding:85->testIndexRowKeyBuilding:140
null
  IndexMaintainerTest.testMultiKeyValueCoveredIndex:188->testIndexRowKeyBuilding:65->testIndexRowKeyBuilding:85->testIndexRowKeyBuilding:140
null
  IndexMaintainerTest.testCompositeDescRowKeyVarDescIndex:226->testIndexRowKeyBuilding:61->testIndexRowKeyBuilding:85->testIndexRowKeyBuilding:140
null
  IndexMaintainerTest.testCompositeRowKeyTimeIndex:207->testIndexRowKeyBuilding:61->testIndexRowKeyBuilding:85->testIndexRowKeyBuilding:140
null
  IndexMaintainerTest.testMultiKeyValueIndex:183->testIndexRowKeyBuilding:61->testIndexRowKeyBuilding:85->testIndexRowKeyBuilding:140
null
  IndexMaintainerTest.testCompositeRowKeyVarFixedAtEndIndex:172->testIndexRowKeyBuilding:61->testIndexRowKeyBuilding:85->testIndexRowKeyBuilding:140
null
  IndexMaintainerTest.tesIndexWithDescFalseBoolean:286->testIndexRowKeyBuilding:61->testIndexRowKeyBuilding:85->testIndexRowKeyBuilding:140
null
  IndexMaintainerTest.testCompositeDescRowKeyVarFixedDescSaltedIndexSaltedTable:241->testIndexRowKeyBuilding:69->testIndexRowKeyBuilding:85->testIndexRowKeyBuilding:140
null
  IndexMaintainerTest.testCompositeDescRowKeyVarFixedDescSaltedIndex:236->testIndexRowKeyBuilding:69->testIndexRowKeyBuilding:85->testIndexRowKeyBuilding:140
null
  IndexMaintainerTest.testMultiKeyValueCoveredSaltedIndex:246->testIndexRowKeyBuilding:69->testIndexRowKeyBuilding:85->testIndexRowKeyBuilding:140
null
  IndexMaintainerTest.testSingleKeyValueDescIndex:193->testIndexRowKeyBuilding:61->testIndexRowKeyBuilding:85->testIndexRowKeyBuilding:140
null
  IndexMaintainerTest.testSingleKeyValueIndex:178->testIndexRowKeyBuilding:61->testIndexRowKeyBuilding:85->testIndexRowKeyBuilding:140
null
  IndexMaintainerTest.testCompositeDescRowKeyVarFixedDescIndex:221->testIndexRowKeyBuilding:61->testIndexRowKeyBuilding:85->testIndexRowKeyBuilding:140
null
  IndexMaintainerTest.testCompositeRowKeyVarFixedIndex:165->testIndexRowKeyBuilding:61->testIndexRowKeyBuilding:85->testIndexRowKeyBuilding:140
null
  IndexMaintainerTest.testRowKeyVarOnlyIndex:153->testIndexRowKeyBuilding:61->testIndexRowKeyBuilding:85->testIndexRowKeyBuilding:140
null
  IndexMaintainerTest.tesIndexWithAscBoolean:258->testIndexRowKeyBuilding:61->testIndexRowKeyBuilding:85->testIndexRowKeyBuilding:140
null

Tests run: 734, Failures: 23, Errors: 0, Skipped: 3

[INFO] ------------------------------------------------------------------------
[INFO] Reactor Summary:
[INFO] 
[INFO] Apache Phoenix .................................... SUCCESS [3.998s]
[INFO] Phoenix Hadoop Compatibility ...................... SUCCESS [0.510s]
[INFO] Phoenix Core ...................................... FAILURE [3:08.391s]
[INFO] Phoenix - Flume ................................... SKIPPED
[INFO] Phoenix - Pig ..................................... SKIPPED
[INFO] Phoenix Hadoop1 Compatibility ..................... SKIPPED
[INFO] Phoenix Assembly .................................. SKIPPED
[INFO] ------------------------------------------------------------------------
[INFO] BUILD FAILURE
[INFO] ------------------------------------------------------------------------
[INFO] Total time: 3:13.321s
[INFO] Finished at: Tue Jul 15 17:39:07 UTC 2014
[INFO] Final Memory: 37M/557M
[INFO] ------------------------------------------------------------------------
[ERROR] Failed to execute goal org.apache.maven.plugins:maven-surefire-plugin:2.16:test (default-test)
on project phoenix-core: There are test failures.
[ERROR] 
[ERROR] Please refer to <https://builds.apache.org/job/Phoenix-master-hadoop1/ws/phoenix-core/target/surefire-reports>
for the individual test results.
[ERROR] -> [Help 1]
[ERROR] 
[ERROR] To see the full stack trace of the errors, re-run Maven with the -e switch.
[ERROR] Re-run Maven using the -X switch to enable full debug logging.
[ERROR] 
[ERROR] For more information about the errors and possible solutions, please read the following
articles:
[ERROR] [Help 1] http://cwiki.apache.org/confluence/display/MAVEN/MojoFailureException
[ERROR] 
[ERROR] After correcting the problems, you can resume the build with the command
[ERROR]   mvn <goals> -rf :phoenix-core
Build step 'Invoke top-level Maven targets' marked build as failure
Archiving artifacts
Sending artifact delta relative to Phoenix | Master | Hadoop1 #269
Archived 190 artifacts
Archive block size is 32768
Received 0 blocks and 19583507 bytes
Compression is 0.0%
Took 20 sec
Recording test results

Mime
View raw message