phoenix-commits mailing list archives

Site index · List index
Message view « Date » · « Thread »
Top « Date » · « Thread »
From Apache Jenkins Server <jenk...@builds.apache.org>
Subject Build failed in Jenkins: Phoenix | 4.0 | Hadoop1 #180
Date Mon, 09 Jun 2014 05:07:22 GMT
See <https://builds.apache.org/job/Phoenix-4.0-hadoop1/180/changes>

Changes:

[jtaylor] PHOENIX-1028 Prevent declaration of non PK columns as NOT NULL (Ravi)

------------------------------------------
[...truncated 833 lines...]
Tests run: 100, Failures: 0, Errors: 0, Skipped: 0, Time elapsed: 77.638 sec - in org.apache.phoenix.end2end.QueryIT
Running org.apache.phoenix.end2end.SkipRangeParallelIteratorRegionSplitterIT
Tests run: 4, Failures: 0, Errors: 0, Skipped: 0, Time elapsed: 7.134 sec - in org.apache.phoenix.end2end.TopNIT
Running org.apache.phoenix.end2end.UpsertValuesIT
Tests run: 8, Failures: 0, Errors: 0, Skipped: 0, Time elapsed: 10.042 sec - in org.apache.phoenix.end2end.SkipRangeParallelIteratorRegionSplitterIT
Running org.apache.phoenix.end2end.TenantSpecificTablesDMLIT
Tests run: 14, Failures: 0, Errors: 0, Skipped: 0, Time elapsed: 25.278 sec - in org.apache.phoenix.end2end.TenantSpecificTablesDMLIT
Tests run: 12, Failures: 0, Errors: 0, Skipped: 0, Time elapsed: 35.72 sec - in org.apache.phoenix.end2end.UpsertValuesIT
Running org.apache.phoenix.end2end.CustomEntityDataIT
Running org.apache.phoenix.end2end.DynamicUpsertIT
Tests run: 7, Failures: 0, Errors: 0, Skipped: 0, Time elapsed: 3.871 sec - in org.apache.phoenix.end2end.DynamicUpsertIT
Running org.apache.phoenix.end2end.ClientTimeArithmeticQueryIT
Tests run: 3, Failures: 0, Errors: 0, Skipped: 0, Time elapsed: 6.188 sec - in org.apache.phoenix.end2end.CustomEntityDataIT
Running org.apache.phoenix.end2end.MultiCfQueryExecIT
Tests run: 7, Failures: 0, Errors: 0, Skipped: 0, Time elapsed: 17.636 sec - in org.apache.phoenix.end2end.MultiCfQueryExecIT
Running org.apache.phoenix.end2end.InMemoryOrderByIT
Tests run: 3, Failures: 0, Errors: 0, Skipped: 1, Time elapsed: 5.852 sec - in org.apache.phoenix.end2end.InMemoryOrderByIT
Running org.apache.phoenix.end2end.ArrayIT
Tests run: 15, Failures: 0, Errors: 0, Skipped: 0, Time elapsed: 72.649 sec - in org.apache.phoenix.end2end.QueryDatabaseMetaDataIT
Running org.apache.phoenix.end2end.DerivedTableIT
Tests run: 16, Failures: 0, Errors: 0, Skipped: 0, Time elapsed: 17.714 sec - in org.apache.phoenix.end2end.DerivedTableIT
Running org.apache.phoenix.end2end.GroupByIT
Tests run: 42, Failures: 0, Errors: 0, Skipped: 0, Time elapsed: 28.856 sec - in org.apache.phoenix.end2end.ArrayIT
Running org.apache.phoenix.end2end.NotQueryIT
Tests run: 216, Failures: 0, Errors: 0, Skipped: 0, Time elapsed: 142.868 sec - in org.apache.phoenix.end2end.ClientTimeArithmeticQueryIT
Running org.apache.phoenix.end2end.KeyOnlyIT
Tests run: 2, Failures: 0, Errors: 0, Skipped: 0, Time elapsed: 4.032 sec - in org.apache.phoenix.end2end.KeyOnlyIT
Running org.apache.phoenix.end2end.DynamicColumnIT
Tests run: 152, Failures: 0, Errors: 0, Skipped: 0, Time elapsed: 104.581 sec - in org.apache.phoenix.end2end.GroupByIT
Running org.apache.phoenix.end2end.RowValueConstructorIT
Tests run: 5, Failures: 0, Errors: 0, Skipped: 0, Time elapsed: 6.667 sec - in org.apache.phoenix.end2end.DynamicColumnIT
Running org.apache.phoenix.end2end.SequenceIT
Tests run: 144, Failures: 0, Errors: 0, Skipped: 0, Time elapsed: 104.758 sec - in org.apache.phoenix.end2end.NotQueryIT
Running org.apache.phoenix.end2end.ColumnProjectionOptimizationIT
Tests run: 2, Failures: 0, Errors: 0, Skipped: 0, Time elapsed: 18.183 sec - in org.apache.phoenix.end2end.ColumnProjectionOptimizationIT
Tests run: 23, Failures: 0, Errors: 0, Skipped: 0, Time elapsed: 28.172 sec - in org.apache.phoenix.end2end.SequenceIT
Tests run: 25, Failures: 0, Errors: 0, Skipped: 0, Time elapsed: 36.592 sec - in org.apache.phoenix.end2end.RowValueConstructorIT

Results :

Tests in error: 
  ToCharFunctionIT.initTable:83->BaseTest.createTestTable:610->BaseTest.createTestTable:636
? SQL
  ToCharFunctionIT.initTable:83->BaseTest.createTestTable:610->BaseTest.createTestTable:636
? SQL
  ToCharFunctionIT.initTable:83->BaseTest.createTestTable:610->BaseTest.createTestTable:636
? SQL
  ToCharFunctionIT.initTable:83->BaseTest.createTestTable:610->BaseTest.createTestTable:636
? SQL
  ToCharFunctionIT.initTable:83->BaseTest.createTestTable:610->BaseTest.createTestTable:636
? SQL
  ToCharFunctionIT.initTable:83->BaseTest.createTestTable:610->BaseTest.createTestTable:636
? SQL
  ToCharFunctionIT.initTable:83->BaseTest.createTestTable:610->BaseTest.createTestTable:636
? SQL
  ToCharFunctionIT.initTable:83->BaseTest.createTestTable:610->BaseTest.createTestTable:636
? SQL
  ToCharFunctionIT.initTable:83->BaseTest.createTestTable:610->BaseTest.createTestTable:636
? SQL
  ToCharFunctionIT.initTable:83->BaseTest.createTestTable:610->BaseTest.createTestTable:636
? SQL
  ToNumberFunctionIT.initTable:93->BaseTest.createTestTable:610->BaseTest.createTestTable:636
? SQL
  ToNumberFunctionIT.initTable:93->BaseTest.createTestTable:610->BaseTest.createTestTable:636
? SQL
  ToNumberFunctionIT.initTable:93->BaseTest.createTestTable:610->BaseTest.createTestTable:636
? SQL
  ToNumberFunctionIT.initTable:93->BaseTest.createTestTable:610->BaseTest.createTestTable:636
? SQL
  ToNumberFunctionIT.initTable:93->BaseTest.createTestTable:610->BaseTest.createTestTable:636
? SQL
  ToNumberFunctionIT.initTable:93->BaseTest.createTestTable:610->BaseTest.createTestTable:636
? SQL
  ToNumberFunctionIT.initTable:93->BaseTest.createTestTable:610->BaseTest.createTestTable:636
? SQL
  ToNumberFunctionIT.initTable:93->BaseTest.createTestTable:610->BaseTest.createTestTable:636
? SQL
  ToNumberFunctionIT.initTable:93->BaseTest.createTestTable:610->BaseTest.createTestTable:636
? SQL
  ToNumberFunctionIT.initTable:93->BaseTest.createTestTable:610->BaseTest.createTestTable:636
? SQL
  ToNumberFunctionIT.initTable:93->BaseTest.createTestTable:610->BaseTest.createTestTable:636
? SQL
  ToNumberFunctionIT.initTable:93->BaseTest.createTestTable:610->BaseTest.createTestTable:636
? SQL
  ToNumberFunctionIT.initTable:93->BaseTest.createTestTable:610->BaseTest.createTestTable:636
? SQL
  ToNumberFunctionIT.initTable:93->BaseTest.createTestTable:610->BaseTest.createTestTable:636
? SQL
  ToNumberFunctionIT.initTable:93->BaseTest.createTestTable:610->BaseTest.createTestTable:636
? SQL
  ToNumberFunctionIT.initTable:93->BaseTest.createTestTable:610->BaseTest.createTestTable:636
? SQL
  ToNumberFunctionIT.initTable:93->BaseTest.createTestTable:610->BaseTest.createTestTable:636
? SQL
  ToNumberFunctionIT.initTable:93->BaseTest.createTestTable:610->BaseTest.createTestTable:636
? SQL

Tests run: 1482, Failures: 0, Errors: 28, Skipped: 3

[INFO] 
[INFO] --- maven-failsafe-plugin:2.17:integration-test (HBaseManagedTimeTests) @ phoenix-core
---
[INFO] Failsafe report directory: <https://builds.apache.org/job/Phoenix-4.0-hadoop1/ws/phoenix-core/target/failsafe-reports>
[INFO] parallel='none', perCoreThreadCount=true, threadCount=0, useUnlimitedThreads=false,
threadCountSuites=0, threadCountClasses=0, threadCountMethods=0, parallelOptimized=true

-------------------------------------------------------
 T E S T S
-------------------------------------------------------

-------------------------------------------------------
 T E S T S
-------------------------------------------------------
Running org.apache.phoenix.end2end.BinaryRowKeyIT
Running org.apache.phoenix.end2end.SpillableGroupByIT
Running org.apache.phoenix.end2end.MD5FunctionIT
Tests run: 1, Failures: 0, Errors: 0, Skipped: 0, Time elapsed: 5.992 sec - in org.apache.phoenix.end2end.SpillableGroupByIT
Running org.apache.phoenix.end2end.AutoCommitIT
Tests run: 3, Failures: 0, Errors: 0, Skipped: 0, Time elapsed: 6.401 sec - in org.apache.phoenix.end2end.BinaryRowKeyIT
Running org.apache.phoenix.end2end.SortOrderFIT
Tests run: 2, Failures: 0, Errors: 0, Skipped: 0, Time elapsed: 8.195 sec - in org.apache.phoenix.end2end.MD5FunctionIT
Running org.apache.phoenix.end2end.AlterTableIT
Tests run: 1, Failures: 0, Errors: 0, Skipped: 0, Time elapsed: 5.057 sec - in org.apache.phoenix.end2end.AutoCommitIT
Running org.apache.phoenix.end2end.TenantSpecificViewIndexIT
Tests run: 29, Failures: 0, Errors: 0, Skipped: 0, Time elapsed: 9.089 sec - in org.apache.phoenix.end2end.SortOrderFIT
Running org.apache.phoenix.end2end.SaltedViewIT
Tests run: 1, Failures: 0, Errors: 0, Skipped: 0, Time elapsed: 12.975 sec - in org.apache.phoenix.end2end.SaltedViewIT
Running org.apache.phoenix.end2end.UpsertBigValuesIT
Tests run: 3, Failures: 0, Errors: 0, Skipped: 0, Time elapsed: 19.507 sec - in org.apache.phoenix.end2end.TenantSpecificViewIndexIT
Running org.apache.phoenix.end2end.HashJoinIT
Tests run: 4, Failures: 0, Errors: 0, Skipped: 0, Time elapsed: 20.499 sec - in org.apache.phoenix.end2end.UpsertBigValuesIT
Running org.apache.phoenix.end2end.salted.SaltedTableUpsertSelectIT
Tests run: 5, Failures: 0, Errors: 0, Skipped: 0, Time elapsed: 13.337 sec - in org.apache.phoenix.end2end.salted.SaltedTableUpsertSelectIT
Running org.apache.phoenix.end2end.TimezoneOffsetFunctionIT
Tests run: 13, Failures: 0, Errors: 0, Skipped: 0, Time elapsed: 54.403 sec - in org.apache.phoenix.end2end.AlterTableIT
Running org.apache.phoenix.end2end.QueryExecWithoutSCNIT
Tests run: 6, Failures: 0, Errors: 0, Skipped: 0, Time elapsed: 4.92 sec - in org.apache.phoenix.end2end.TimezoneOffsetFunctionIT
Running org.apache.phoenix.end2end.ReverseFunctionIT
Tests run: 1, Failures: 0, Errors: 0, Skipped: 0, Time elapsed: 5.558 sec - in org.apache.phoenix.end2end.QueryExecWithoutSCNIT
Running org.apache.phoenix.end2end.UpsertSelectAutoCommitIT
Tests run: 5, Failures: 0, Errors: 0, Skipped: 0, Time elapsed: 4.12 sec - in org.apache.phoenix.end2end.ReverseFunctionIT
Running org.apache.phoenix.end2end.DeleteIT
Tests run: 2, Failures: 0, Errors: 0, Skipped: 0, Time elapsed: 20.034 sec - in org.apache.phoenix.end2end.UpsertSelectAutoCommitIT
Running org.apache.phoenix.end2end.ArithmeticQueryIT
Tests run: 15, Failures: 0, Errors: 0, Skipped: 0, Time elapsed: 25.707 sec - in org.apache.phoenix.end2end.DeleteIT
Running org.apache.phoenix.end2end.CSVCommonsLoaderIT
Tests run: 8, Failures: 0, Errors: 0, Skipped: 0, Time elapsed: 17.093 sec - in org.apache.phoenix.end2end.ArithmeticQueryIT
Running org.apache.phoenix.end2end.ViewIT
Tests run: 60, Failures: 0, Errors: 0, Skipped: 0, Time elapsed: 77.779 sec - in org.apache.phoenix.end2end.HashJoinIT
Running org.apache.phoenix.end2end.SkipScanQueryIT
Tests run: 13, Failures: 0, Errors: 0, Skipped: 0, Time elapsed: 20.152 sec - in org.apache.phoenix.end2end.CSVCommonsLoaderIT
Running org.apache.phoenix.end2end.DecodeFunctionIT
Tests run: 7, Failures: 0, Errors: 0, Skipped: 0, Time elapsed: 14.506 sec - in org.apache.phoenix.end2end.ViewIT
Running org.apache.phoenix.end2end.DynamicFamilyIT
Tests run: 6, Failures: 0, Errors: 0, Skipped: 0, Time elapsed: 6.1 sec - in org.apache.phoenix.end2end.DecodeFunctionIT
Running org.apache.phoenix.end2end.TenantSpecificViewIndexSaltedIT
Tests run: 7, Failures: 0, Errors: 0, Skipped: 0, Time elapsed: 18.247 sec - in org.apache.phoenix.end2end.SkipScanQueryIT
Running org.apache.phoenix.end2end.StatementHintsIT
Tests run: 2, Failures: 0, Errors: 0, Skipped: 0, Time elapsed: 4.686 sec - in org.apache.phoenix.end2end.StatementHintsIT
Running org.apache.phoenix.end2end.ExecuteStatementsIT
Tests run: 4, Failures: 0, Errors: 0, Skipped: 0, Time elapsed: 11.529 sec - in org.apache.phoenix.end2end.DynamicFamilyIT
Running org.apache.phoenix.end2end.QueryPlanIT
Tests run: 2, Failures: 0, Errors: 0, Skipped: 0, Time elapsed: 14.046 sec - in org.apache.phoenix.end2end.TenantSpecificViewIndexSaltedIT
Running org.apache.phoenix.end2end.RoundFloorCeilFunctionsEnd2EndIT
Tests run: 30, Failures: 0, Errors: 0, Skipped: 0, Time elapsed: 7.012 sec - in org.apache.phoenix.end2end.RoundFloorCeilFunctionsEnd2EndIT
Running org.apache.phoenix.end2end.ServerExceptionIT
Tests run: 2, Failures: 0, Errors: 1, Skipped: 0, Time elapsed: 14.217 sec <<< FAILURE!
- in org.apache.phoenix.end2end.ExecuteStatementsIT
testCharPadding(org.apache.phoenix.end2end.ExecuteStatementsIT)  Time elapsed: 0.067 sec 
<<< ERROR!
java.sql.SQLException: ERROR 517 (42895): Invalid not null constraint on non primary key column
columnName=B_STRING
	at org.apache.phoenix.exception.SQLExceptionCode$Factory$1.newException(SQLExceptionCode.java:310)
	at org.apache.phoenix.exception.SQLExceptionInfo.buildException(SQLExceptionInfo.java:133)
	at org.apache.phoenix.schema.MetaDataClient.createTableInternal(MetaDataClient.java:948)
	at org.apache.phoenix.schema.MetaDataClient.createTable(MetaDataClient.java:422)
	at org.apache.phoenix.compile.CreateTableCompiler$2.execute(CreateTableCompiler.java:183)
	at org.apache.phoenix.jdbc.PhoenixStatement$2.call(PhoenixStatement.java:246)
	at org.apache.phoenix.jdbc.PhoenixStatement$2.call(PhoenixStatement.java:237)
	at org.apache.phoenix.util.PhoenixContextExecutor.call(PhoenixContextExecutor.java:54)
	at org.apache.phoenix.jdbc.PhoenixStatement.executeMutation(PhoenixStatement.java:236)
	at org.apache.phoenix.jdbc.PhoenixStatement.execute(PhoenixStatement.java:190)
	at org.apache.phoenix.jdbc.PhoenixPreparedStatement.execute(PhoenixPreparedStatement.java:147)
	at org.apache.phoenix.jdbc.PhoenixPreparedStatement.execute(PhoenixPreparedStatement.java:152)
	at org.apache.phoenix.end2end.ExecuteStatementsIT.testCharPadding(ExecuteStatementsIT.java:134)

Running org.apache.phoenix.end2end.index.MutableIndexIT
Tests run: 1, Failures: 0, Errors: 0, Skipped: 0, Time elapsed: 4.306 sec - in org.apache.phoenix.end2end.ServerExceptionIT
Running org.apache.phoenix.end2end.index.ImmutableIndexIT
Tests run: 1, Failures: 0, Errors: 0, Skipped: 0, Time elapsed: 17.447 sec - in org.apache.phoenix.end2end.QueryPlanIT
Running org.apache.phoenix.end2end.index.IndexMetadataIT
Tests run: 7, Failures: 0, Errors: 0, Skipped: 0, Time elapsed: 25.692 sec - in org.apache.phoenix.end2end.index.ImmutableIndexIT
Running org.apache.phoenix.end2end.index.DropViewIT
Tests run: 4, Failures: 0, Errors: 0, Skipped: 0, Time elapsed: 31.49 sec - in org.apache.phoenix.end2end.index.IndexMetadataIT
Running org.apache.phoenix.end2end.index.SaltedIndexIT
Tests run: 1, Failures: 0, Errors: 0, Skipped: 0, Time elapsed: 6.898 sec - in org.apache.phoenix.end2end.index.DropViewIT
Tests run: 3, Failures: 0, Errors: 0, Skipped: 0, Time elapsed: 32.973 sec - in org.apache.phoenix.end2end.index.SaltedIndexIT
Tests run: 14, Failures: 0, Errors: 0, Skipped: 0, Time elapsed: 127.775 sec - in org.apache.phoenix.end2end.index.MutableIndexIT

Results :

Tests in error: 
  ExecuteStatementsIT.testCharPadding:134 ? SQL ERROR 517 (42895): Invalid not n...

Tests run: 263, Failures: 0, Errors: 1, Skipped: 0

[INFO] 
[INFO] --- maven-failsafe-plugin:2.17:integration-test (NeedTheirOwnClusterTests) @ phoenix-core
---
[INFO] Failsafe report directory: <https://builds.apache.org/job/Phoenix-4.0-hadoop1/ws/phoenix-core/target/failsafe-reports>
[INFO] parallel='none', perCoreThreadCount=true, threadCount=0, useUnlimitedThreads=false,
threadCountSuites=0, threadCountClasses=0, threadCountMethods=0, parallelOptimized=true

-------------------------------------------------------
 T E S T S
-------------------------------------------------------

-------------------------------------------------------
 T E S T S
-------------------------------------------------------
Running org.apache.phoenix.hbase.index.FailForUnsupportedHBaseVersionsIT
Running org.apache.phoenix.hbase.index.covered.example.EndtoEndIndexingWithCompressionIT
Running org.apache.phoenix.hbase.index.covered.example.FailWithoutRetriesIT
Tests run: 2, Failures: 0, Errors: 0, Skipped: 0, Time elapsed: 24.641 sec - in org.apache.phoenix.hbase.index.FailForUnsupportedHBaseVersionsIT
Tests run: 1, Failures: 0, Errors: 0, Skipped: 0, Time elapsed: 7.979 sec - in org.apache.phoenix.hbase.index.covered.example.FailWithoutRetriesIT
Running org.apache.phoenix.hbase.index.covered.example.EndToEndCoveredIndexingIT
Running org.apache.phoenix.hbase.index.covered.EndToEndCoveredColumnsIndexBuilderIT
Tests run: 2, Failures: 0, Errors: 0, Skipped: 0, Time elapsed: 17.342 sec - in org.apache.phoenix.hbase.index.covered.EndToEndCoveredColumnsIndexBuilderIT
Running org.apache.phoenix.end2end.ContextClassloaderIT
Tests run: 3, Failures: 0, Errors: 0, Skipped: 0, Time elapsed: 13.028 sec - in org.apache.phoenix.end2end.ContextClassloaderIT
Tests run: 11, Failures: 0, Errors: 0, Skipped: 0, Time elapsed: 108.934 sec - in org.apache.phoenix.hbase.index.covered.example.EndtoEndIndexingWithCompressionIT
Running org.apache.phoenix.end2end.index.MutableIndexFailureIT
Tests run: 1, Failures: 0, Errors: 0, Skipped: 0, Time elapsed: 15.976 sec - in org.apache.phoenix.end2end.index.MutableIndexFailureIT
Tests run: 11, Failures: 0, Errors: 0, Skipped: 0, Time elapsed: 108.38 sec - in org.apache.phoenix.hbase.index.covered.example.EndToEndCoveredIndexingIT
Running org.apache.phoenix.mapreduce.CsvBulkLoadToolIT
Tests run: 2, Failures: 0, Errors: 0, Skipped: 0, Time elapsed: 111.061 sec - in org.apache.phoenix.mapreduce.CsvBulkLoadToolIT

Results :

Tests run: 33, Failures: 0, Errors: 0, Skipped: 0

[INFO] 
[INFO] --- maven-failsafe-plugin:2.17:verify (ClientManagedTimeTests) @ phoenix-core ---
[INFO] Failsafe report directory: <https://builds.apache.org/job/Phoenix-4.0-hadoop1/ws/phoenix-core/target/failsafe-reports>
[INFO] ------------------------------------------------------------------------
[INFO] Reactor Summary:
[INFO] 
[INFO] Apache Phoenix .................................... SUCCESS [1.973s]
[INFO] Phoenix Hadoop Compatibility ...................... SUCCESS [0.862s]
[INFO] Phoenix Core ...................................... FAILURE [18:38.184s]
[INFO] Phoenix - Flume ................................... SKIPPED
[INFO] Phoenix - Pig ..................................... SKIPPED
[INFO] Phoenix Hadoop1 Compatibility ..................... SKIPPED
[INFO] Phoenix Assembly .................................. SKIPPED
[INFO] ------------------------------------------------------------------------
[INFO] BUILD FAILURE
[INFO] ------------------------------------------------------------------------
[INFO] Total time: 18:41.551s
[INFO] Finished at: Mon Jun 09 05:05:16 UTC 2014
[INFO] Final Memory: 26M/338M
[INFO] ------------------------------------------------------------------------
[ERROR] Failed to execute goal org.apache.maven.plugins:maven-failsafe-plugin:2.17:verify
(ClientManagedTimeTests) on project phoenix-core: There are test failures.
[ERROR] 
[ERROR] Please refer to <https://builds.apache.org/job/Phoenix-4.0-hadoop1/ws/phoenix-core/target/failsafe-reports>
for the individual test results.
[ERROR] -> [Help 1]
[ERROR] 
[ERROR] To see the full stack trace of the errors, re-run Maven with the -e switch.
[ERROR] Re-run Maven using the -X switch to enable full debug logging.
[ERROR] 
[ERROR] For more information about the errors and possible solutions, please read the following
articles:
[ERROR] [Help 1] http://cwiki.apache.org/confluence/display/MAVEN/MojoFailureException
[ERROR] 
[ERROR] After correcting the problems, you can resume the build with the command
[ERROR]   mvn <goals> -rf :phoenix-core
Build step 'Invoke top-level Maven targets' marked build as failure
Archiving artifacts
Sending artifact delta relative to Phoenix | 4.0 | Hadoop1 #179
Archived 499 artifacts
Archive block size is 32768
Received 711 blocks and 138551603 bytes
Compression is 14.4%
Took 1 min 35 sec
Recording test results

Mime
View raw message