phoenix-commits mailing list archives

Site index · List index
Message view « Date » · « Thread »
Top « Date » · « Thread »
From Apache Jenkins Server <jenk...@builds.apache.org>
Subject Build failed in Jenkins: Phoenix | Master | Hadoop2 #6
Date Tue, 27 May 2014 17:58:51 GMT
See <https://builds.apache.org/job/Phoenix-master-hadoop2/6/>

------------------------------------------
[...truncated 3645 lines...]
Running org.apache.phoenix.end2end.DistinctCountIT
Tests run: 9, Failures: 0, Errors: 0, Skipped: 0, Time elapsed: 6.56 sec - in org.apache.phoenix.end2end.DistinctCountIT
Running org.apache.phoenix.end2end.TopNIT
Tests run: 4, Failures: 0, Errors: 0, Skipped: 0, Time elapsed: 4.761 sec - in org.apache.phoenix.end2end.TopNIT
Running org.apache.phoenix.end2end.DynamicUpsertIT
Tests run: 7, Failures: 0, Errors: 0, Skipped: 0, Time elapsed: 2.239 sec - in org.apache.phoenix.end2end.DynamicUpsertIT
Running org.apache.phoenix.end2end.OrderByIT
Tests run: 3, Failures: 0, Errors: 0, Skipped: 1, Time elapsed: 5.145 sec - in org.apache.phoenix.end2end.OrderByIT
Running org.apache.phoenix.end2end.salted.SaltedTableIT
Tests run: 8, Failures: 0, Errors: 0, Skipped: 0, Time elapsed: 5.367 sec - in org.apache.phoenix.end2end.salted.SaltedTableIT
Running org.apache.phoenix.end2end.salted.SaltedTableVarLengthRowKeyIT
Tests run: 1, Failures: 0, Errors: 0, Skipped: 0, Time elapsed: 4.567 sec - in org.apache.phoenix.end2end.salted.SaltedTableVarLengthRowKeyIT
Running org.apache.phoenix.end2end.PercentileIT
Tests run: 17, Failures: 0, Errors: 0, Skipped: 0, Time elapsed: 10.216 sec - in org.apache.phoenix.end2end.PercentileIT
Running org.apache.phoenix.end2end.CompareDecimalToLongIT
Tests run: 8, Failures: 0, Errors: 0, Skipped: 0, Time elapsed: 3.012 sec - in org.apache.phoenix.end2end.CompareDecimalToLongIT
Running org.apache.phoenix.end2end.CustomEntityDataIT
Tests run: 3, Failures: 0, Errors: 0, Skipped: 0, Time elapsed: 4.995 sec - in org.apache.phoenix.end2end.CustomEntityDataIT
Running org.apache.phoenix.end2end.DynamicColumnIT
Tests run: 5, Failures: 0, Errors: 0, Skipped: 0, Time elapsed: 2.37 sec - in org.apache.phoenix.end2end.DynamicColumnIT
Running org.apache.phoenix.end2end.VariableLengthPKIT
Tests run: 49, Failures: 0, Errors: 0, Skipped: 0, Time elapsed: 22.52 sec - in org.apache.phoenix.end2end.VariableLengthPKIT
Running org.apache.phoenix.end2end.QueryDatabaseMetaDataIT
Tests run: 15, Failures: 0, Errors: 0, Skipped: 0, Time elapsed: 41.146 sec - in org.apache.phoenix.end2end.QueryDatabaseMetaDataIT
Running org.apache.phoenix.end2end.InMemoryOrderByIT
Tests run: 3, Failures: 0, Errors: 0, Skipped: 1, Time elapsed: 3.672 sec - in org.apache.phoenix.end2end.InMemoryOrderByIT
Running org.apache.phoenix.end2end.QueryIT
Tests run: 100, Failures: 0, Errors: 0, Skipped: 0, Time elapsed: 58.354 sec - in org.apache.phoenix.end2end.QueryIT
Running org.apache.phoenix.end2end.SequenceIT
Tests run: 21, Failures: 0, Errors: 0, Skipped: 0, Time elapsed: 16.638 sec - in org.apache.phoenix.end2end.SequenceIT
Running org.apache.phoenix.end2end.GroupByIT
Tests run: 152, Failures: 0, Errors: 0, Skipped: 0, Time elapsed: 97.934 sec - in org.apache.phoenix.end2end.GroupByIT
Running org.apache.phoenix.end2end.IsNullIT
Tests run: 2, Failures: 0, Errors: 0, Skipped: 0, Time elapsed: 5.176 sec - in org.apache.phoenix.end2end.IsNullIT
Running org.apache.phoenix.end2end.StatsManagerIT
Tests run: 1, Failures: 0, Errors: 0, Skipped: 0, Time elapsed: 17.857 sec - in org.apache.phoenix.end2end.StatsManagerIT
Running org.apache.phoenix.end2end.TenantSpecificTablesDDLIT
Tests run: 16, Failures: 0, Errors: 0, Skipped: 0, Time elapsed: 36.398 sec - in org.apache.phoenix.end2end.TenantSpecificTablesDDLIT
Running org.apache.phoenix.end2end.TruncateFunctionIT
Tests run: 1, Failures: 0, Errors: 0, Skipped: 0, Time elapsed: 2.757 sec - in org.apache.phoenix.end2end.TruncateFunctionIT
Running org.apache.phoenix.end2end.UpsertSelectIT
Tests run: 11, Failures: 0, Errors: 0, Skipped: 0, Time elapsed: 28.013 sec - in org.apache.phoenix.end2end.UpsertSelectIT
Running org.apache.phoenix.end2end.ToCharFunctionIT
Tests run: 10, Failures: 0, Errors: 0, Skipped: 0, Time elapsed: 3.893 sec - in org.apache.phoenix.end2end.ToCharFunctionIT
Running org.apache.phoenix.end2end.GroupByCaseIT
Tests run: 3, Failures: 0, Errors: 0, Skipped: 0, Time elapsed: 3.07 sec - in org.apache.phoenix.end2end.GroupByCaseIT
Running org.apache.phoenix.end2end.SpooledOrderByIT
Tests run: 3, Failures: 0, Errors: 0, Skipped: 1, Time elapsed: 4.449 sec - in org.apache.phoenix.end2end.SpooledOrderByIT
Running org.apache.phoenix.end2end.ProductMetricsIT
Tests run: 61, Failures: 0, Errors: 0, Skipped: 0, Time elapsed: 28.119 sec - in org.apache.phoenix.end2end.ProductMetricsIT
Running org.apache.phoenix.end2end.CastAndCoerceIT
Tests run: 124, Failures: 0, Errors: 0, Skipped: 0, Time elapsed: 90.018 sec - in org.apache.phoenix.end2end.CastAndCoerceIT
Running org.apache.phoenix.end2end.DerivedTableIT
Tests run: 16, Failures: 0, Errors: 0, Skipped: 0, Time elapsed: 16.784 sec - in org.apache.phoenix.end2end.DerivedTableIT
Running org.apache.phoenix.end2end.FunkyNamesIT
Tests run: 3, Failures: 0, Errors: 0, Skipped: 0, Time elapsed: 3.066 sec - in org.apache.phoenix.end2end.FunkyNamesIT
Running org.apache.phoenix.end2end.ClientTimeArithmeticQueryIT
Tests run: 216, Failures: 0, Errors: 0, Skipped: 0, Time elapsed: 154.934 sec - in org.apache.phoenix.end2end.ClientTimeArithmeticQueryIT
Running org.apache.phoenix.end2end.ToNumberFunctionIT
Tests run: 18, Failures: 0, Errors: 0, Skipped: 0, Time elapsed: 7.447 sec - in org.apache.phoenix.end2end.ToNumberFunctionIT
Running org.apache.phoenix.end2end.CreateTableIT
Tests run: 9, Failures: 0, Errors: 0, Skipped: 0, Time elapsed: 34.041 sec - in org.apache.phoenix.end2end.CreateTableIT
Running org.apache.phoenix.end2end.RowValueConstructorIT
Tests run: 25, Failures: 0, Errors: 0, Skipped: 0, Time elapsed: 26.481 sec - in org.apache.phoenix.end2end.RowValueConstructorIT
Running org.apache.phoenix.end2end.MultiCfQueryExecIT
Tests run: 7, Failures: 0, Errors: 0, Skipped: 0, Time elapsed: 7.769 sec - in org.apache.phoenix.end2end.MultiCfQueryExecIT
Running org.apache.phoenix.end2end.DefaultParallelIteratorsRegionSplitterIT
Tests run: 2, Failures: 0, Errors: 0, Skipped: 0, Time elapsed: 4.256 sec - in org.apache.phoenix.end2end.DefaultParallelIteratorsRegionSplitterIT
Running org.apache.phoenix.end2end.CaseStatementIT
Tests run: 136, Failures: 0, Errors: 0, Skipped: 0, Time elapsed: 122.405 sec - in org.apache.phoenix.end2end.CaseStatementIT
Running org.apache.phoenix.end2end.ScanQueryIT
Tests run: 168, Failures: 0, Errors: 0, Skipped: 0, Time elapsed: 159.298 sec - in org.apache.phoenix.end2end.ScanQueryIT
Running org.apache.phoenix.end2end.StddevIT
Tests run: 4, Failures: 0, Errors: 0, Skipped: 0, Time elapsed: 7.149 sec - in org.apache.phoenix.end2end.StddevIT
Running org.apache.phoenix.end2end.CoalesceFunctionIT
Tests run: 1, Failures: 0, Errors: 0, Skipped: 0, Time elapsed: 3.961 sec - in org.apache.phoenix.end2end.CoalesceFunctionIT
Running org.apache.phoenix.end2end.ColumnProjectionOptimizationIT
Tests run: 2, Failures: 0, Errors: 0, Skipped: 0, Time elapsed: 8.623 sec - in org.apache.phoenix.end2end.ColumnProjectionOptimizationIT
Running org.apache.phoenix.end2end.SkipRangeParallelIteratorRegionSplitterIT
Tests run: 8, Failures: 0, Errors: 0, Skipped: 0, Time elapsed: 7.826 sec - in org.apache.phoenix.end2end.SkipRangeParallelIteratorRegionSplitterIT
Running org.apache.phoenix.end2end.ReadIsolationLevelIT
Tests run: 2, Failures: 0, Errors: 0, Skipped: 0, Time elapsed: 3.55 sec - in org.apache.phoenix.end2end.ReadIsolationLevelIT
Running org.apache.phoenix.end2end.NotQueryIT
Tests run: 144, Failures: 0, Errors: 0, Skipped: 0, Time elapsed: 150.453 sec - in org.apache.phoenix.end2end.NotQueryIT
Running org.apache.phoenix.end2end.UpsertValuesIT
Tests run: 12, Failures: 0, Errors: 0, Skipped: 0, Time elapsed: 31.763 sec - in org.apache.phoenix.end2end.UpsertValuesIT
Running org.apache.phoenix.end2end.KeyOnlyIT
Tests run: 2, Failures: 0, Errors: 0, Skipped: 0, Time elapsed: 4.208 sec - in org.apache.phoenix.end2end.KeyOnlyIT
Running org.apache.phoenix.end2end.ArrayIT
Tests run: 41, Failures: 0, Errors: 0, Skipped: 0, Time elapsed: 36.742 sec - in org.apache.phoenix.end2end.ArrayIT

Results :

Tests run: 1478, Failures: 0, Errors: 0, Skipped: 3

[INFO] 
[INFO] --- maven-failsafe-plugin:2.17:integration-test (HBaseManagedTimeTests) @ phoenix-core
---
[INFO] Failsafe report directory: <https://builds.apache.org/job/Phoenix-master-hadoop2/ws/phoenix-core/target/failsafe-reports>
[INFO] parallel='none', perCoreThreadCount=true, threadCount=0, useUnlimitedThreads=false,
threadCountSuites=0, threadCountClasses=0, threadCountMethods=0, parallelOptimized=true

-------------------------------------------------------
 T E S T S
-------------------------------------------------------
Running org.apache.phoenix.end2end.index.SaltedIndexIT
Tests run: 3, Failures: 0, Errors: 0, Skipped: 0, Time elapsed: 21.452 sec - in org.apache.phoenix.end2end.index.SaltedIndexIT
Running org.apache.phoenix.end2end.index.IndexMetadataIT
Tests run: 4, Failures: 0, Errors: 0, Skipped: 0, Time elapsed: 23.99 sec - in org.apache.phoenix.end2end.index.IndexMetadataIT
Running org.apache.phoenix.end2end.index.DropViewIT
Tests run: 1, Failures: 0, Errors: 0, Skipped: 0, Time elapsed: 4.097 sec - in org.apache.phoenix.end2end.index.DropViewIT
Running org.apache.phoenix.end2end.index.ImmutableIndexIT
Tests run: 7, Failures: 0, Errors: 0, Skipped: 0, Time elapsed: 12.763 sec - in org.apache.phoenix.end2end.index.ImmutableIndexIT
Running org.apache.phoenix.end2end.index.MutableIndexIT
Tests run: 13, Failures: 0, Errors: 0, Skipped: 0, Time elapsed: 44.979 sec - in org.apache.phoenix.end2end.index.MutableIndexIT
Running org.apache.phoenix.end2end.AutoCommitIT
Tests run: 1, Failures: 0, Errors: 0, Skipped: 0, Time elapsed: 3.693 sec - in org.apache.phoenix.end2end.AutoCommitIT
Running org.apache.phoenix.end2end.StatementHintsIT
Tests run: 2, Failures: 0, Errors: 0, Skipped: 0, Time elapsed: 3.525 sec - in org.apache.phoenix.end2end.StatementHintsIT
Running org.apache.phoenix.end2end.RoundFloorCeilFunctionsEnd2EndIT
Tests run: 30, Failures: 0, Errors: 0, Skipped: 0, Time elapsed: 5.709 sec - in org.apache.phoenix.end2end.RoundFloorCeilFunctionsEnd2EndIT
Running org.apache.phoenix.end2end.SkipScanQueryIT
Tests run: 7, Failures: 0, Errors: 0, Skipped: 0, Time elapsed: 11.04 sec - in org.apache.phoenix.end2end.SkipScanQueryIT
Running org.apache.phoenix.end2end.HashJoinIT
Tests run: 60, Failures: 0, Errors: 0, Skipped: 0, Time elapsed: 52.508 sec - in org.apache.phoenix.end2end.HashJoinIT
Running org.apache.phoenix.end2end.ArithmeticQueryIT
Tests run: 8, Failures: 0, Errors: 0, Skipped: 0, Time elapsed: 10.995 sec - in org.apache.phoenix.end2end.ArithmeticQueryIT
Running org.apache.phoenix.end2end.salted.SaltedTableUpsertSelectIT
Tests run: 5, Failures: 0, Errors: 0, Skipped: 0, Time elapsed: 9.32 sec - in org.apache.phoenix.end2end.salted.SaltedTableUpsertSelectIT
Running org.apache.phoenix.end2end.QueryExecWithoutSCNIT
Tests run: 1, Failures: 0, Errors: 0, Skipped: 0, Time elapsed: 3.357 sec - in org.apache.phoenix.end2end.QueryExecWithoutSCNIT
Running org.apache.phoenix.end2end.MD5FunctionIT
Tests run: 2, Failures: 0, Errors: 0, Skipped: 0, Time elapsed: 4.624 sec - in org.apache.phoenix.end2end.MD5FunctionIT
Running org.apache.phoenix.end2end.DeleteIT
Tests run: 15, Failures: 0, Errors: 0, Skipped: 0, Time elapsed: 17.589 sec - in org.apache.phoenix.end2end.DeleteIT
Running org.apache.phoenix.end2end.UpsertSelectAutoCommitIT
Tests run: 2, Failures: 0, Errors: 0, Skipped: 0, Time elapsed: 13.17 sec - in org.apache.phoenix.end2end.UpsertSelectAutoCommitIT
Running org.apache.phoenix.end2end.DynamicFamilyIT
Tests run: 4, Failures: 0, Errors: 0, Skipped: 0, Time elapsed: 4.998 sec - in org.apache.phoenix.end2end.DynamicFamilyIT
Running org.apache.phoenix.end2end.UpsertBigValuesIT
Tests run: 4, Failures: 0, Errors: 0, Skipped: 0, Time elapsed: 11.475 sec - in org.apache.phoenix.end2end.UpsertBigValuesIT
Running org.apache.phoenix.end2end.TenantSpecificViewIndexSaltedIT
Tests run: 2, Failures: 0, Errors: 0, Skipped: 0, Time elapsed: 8.668 sec - in org.apache.phoenix.end2end.TenantSpecificViewIndexSaltedIT
Running org.apache.phoenix.end2end.SaltedViewIT
Tests run: 1, Failures: 0, Errors: 0, Skipped: 0, Time elapsed: 8.224 sec - in org.apache.phoenix.end2end.SaltedViewIT
Running org.apache.phoenix.end2end.QueryPlanIT
Tests run: 1, Failures: 0, Errors: 0, Skipped: 0, Time elapsed: 10.96 sec - in org.apache.phoenix.end2end.QueryPlanIT
Running org.apache.phoenix.end2end.TimezoneOffsetFunctionIT
Tests run: 6, Failures: 0, Errors: 0, Skipped: 0, Time elapsed: 3.427 sec - in org.apache.phoenix.end2end.TimezoneOffsetFunctionIT
Running org.apache.phoenix.end2end.CSVCommonsLoaderIT
Tests run: 13, Failures: 0, Errors: 0, Skipped: 0, Time elapsed: 12.436 sec - in org.apache.phoenix.end2end.CSVCommonsLoaderIT
Running org.apache.phoenix.end2end.TenantSpecificViewIndexIT
Tests run: 3, Failures: 0, Errors: 0, Skipped: 0, Time elapsed: 13.423 sec - in org.apache.phoenix.end2end.TenantSpecificViewIndexIT
Running org.apache.phoenix.end2end.SpillableGroupByIT
Tests run: 1, Failures: 0, Errors: 0, Skipped: 0, Time elapsed: 3.932 sec - in org.apache.phoenix.end2end.SpillableGroupByIT
Running org.apache.phoenix.end2end.ViewIT
Tests run: 7, Failures: 0, Errors: 0, Skipped: 0, Time elapsed: 9.996 sec - in org.apache.phoenix.end2end.ViewIT
Running org.apache.phoenix.end2end.DecodeFunctionIT
Tests run: 6, Failures: 0, Errors: 0, Skipped: 0, Time elapsed: 3.04 sec - in org.apache.phoenix.end2end.DecodeFunctionIT
Running org.apache.phoenix.end2end.BinaryRowKeyIT
Tests run: 3, Failures: 0, Errors: 0, Skipped: 0, Time elapsed: 2.713 sec - in org.apache.phoenix.end2end.BinaryRowKeyIT
Running org.apache.phoenix.end2end.SortOrderFIT
Tests run: 29, Failures: 0, Errors: 0, Skipped: 0, Time elapsed: 5.937 sec - in org.apache.phoenix.end2end.SortOrderFIT
Running org.apache.phoenix.end2end.ServerExceptionIT
Tests run: 1, Failures: 0, Errors: 0, Skipped: 0, Time elapsed: 2.271 sec - in org.apache.phoenix.end2end.ServerExceptionIT
Running org.apache.phoenix.end2end.AlterTableIT
Tests run: 13, Failures: 0, Errors: 0, Skipped: 0, Time elapsed: 40.415 sec - in org.apache.phoenix.end2end.AlterTableIT
Running org.apache.phoenix.end2end.ReverseFunctionIT
Tests run: 5, Failures: 0, Errors: 0, Skipped: 0, Time elapsed: 4.032 sec - in org.apache.phoenix.end2end.ReverseFunctionIT
Running org.apache.phoenix.end2end.ExecuteStatementsIT
Tests run: 2, Failures: 0, Errors: 0, Skipped: 0, Time elapsed: 13.749 sec - in org.apache.phoenix.end2end.ExecuteStatementsIT

Results :

Tests run: 262, Failures: 0, Errors: 0, Skipped: 0

[INFO] 
[INFO] --- maven-failsafe-plugin:2.17:integration-test (NeedTheirOwnClusterTests) @ phoenix-core
---
[INFO] Failsafe report directory: <https://builds.apache.org/job/Phoenix-master-hadoop2/ws/phoenix-core/target/failsafe-reports>
[INFO] parallel='none', perCoreThreadCount=true, threadCount=0, useUnlimitedThreads=false,
threadCountSuites=0, threadCountClasses=0, threadCountMethods=0, parallelOptimized=true

-------------------------------------------------------
 T E S T S
-------------------------------------------------------
Running org.apache.phoenix.mapreduce.CsvBulkLoadToolIT
Tests run: 2, Failures: 0, Errors: 0, Skipped: 0, Time elapsed: 111.143 sec - in org.apache.phoenix.mapreduce.CsvBulkLoadToolIT
Running org.apache.phoenix.end2end.index.MutableIndexFailureIT
Tests run: 2, Failures: 0, Errors: 1, Skipped: 0, Time elapsed: 39.342 sec <<< FAILURE!
- in org.apache.phoenix.end2end.ContextClassloaderIT
org.apache.phoenix.end2end.ContextClassloaderIT  Time elapsed: 26.617 sec  <<< ERROR!
java.lang.IllegalStateException: The Phoenix jdbc driver has been closed.
	at org.apache.phoenix.jdbc.PhoenixDriver.checkClosed(PhoenixDriver.java:160)
	at org.apache.phoenix.jdbc.PhoenixDriver.getConnectionQueryServices(PhoenixDriver.java:111)
	at org.apache.phoenix.jdbc.PhoenixEmbeddedDriver.connect(PhoenixEmbeddedDriver.java:112)
	at java.sql.DriverManager.getConnection(DriverManager.java:571)
	at java.sql.DriverManager.getConnection(DriverManager.java:233)
	at org.apache.phoenix.end2end.ContextClassloaderIT.setUpBeforeClass(ContextClassloaderIT.java:53)

Running org.apache.phoenix.hbase.index.covered.example.EndToEndCoveredIndexingIT
Tests run: 11, Failures: 0, Errors: 0, Skipped: 0, Time elapsed: 82.724 sec - in org.apache.phoenix.hbase.index.covered.example.EndToEndCoveredIndexingIT
Running org.apache.phoenix.hbase.index.covered.example.EndtoEndIndexingWithCompressionIT
Tests run: 11, Failures: 0, Errors: 0, Skipped: 0, Time elapsed: 77.827 sec - in org.apache.phoenix.hbase.index.covered.example.EndtoEndIndexingWithCompressionIT
Running org.apache.phoenix.hbase.index.covered.example.FailWithoutRetriesIT
Tests run: 1, Failures: 0, Errors: 0, Skipped: 0, Time elapsed: 17.108 sec - in org.apache.phoenix.hbase.index.covered.example.FailWithoutRetriesIT
Running org.apache.phoenix.hbase.index.covered.EndToEndCoveredColumnsIndexBuilderIT
Tests run: 2, Failures: 0, Errors: 0, Skipped: 0, Time elapsed: 8.48 sec - in org.apache.phoenix.hbase.index.covered.EndToEndCoveredColumnsIndexBuilderIT
Running org.apache.phoenix.hbase.index.FailForUnsupportedHBaseVersionsIT
Tests run: 2, Failures: 0, Errors: 0, Skipped: 0, Time elapsed: 17.638 sec - in org.apache.phoenix.hbase.index.FailForUnsupportedHBaseVersionsIT

Results :

Tests in error: 
  ContextClassloaderIT.setUpBeforeClass:53 ? IllegalState The Phoenix jdbc drive...

Tests run: 31, Failures: 0, Errors: 1, Skipped: 0

[INFO] 
[INFO] --- maven-failsafe-plugin:2.17:verify (ClientManagedTimeTests) @ phoenix-core ---
[INFO] Failsafe report directory: <https://builds.apache.org/job/Phoenix-master-hadoop2/ws/phoenix-core/target/failsafe-reports>
[INFO] ------------------------------------------------------------------------
[INFO] Reactor Summary:
[INFO] 
[INFO] Apache Phoenix .................................... SUCCESS [3.463s]
[INFO] Phoenix Hadoop Compatibility ...................... SUCCESS [1.048s]
[INFO] Phoenix Core ...................................... FAILURE [37:06.623s]
[INFO] Phoenix - Flume ................................... SKIPPED
[INFO] Phoenix - Pig ..................................... SKIPPED
[INFO] Phoenix Hadoop2 Compatibility ..................... SKIPPED
[INFO] Phoenix Assembly .................................. SKIPPED
[INFO] ------------------------------------------------------------------------
[INFO] BUILD FAILURE
[INFO] ------------------------------------------------------------------------
[INFO] Total time: 37:11.547s
[INFO] Finished at: Tue May 27 17:55:23 UTC 2014
[INFO] Final Memory: 49M/830M
[INFO] ------------------------------------------------------------------------
[ERROR] Failed to execute goal org.apache.maven.plugins:maven-failsafe-plugin:2.17:verify
(ClientManagedTimeTests) on project phoenix-core: There are test failures.
[ERROR] 
[ERROR] Please refer to <https://builds.apache.org/job/Phoenix-master-hadoop2/ws/phoenix-core/target/failsafe-reports>
for the individual test results.
[ERROR] -> [Help 1]
[ERROR] 
[ERROR] To see the full stack trace of the errors, re-run Maven with the -e switch.
[ERROR] Re-run Maven using the -X switch to enable full debug logging.
[ERROR] 
[ERROR] For more information about the errors and possible solutions, please read the following
articles:
[ERROR] [Help 1] http://cwiki.apache.org/confluence/display/MAVEN/MojoFailureException
[ERROR] 
[ERROR] After correcting the problems, you can resume the build with the command
[ERROR]   mvn <goals> -rf :phoenix-core
Build step 'Invoke top-level Maven targets' marked build as failure
Archiving artifacts
Recording test results

Mime
View raw message