phoenix-commits mailing list archives

Site index · List index
Message view « Date » · « Thread »
Top « Date » · « Thread »
From Apache Jenkins Server <jenk...@builds.apache.org>
Subject Build failed in Jenkins: Apache Phoenix | Master | Hadoop2 #2
Date Fri, 23 May 2014 17:05:29 GMT
See <https://builds.apache.org/job/Phoenix-hadoop2/2/changes>

Changes:

[jzhong] PHOENIX-991: IT tests failed on hadoop2

[gabrielr] PHOENIX-979 Delete on key and non-key field

[gabrielr] PHOENIX-993 Exclude JRuby dependency

[jzhong] PHOENIX-992: Replace hTable.getRowOrBefore with ReverseScan to get maxKey in StatsManagerImpl

[jtaylor] PHOENIX-982 Avoid spinning up and tearing down mini cluster in tests (SamarthJain)

[jtaylor] PHOENIX-984 Add support for DECODE built-in function (tzolkincz)

------------------------------------------
[...truncated 3957 lines...]
Results :

Tests run: 13, Failures: 0, Errors: 0, Skipped: 0

[INFO] 
[INFO] --- maven-failsafe-plugin:2.17:integration-test (NeedTheirOwnClusterTests) @ phoenix-flume
---
[INFO] Failsafe report directory: <https://builds.apache.org/job/Phoenix-hadoop2/ws/phoenix-flume/target/failsafe-reports>
[INFO] parallel='none', perCoreThreadCount=true, threadCount=0, useUnlimitedThreads=false,
threadCountSuites=0, threadCountClasses=0, threadCountMethods=0, parallelOptimized=true

-------------------------------------------------------
 T E S T S
-------------------------------------------------------

-------------------------------------------------------
 T E S T S
-------------------------------------------------------

Results :

Tests run: 0, Failures: 0, Errors: 0, Skipped: 0

[INFO] 
[INFO] --- maven-failsafe-plugin:2.17:verify (ClientManagedTimeTests) @ phoenix-flume ---
[INFO] Failsafe report directory: <https://builds.apache.org/job/Phoenix-hadoop2/ws/phoenix-flume/target/failsafe-reports>
[INFO] 
[INFO] --- maven-failsafe-plugin:2.17:verify (HBaseManagedTimeTests) @ phoenix-flume ---
[INFO] Failsafe report directory: <https://builds.apache.org/job/Phoenix-hadoop2/ws/phoenix-flume/target/failsafe-reports>
[INFO] 
[INFO] --- maven-failsafe-plugin:2.17:verify (NeedTheirOwnClusterTests) @ phoenix-flume ---
[INFO] Failsafe report directory: <https://builds.apache.org/job/Phoenix-hadoop2/ws/phoenix-flume/target/failsafe-reports>
[INFO] 
[INFO] --- maven-install-plugin:2.5.1:install (default-install) @ phoenix-flume ---
[INFO] Installing <https://builds.apache.org/job/Phoenix-hadoop2/2/artifact/phoenix-flume/target/phoenix-flume-4.1.0-incubating-SNAPSHOT.jar>
to /home/jenkins/.m2/repository/org/apache/phoenix/phoenix-flume/4.1.0-incubating-SNAPSHOT/phoenix-flume-4.1.0-incubating-SNAPSHOT.jar
[INFO] Installing <https://builds.apache.org/job/Phoenix-hadoop2/ws/phoenix-flume/pom.xml>
to /home/jenkins/.m2/repository/org/apache/phoenix/phoenix-flume/4.1.0-incubating-SNAPSHOT/phoenix-flume-4.1.0-incubating-SNAPSHOT.pom
[INFO] Installing <https://builds.apache.org/job/Phoenix-hadoop2/2/artifact/phoenix-flume/target/phoenix-flume-4.1.0-incubating-SNAPSHOT-sources.jar>
to /home/jenkins/.m2/repository/org/apache/phoenix/phoenix-flume/4.1.0-incubating-SNAPSHOT/phoenix-flume-4.1.0-incubating-SNAPSHOT-sources.jar
[INFO] Installing <https://builds.apache.org/job/Phoenix-hadoop2/2/artifact/phoenix-flume/target/phoenix-flume-4.1.0-incubating-SNAPSHOT-tests.jar>
to /home/jenkins/.m2/repository/org/apache/phoenix/phoenix-flume/4.1.0-incubating-SNAPSHOT/phoenix-flume-4.1.0-incubating-SNAPSHOT-tests.jar
[INFO]                                                                         
[INFO] ------------------------------------------------------------------------
[INFO] Building Phoenix - Pig 4.1.0-incubating-SNAPSHOT
[INFO] ------------------------------------------------------------------------
[INFO] 
[INFO] --- maven-clean-plugin:2.5:clean (default-clean) @ phoenix-pig ---
[INFO] 
[INFO] --- build-helper-maven-plugin:1.7:add-test-source (add-test-source) @ phoenix-pig ---
[INFO] Test Source directory: <https://builds.apache.org/job/Phoenix-hadoop2/ws/phoenix-pig/src/it/java>
added.
[INFO] 
[INFO] --- build-helper-maven-plugin:1.7:add-test-resource (add-test-resource) @ phoenix-pig
---
[INFO] 
[INFO] --- maven-remote-resources-plugin:1.5:process (default) @ phoenix-pig ---
[INFO] 
[INFO] --- maven-resources-plugin:2.6:resources (default-resources) @ phoenix-pig ---
[INFO] Using 'UTF-8' encoding to copy filtered resources.
[INFO] skip non existing resourceDirectory <https://builds.apache.org/job/Phoenix-hadoop2/ws/phoenix-pig/src/main/resources>
[INFO] Copying 3 resources
[INFO] 
[INFO] --- maven-compiler-plugin:3.0:compile (default-compile) @ phoenix-pig ---
[INFO] Changes detected - recompiling the module!
[INFO] Compiling 15 source files to <https://builds.apache.org/job/Phoenix-hadoop2/ws/phoenix-pig/target/classes>
[INFO] 
[INFO] --- maven-dependency-plugin:2.1:build-classpath (create-mrapp-generated-classpath)
@ phoenix-pig ---
[INFO] Wrote classpath file '<https://builds.apache.org/job/Phoenix-hadoop2/ws/phoenix-pig/target/classes/mrapp-generated-classpath'.>
[INFO] 
[INFO] --- maven-resources-plugin:2.6:testResources (default-testResources) @ phoenix-pig
---
[INFO] Using 'UTF-8' encoding to copy filtered resources.
[INFO] skip non existing resourceDirectory <https://builds.apache.org/job/Phoenix-hadoop2/ws/phoenix-pig/src/test/resources>
[INFO] skip non existing resourceDirectory <https://builds.apache.org/job/Phoenix-hadoop2/ws/phoenix-pig/src/it/resources>
[INFO] Copying 3 resources
[INFO] 
[INFO] --- maven-compiler-plugin:3.0:testCompile (default-testCompile) @ phoenix-pig ---
[INFO] Changes detected - recompiling the module!
[INFO] Compiling 8 source files to <https://builds.apache.org/job/Phoenix-hadoop2/ws/phoenix-pig/target/test-classes>
[INFO] 
[INFO] --- maven-surefire-plugin:2.16:test (default-test) @ phoenix-pig ---
[INFO] Surefire report directory: <https://builds.apache.org/job/Phoenix-hadoop2/ws/phoenix-pig/target/surefire-reports>

-------------------------------------------------------
 T E S T S
-------------------------------------------------------

-------------------------------------------------------
 T E S T S
-------------------------------------------------------
Running org.apache.phoenix.pig.PhoenixPigConfigurationTest
Running org.apache.phoenix.pig.util.ColumnInfoToStringEncoderDecoderTest
Running org.apache.phoenix.pig.util.PhoenixPigSchemaUtilTest
Running org.apache.phoenix.pig.util.QuerySchemaParserFunctionTest
Tests run: 1, Failures: 0, Errors: 0, Skipped: 0, Time elapsed: 0.361 sec - in org.apache.phoenix.pig.PhoenixPigConfigurationTest
Running org.apache.phoenix.pig.util.TableSchemaParserFunctionTest
Tests run: 3, Failures: 0, Errors: 0, Skipped: 0, Time elapsed: 0.042 sec - in org.apache.phoenix.pig.util.TableSchemaParserFunctionTest
Tests run: 3, Failures: 0, Errors: 0, Skipped: 0, Time elapsed: 0.473 sec - in org.apache.phoenix.pig.util.ColumnInfoToStringEncoderDecoderTest
Tests run: 2, Failures: 0, Errors: 0, Skipped: 0, Time elapsed: 0.617 sec - in org.apache.phoenix.pig.util.PhoenixPigSchemaUtilTest
Tests run: 4, Failures: 0, Errors: 0, Skipped: 0, Time elapsed: 1.734 sec - in org.apache.phoenix.pig.util.QuerySchemaParserFunctionTest

Results :

Tests run: 13, Failures: 0, Errors: 0, Skipped: 0

[INFO] 
[INFO] --- maven-source-plugin:2.2.1:jar-no-fork (attach-sources) @ phoenix-pig ---
[INFO] Building jar: <https://builds.apache.org/job/Phoenix-hadoop2/2/artifact/phoenix-pig/target/phoenix-pig-4.1.0-incubating-SNAPSHOT-sources.jar>
[INFO] 
[INFO] --- maven-jar-plugin:2.4:test-jar (default) @ phoenix-pig ---
[INFO] Building jar: <https://builds.apache.org/job/Phoenix-hadoop2/2/artifact/phoenix-pig/target/phoenix-pig-4.1.0-incubating-SNAPSHOT-tests.jar>
[INFO] 
[INFO] --- maven-jar-plugin:2.4:jar (default-jar) @ phoenix-pig ---
[INFO] Building jar: <https://builds.apache.org/job/Phoenix-hadoop2/2/artifact/phoenix-pig/target/phoenix-pig-4.1.0-incubating-SNAPSHOT.jar>
[INFO] 
[INFO] --- maven-site-plugin:3.2:attach-descriptor (attach-descriptor) @ phoenix-pig ---
[INFO] 
[INFO] --- maven-failsafe-plugin:2.17:integration-test (ClientManagedTimeTests) @ phoenix-pig
---
[INFO] Failsafe report directory: <https://builds.apache.org/job/Phoenix-hadoop2/ws/phoenix-pig/target/failsafe-reports>
[INFO] parallel='none', perCoreThreadCount=true, threadCount=0, useUnlimitedThreads=false,
threadCountSuites=0, threadCountClasses=0, threadCountMethods=0, parallelOptimized=true

-------------------------------------------------------
 T E S T S
-------------------------------------------------------

-------------------------------------------------------
 T E S T S
-------------------------------------------------------

Results :

Tests run: 0, Failures: 0, Errors: 0, Skipped: 0

[INFO] 
[INFO] --- maven-failsafe-plugin:2.17:integration-test (HBaseManagedTimeTests) @ phoenix-pig
---
[INFO] Failsafe report directory: <https://builds.apache.org/job/Phoenix-hadoop2/ws/phoenix-pig/target/failsafe-reports>
[INFO] parallel='none', perCoreThreadCount=true, threadCount=0, useUnlimitedThreads=false,
threadCountSuites=0, threadCountClasses=0, threadCountMethods=0, parallelOptimized=true

-------------------------------------------------------
 T E S T S
-------------------------------------------------------

-------------------------------------------------------
 T E S T S
-------------------------------------------------------
Running org.apache.phoenix.pig.PhoenixPigConfigurationIT
Running org.apache.phoenix.pig.PhoenixHBaseStorerIT
Tests run: 3, Failures: 0, Errors: 0, Skipped: 0, Time elapsed: 3.667 sec - in org.apache.phoenix.pig.PhoenixPigConfigurationIT
Tests run: 2, Failures: 0, Errors: 2, Skipped: 0, Time elapsed: 6.823 sec <<< FAILURE!
- in org.apache.phoenix.pig.PhoenixHBaseStorerIT
testStorerForSpecificColumns(org.apache.phoenix.pig.PhoenixHBaseStorerIT)  Time elapsed: 2.035
sec  <<< ERROR!
java.lang.RuntimeException: Job failed
	at org.apache.phoenix.pig.PhoenixHBaseStorerIT.testStorerForSpecificColumns(PhoenixHBaseStorerIT.java:170)

testStorer(org.apache.phoenix.pig.PhoenixHBaseStorerIT)  Time elapsed: 0.948 sec  <<<
ERROR!
java.lang.RuntimeException: Job failed
	at org.apache.phoenix.pig.PhoenixHBaseStorerIT.testStorer(PhoenixHBaseStorerIT.java:118)


Results :

Tests in error: 
  PhoenixHBaseStorerIT.testStorerForSpecificColumns:170 Runtime Job failed
  PhoenixHBaseStorerIT.testStorer:118 Runtime Job failed

Tests run: 5, Failures: 0, Errors: 2, Skipped: 0

[INFO] 
[INFO] --- maven-failsafe-plugin:2.17:integration-test (NeedTheirOwnClusterTests) @ phoenix-pig
---
[INFO] Failsafe report directory: <https://builds.apache.org/job/Phoenix-hadoop2/ws/phoenix-pig/target/failsafe-reports>
[INFO] parallel='none', perCoreThreadCount=true, threadCount=0, useUnlimitedThreads=false,
threadCountSuites=0, threadCountClasses=0, threadCountMethods=0, parallelOptimized=true

-------------------------------------------------------
 T E S T S
-------------------------------------------------------

-------------------------------------------------------
 T E S T S
-------------------------------------------------------
Running org.apache.phoenix.pig.PhoenixHBaseLoaderIT
Tests run: 8, Failures: 0, Errors: 4, Skipped: 0, Time elapsed: 37.715 sec <<< FAILURE!
- in org.apache.phoenix.pig.PhoenixHBaseLoaderIT
testGroupingOfDataForTable(org.apache.phoenix.pig.PhoenixHBaseLoaderIT)  Time elapsed: 4.229
sec  <<< ERROR!
java.lang.RuntimeException: No data for location 'out'
	at org.apache.pig.builtin.mock.Storage$Data.get(Storage.java:327)
	at org.apache.phoenix.pig.PhoenixHBaseLoaderIT.testGroupingOfDataForTable(PhoenixHBaseLoaderIT.java:357)

testDataForTable(org.apache.phoenix.pig.PhoenixHBaseLoaderIT)  Time elapsed: 3.283 sec  <<<
ERROR!
org.apache.pig.impl.logicalLayer.FrontendException: Unable to open iterator for alias B
	at org.apache.pig.PigServer.openIterator(PigServer.java:872)
	at org.apache.phoenix.pig.PhoenixHBaseLoaderIT.testDataForTable(PhoenixHBaseLoaderIT.java:258)

testDataForSQLQuery(org.apache.phoenix.pig.PhoenixHBaseLoaderIT)  Time elapsed: 3.387 sec
 <<< ERROR!
org.apache.pig.impl.logicalLayer.FrontendException: Unable to open iterator for alias A
	at org.apache.pig.PigServer.openIterator(PigServer.java:872)
	at org.apache.phoenix.pig.PhoenixHBaseLoaderIT.testDataForSQLQuery(PhoenixHBaseLoaderIT.java:299)

testLoadAndStore(org.apache.phoenix.pig.PhoenixHBaseLoaderIT)  Time elapsed: 4.473 sec  <<<
ERROR!
java.sql.SQLException: ERROR 402 (24016): Cursor past last row.
	at org.apache.phoenix.exception.SQLExceptionCode$Factory$1.newException(SQLExceptionCode.java:309)
	at org.apache.phoenix.exception.SQLExceptionInfo.buildException(SQLExceptionInfo.java:133)
	at org.apache.phoenix.jdbc.PhoenixResultSet.checkCursorState(PhoenixResultSet.java:197)
	at org.apache.phoenix.jdbc.PhoenixResultSet.getInt(PhoenixResultSet.java:413)
	at org.apache.phoenix.jdbc.PhoenixResultSet.getInt(PhoenixResultSet.java:424)
	at org.apache.phoenix.pig.PhoenixHBaseLoaderIT.testLoadAndStore(PhoenixHBaseLoaderIT.java:417)


Results :

Tests in error: 
  PhoenixHBaseLoaderIT.testGroupingOfDataForTable:357 ? Runtime No data for loca...
  PhoenixHBaseLoaderIT.testDataForTable:258 ? Frontend Unable to open iterator f...
  PhoenixHBaseLoaderIT.testDataForSQLQuery:299 ? Frontend Unable to open iterato...
  PhoenixHBaseLoaderIT.testLoadAndStore:417 ? SQL ERROR 402 (24016): Cursor past...

Tests run: 8, Failures: 0, Errors: 4, Skipped: 0

[INFO] 
[INFO] --- maven-failsafe-plugin:2.17:verify (ClientManagedTimeTests) @ phoenix-pig ---
[INFO] Failsafe report directory: <https://builds.apache.org/job/Phoenix-hadoop2/ws/phoenix-pig/target/failsafe-reports>
[INFO] ------------------------------------------------------------------------
[INFO] Reactor Summary:
[INFO] 
[INFO] Apache Phoenix .................................... SUCCESS [2.108s]
[INFO] Phoenix Hadoop Compatibility ...................... SUCCESS [0.510s]
[INFO] Phoenix Core ...................................... SUCCESS [19:53.584s]
[INFO] Phoenix - Flume ................................... SUCCESS [1:05.880s]
[INFO] Phoenix - Pig ..................................... FAILURE [1:51.668s]
[INFO] Phoenix Hadoop2 Compatibility ..................... SKIPPED
[INFO] Phoenix Assembly .................................. SKIPPED
[INFO] ------------------------------------------------------------------------
[INFO] BUILD FAILURE
[INFO] ------------------------------------------------------------------------
[INFO] Total time: 22:54.167s
[INFO] Finished at: Fri May 23 17:05:09 UTC 2014
[INFO] Final Memory: 58M/780M
[INFO] ------------------------------------------------------------------------
[ERROR] Failed to execute goal org.apache.maven.plugins:maven-failsafe-plugin:2.17:verify
(ClientManagedTimeTests) on project phoenix-pig: There are test failures.
[ERROR] 
[ERROR] Please refer to <https://builds.apache.org/job/Phoenix-hadoop2/ws/phoenix-pig/target/failsafe-reports>
for the individual test results.
[ERROR] -> [Help 1]
[ERROR] 
[ERROR] To see the full stack trace of the errors, re-run Maven with the -e switch.
[ERROR] Re-run Maven using the -X switch to enable full debug logging.
[ERROR] 
[ERROR] For more information about the errors and possible solutions, please read the following
articles:
[ERROR] [Help 1] http://cwiki.apache.org/confluence/display/MAVEN/MojoFailureException
[ERROR] 
[ERROR] After correcting the problems, you can resume the build with the command
[ERROR]   mvn <goals> -rf :phoenix-pig
Build step 'Invoke top-level Maven targets' marked build as failure
Archiving artifacts
Updating PHOENIX-992
Updating PHOENIX-993
Updating PHOENIX-982
Updating PHOENIX-984
Updating PHOENIX-991
Updating PHOENIX-979
Recording test results

Mime
View raw message