phoenix-commits mailing list archives

Site index · List index
Message view « Date » · « Thread »
Top « Date » · « Thread »
From Apache Jenkins Server <jenk...@builds.apache.org>
Subject Build failed in Jenkins: Phoenix | Master | Hadoop1 #232
Date Tue, 27 May 2014 01:07:01 GMT
See <https://builds.apache.org/job/Phoenix-master-hadoop1/232/>

------------------------------------------
[...truncated 310 lines...]
[INFO] 
[INFO] --- maven-jar-plugin:2.4:jar (default-jar) @ phoenix-core ---
[INFO] Building jar: <https://builds.apache.org/job/Phoenix-master-hadoop1/232/artifact/phoenix-core/target/phoenix-core-4.1.0-incubating-SNAPSHOT.jar>
[INFO] 
[INFO] --- maven-site-plugin:3.2:attach-descriptor (attach-descriptor) @ phoenix-core ---
[INFO] 
[INFO] --- maven-failsafe-plugin:2.17:integration-test (ClientManagedTimeTests) @ phoenix-core
---
[INFO] Failsafe report directory: <https://builds.apache.org/job/Phoenix-master-hadoop1/ws/phoenix-core/target/failsafe-reports>
[INFO] parallel='none', perCoreThreadCount=true, threadCount=0, useUnlimitedThreads=false,
threadCountSuites=0, threadCountClasses=0, threadCountMethods=0, parallelOptimized=true

-------------------------------------------------------
 T E S T S
-------------------------------------------------------
Running org.apache.phoenix.end2end.CoalesceFunctionIT
Tests run: 1, Failures: 0, Errors: 0, Skipped: 0, Time elapsed: 4.851 sec - in org.apache.phoenix.end2end.CoalesceFunctionIT
Running org.apache.phoenix.end2end.FunkyNamesIT
Tests run: 3, Failures: 0, Errors: 0, Skipped: 0, Time elapsed: 3.659 sec - in org.apache.phoenix.end2end.FunkyNamesIT
Running org.apache.phoenix.end2end.TopNIT
Tests run: 4, Failures: 0, Errors: 0, Skipped: 0, Time elapsed: 4.842 sec - in org.apache.phoenix.end2end.TopNIT
Running org.apache.phoenix.end2end.TenantSpecificTablesDDLIT
Tests run: 16, Failures: 0, Errors: 0, Skipped: 0, Time elapsed: 36.051 sec - in org.apache.phoenix.end2end.TenantSpecificTablesDDLIT
Running org.apache.phoenix.end2end.ColumnProjectionOptimizationIT
Tests run: 2, Failures: 0, Errors: 0, Skipped: 0, Time elapsed: 11.608 sec - in org.apache.phoenix.end2end.ColumnProjectionOptimizationIT
Running org.apache.phoenix.end2end.DynamicUpsertIT
Tests run: 7, Failures: 0, Errors: 0, Skipped: 0, Time elapsed: 2.268 sec - in org.apache.phoenix.end2end.DynamicUpsertIT
Running org.apache.phoenix.end2end.UpsertSelectIT
Tests run: 11, Failures: 0, Errors: 0, Skipped: 0, Time elapsed: 33.492 sec - in org.apache.phoenix.end2end.UpsertSelectIT
Running org.apache.phoenix.end2end.ExtendedQueryExecIT
Tests run: 4, Failures: 0, Errors: 0, Skipped: 0, Time elapsed: 5.493 sec - in org.apache.phoenix.end2end.ExtendedQueryExecIT
Running org.apache.phoenix.end2end.OrderByIT
Tests run: 3, Failures: 0, Errors: 0, Skipped: 1, Time elapsed: 5.293 sec - in org.apache.phoenix.end2end.OrderByIT
Running org.apache.phoenix.end2end.VariableLengthPKIT
Tests run: 49, Failures: 0, Errors: 0, Skipped: 0, Time elapsed: 25.459 sec - in org.apache.phoenix.end2end.VariableLengthPKIT
Running org.apache.phoenix.end2end.ScanQueryIT
Tests run: 168, Failures: 0, Errors: 0, Skipped: 0, Time elapsed: 96.755 sec - in org.apache.phoenix.end2end.ScanQueryIT
Running org.apache.phoenix.end2end.CustomEntityDataIT
Tests run: 3, Failures: 0, Errors: 0, Skipped: 0, Time elapsed: 5.717 sec - in org.apache.phoenix.end2end.CustomEntityDataIT
Running org.apache.phoenix.end2end.StddevIT
Tests run: 4, Failures: 0, Errors: 0, Skipped: 0, Time elapsed: 5.795 sec - in org.apache.phoenix.end2end.StddevIT
Running org.apache.phoenix.end2end.ClientTimeArithmeticQueryIT
Tests run: 216, Failures: 0, Errors: 0, Skipped: 0, Time elapsed: 138.374 sec - in org.apache.phoenix.end2end.ClientTimeArithmeticQueryIT
Running org.apache.phoenix.end2end.NotQueryIT
Tests run: 144, Failures: 0, Errors: 0, Skipped: 0, Time elapsed: 100.422 sec - in org.apache.phoenix.end2end.NotQueryIT
Running org.apache.phoenix.end2end.DistinctCountIT
Tests run: 9, Failures: 0, Errors: 0, Skipped: 0, Time elapsed: 8.443 sec - in org.apache.phoenix.end2end.DistinctCountIT
Running org.apache.phoenix.end2end.QueryDatabaseMetaDataIT
Tests run: 15, Failures: 0, Errors: 0, Skipped: 0, Time elapsed: 59.268 sec - in org.apache.phoenix.end2end.QueryDatabaseMetaDataIT
Running org.apache.phoenix.end2end.StatsManagerIT
Tests run: 1, Failures: 0, Errors: 0, Skipped: 0, Time elapsed: 20.52 sec - in org.apache.phoenix.end2end.StatsManagerIT
Running org.apache.phoenix.end2end.TenantSpecificTablesDMLIT
Tests run: 14, Failures: 0, Errors: 0, Skipped: 0, Time elapsed: 22.791 sec - in org.apache.phoenix.end2end.TenantSpecificTablesDMLIT
Running org.apache.phoenix.end2end.KeyOnlyIT
Tests run: 2, Failures: 0, Errors: 0, Skipped: 0, Time elapsed: 4.695 sec - in org.apache.phoenix.end2end.KeyOnlyIT
Running org.apache.phoenix.end2end.CompareDecimalToLongIT
Tests run: 8, Failures: 0, Errors: 0, Skipped: 0, Time elapsed: 5.746 sec - in org.apache.phoenix.end2end.CompareDecimalToLongIT
Running org.apache.phoenix.end2end.CaseStatementIT
Tests run: 136, Failures: 0, Errors: 0, Skipped: 0, Time elapsed: 116.873 sec - in org.apache.phoenix.end2end.CaseStatementIT
Running org.apache.phoenix.end2end.DynamicColumnIT
Tests run: 5, Failures: 0, Errors: 0, Skipped: 0, Time elapsed: 3.849 sec - in org.apache.phoenix.end2end.DynamicColumnIT
Running org.apache.phoenix.end2end.TruncateFunctionIT
Tests run: 1, Failures: 0, Errors: 0, Skipped: 0, Time elapsed: 3.605 sec - in org.apache.phoenix.end2end.TruncateFunctionIT
Running org.apache.phoenix.end2end.ArrayIT
Tests run: 41, Failures: 0, Errors: 0, Skipped: 0, Time elapsed: 30.184 sec - in org.apache.phoenix.end2end.ArrayIT
Running org.apache.phoenix.end2end.GroupByIT
Tests run: 152, Failures: 0, Errors: 0, Skipped: 0, Time elapsed: 150.682 sec - in org.apache.phoenix.end2end.GroupByIT
Running org.apache.phoenix.end2end.NativeHBaseTypesIT
Tests run: 7, Failures: 0, Errors: 0, Skipped: 0, Time elapsed: 3.623 sec - in org.apache.phoenix.end2end.NativeHBaseTypesIT
Running org.apache.phoenix.end2end.salted.SaltedTableVarLengthRowKeyIT
Tests run: 1, Failures: 0, Errors: 0, Skipped: 0, Time elapsed: 4.94 sec - in org.apache.phoenix.end2end.salted.SaltedTableVarLengthRowKeyIT
Running org.apache.phoenix.end2end.salted.SaltedTableIT
Tests run: 8, Failures: 0, Errors: 0, Skipped: 0, Time elapsed: 6.79 sec - in org.apache.phoenix.end2end.salted.SaltedTableIT
Running org.apache.phoenix.end2end.CastAndCoerceIT
Tests run: 124, Failures: 0, Errors: 0, Skipped: 0, Time elapsed: 123.722 sec - in org.apache.phoenix.end2end.CastAndCoerceIT
Running org.apache.phoenix.end2end.ReadIsolationLevelIT
Tests run: 2, Failures: 0, Errors: 0, Skipped: 0, Time elapsed: 3.704 sec - in org.apache.phoenix.end2end.ReadIsolationLevelIT
Running org.apache.phoenix.end2end.QueryIT
Tests run: 100, Failures: 0, Errors: 0, Skipped: 0, Time elapsed: 109.113 sec - in org.apache.phoenix.end2end.QueryIT
Running org.apache.phoenix.end2end.ProductMetricsIT
Tests run: 61, Failures: 0, Errors: 0, Skipped: 0, Time elapsed: 42.369 sec - in org.apache.phoenix.end2end.ProductMetricsIT
Running org.apache.phoenix.end2end.SkipRangeParallelIteratorRegionSplitterIT
Tests run: 8, Failures: 0, Errors: 0, Skipped: 0, Time elapsed: 8.398 sec - in org.apache.phoenix.end2end.SkipRangeParallelIteratorRegionSplitterIT
Running org.apache.phoenix.end2end.InMemoryOrderByIT
Tests run: 3, Failures: 0, Errors: 0, Skipped: 1, Time elapsed: 8.83 sec - in org.apache.phoenix.end2end.InMemoryOrderByIT
Running org.apache.phoenix.end2end.UpsertValuesIT
Tests run: 12, Failures: 0, Errors: 0, Skipped: 0, Time elapsed: 30.833 sec - in org.apache.phoenix.end2end.UpsertValuesIT
Running org.apache.phoenix.end2end.CreateTableIT
Tests run: 9, Failures: 0, Errors: 0, Skipped: 0, Time elapsed: 39.909 sec - in org.apache.phoenix.end2end.CreateTableIT
Running org.apache.phoenix.end2end.ToNumberFunctionIT
Tests run: 18, Failures: 0, Errors: 0, Skipped: 0, Time elapsed: 10.785 sec - in org.apache.phoenix.end2end.ToNumberFunctionIT
Running org.apache.phoenix.end2end.ToCharFunctionIT
Tests run: 10, Failures: 0, Errors: 0, Skipped: 0, Time elapsed: 6.993 sec - in org.apache.phoenix.end2end.ToCharFunctionIT
Running org.apache.phoenix.end2end.DerivedTableIT
Tests run: 16, Failures: 0, Errors: 0, Skipped: 0, Time elapsed: 31.629 sec - in org.apache.phoenix.end2end.DerivedTableIT
Running org.apache.phoenix.end2end.DefaultParallelIteratorsRegionSplitterIT
Tests run: 2, Failures: 0, Errors: 0, Skipped: 0, Time elapsed: 8.007 sec - in org.apache.phoenix.end2end.DefaultParallelIteratorsRegionSplitterIT
Running org.apache.phoenix.end2end.SequenceIT
Tests run: 21, Failures: 0, Errors: 0, Skipped: 0, Time elapsed: 48.313 sec - in org.apache.phoenix.end2end.SequenceIT
Running org.apache.phoenix.end2end.GroupByCaseIT
Tests run: 3, Failures: 0, Errors: 0, Skipped: 0, Time elapsed: 14.44 sec - in org.apache.phoenix.end2end.GroupByCaseIT
Running org.apache.phoenix.end2end.MultiCfQueryExecIT
Tests run: 7, Failures: 0, Errors: 0, Skipped: 0, Time elapsed: 22.638 sec - in org.apache.phoenix.end2end.MultiCfQueryExecIT
Running org.apache.phoenix.end2end.IsNullIT
Tests run: 2, Failures: 0, Errors: 0, Skipped: 0, Time elapsed: 19.577 sec - in org.apache.phoenix.end2end.IsNullIT
Running org.apache.phoenix.end2end.SpooledOrderByIT
Tests run: 3, Failures: 0, Errors: 0, Skipped: 1, Time elapsed: 11.428 sec - in org.apache.phoenix.end2end.SpooledOrderByIT
Running org.apache.phoenix.end2end.RowValueConstructorIT
Tests run: 25, Failures: 0, Errors: 0, Skipped: 0, Time elapsed: 49.608 sec - in org.apache.phoenix.end2end.RowValueConstructorIT
Running org.apache.phoenix.end2end.PercentileIT
Tests run: 17, Failures: 0, Errors: 0, Skipped: 0, Time elapsed: 26.781 sec - in org.apache.phoenix.end2end.PercentileIT

Results :

Tests run: 1478, Failures: 0, Errors: 0, Skipped: 3

[INFO] 
[INFO] --- maven-failsafe-plugin:2.17:integration-test (HBaseManagedTimeTests) @ phoenix-core
---
[INFO] Failsafe report directory: <https://builds.apache.org/job/Phoenix-master-hadoop1/ws/phoenix-core/target/failsafe-reports>
[INFO] parallel='none', perCoreThreadCount=true, threadCount=0, useUnlimitedThreads=false,
threadCountSuites=0, threadCountClasses=0, threadCountMethods=0, parallelOptimized=true

-------------------------------------------------------
 T E S T S
-------------------------------------------------------
Running org.apache.phoenix.end2end.HashJoinIT
Tests run: 60, Failures: 0, Errors: 0, Skipped: 0, Time elapsed: 100.352 sec - in org.apache.phoenix.end2end.HashJoinIT
Running org.apache.phoenix.end2end.DynamicFamilyIT
Tests run: 4, Failures: 0, Errors: 0, Skipped: 0, Time elapsed: 10.819 sec - in org.apache.phoenix.end2end.DynamicFamilyIT
Running org.apache.phoenix.end2end.RoundFloorCeilFunctionsEnd2EndIT
Tests run: 30, Failures: 0, Errors: 0, Skipped: 0, Time elapsed: 7.326 sec - in org.apache.phoenix.end2end.RoundFloorCeilFunctionsEnd2EndIT
Running org.apache.phoenix.end2end.StatementHintsIT
Tests run: 2, Failures: 0, Errors: 0, Skipped: 0, Time elapsed: 4.562 sec - in org.apache.phoenix.end2end.StatementHintsIT
Running org.apache.phoenix.end2end.ExecuteStatementsIT
Tests run: 2, Failures: 0, Errors: 0, Skipped: 0, Time elapsed: 37.598 sec - in org.apache.phoenix.end2end.ExecuteStatementsIT
Running org.apache.phoenix.end2end.TenantSpecificViewIndexIT
Tests run: 3, Failures: 0, Errors: 0, Skipped: 0, Time elapsed: 28.309 sec - in org.apache.phoenix.end2end.TenantSpecificViewIndexIT
Running org.apache.phoenix.end2end.SortOrderFIT
Tests run: 29, Failures: 0, Errors: 0, Skipped: 0, Time elapsed: 7.227 sec - in org.apache.phoenix.end2end.SortOrderFIT
Running org.apache.phoenix.end2end.MD5FunctionIT
Tests run: 2, Failures: 0, Errors: 0, Skipped: 0, Time elapsed: 8.529 sec - in org.apache.phoenix.end2end.MD5FunctionIT
Running org.apache.phoenix.end2end.index.SaltedIndexIT
Tests run: 3, Failures: 0, Errors: 0, Skipped: 0, Time elapsed: 49.878 sec - in org.apache.phoenix.end2end.index.SaltedIndexIT
Running org.apache.phoenix.end2end.index.MutableIndexIT
Tests run: 13, Failures: 0, Errors: 0, Skipped: 0, Time elapsed: 140.745 sec - in org.apache.phoenix.end2end.index.MutableIndexIT
Running org.apache.phoenix.end2end.index.ImmutableIndexIT
Tests run: 7, Failures: 0, Errors: 0, Skipped: 0, Time elapsed: 36.743 sec - in org.apache.phoenix.end2end.index.ImmutableIndexIT
Running org.apache.phoenix.end2end.index.DropViewIT
Tests run: 1, Failures: 0, Errors: 0, Skipped: 0, Time elapsed: 7.571 sec - in org.apache.phoenix.end2end.index.DropViewIT
Running org.apache.phoenix.end2end.index.IndexMetadataIT
Tests run: 4, Failures: 0, Errors: 0, Skipped: 0, Time elapsed: 40.022 sec - in org.apache.phoenix.end2end.index.IndexMetadataIT
Running org.apache.phoenix.end2end.TimezoneOffsetFunctionIT
Tests run: 6, Failures: 0, Errors: 0, Skipped: 0, Time elapsed: 5.303 sec - in org.apache.phoenix.end2end.TimezoneOffsetFunctionIT
Running org.apache.phoenix.end2end.UpsertSelectAutoCommitIT
Tests run: 2, Failures: 0, Errors: 0, Skipped: 0, Time elapsed: 18.513 sec - in org.apache.phoenix.end2end.UpsertSelectAutoCommitIT
Running org.apache.phoenix.end2end.BinaryRowKeyIT
Tests run: 3, Failures: 0, Errors: 0, Skipped: 0, Time elapsed: 14.571 sec - in org.apache.phoenix.end2end.BinaryRowKeyIT
Running org.apache.phoenix.end2end.ReverseFunctionIT
Tests run: 5, Failures: 0, Errors: 0, Skipped: 0, Time elapsed: 5.303 sec - in org.apache.phoenix.end2end.ReverseFunctionIT
Running org.apache.phoenix.end2end.salted.SaltedTableUpsertSelectIT
Tests run: 5, Failures: 0, Errors: 0, Skipped: 0, Time elapsed: 15.225 sec - in org.apache.phoenix.end2end.salted.SaltedTableUpsertSelectIT
Running org.apache.phoenix.end2end.SpillableGroupByIT
Tests run: 1, Failures: 0, Errors: 0, Skipped: 0, Time elapsed: 5.441 sec - in org.apache.phoenix.end2end.SpillableGroupByIT
Running org.apache.phoenix.end2end.SkipScanQueryIT
Tests run: 7, Failures: 0, Errors: 0, Skipped: 0, Time elapsed: 35.666 sec - in org.apache.phoenix.end2end.SkipScanQueryIT
Running org.apache.phoenix.end2end.DecodeFunctionIT
Tests run: 6, Failures: 0, Errors: 0, Skipped: 0, Time elapsed: 6.535 sec - in org.apache.phoenix.end2end.DecodeFunctionIT
Running org.apache.phoenix.end2end.TenantSpecificViewIndexSaltedIT
Tests run: 2, Failures: 0, Errors: 0, Skipped: 0, Time elapsed: 22.081 sec - in org.apache.phoenix.end2end.TenantSpecificViewIndexSaltedIT
Running org.apache.phoenix.end2end.AutoCommitIT
Tests run: 1, Failures: 0, Errors: 0, Skipped: 0, Time elapsed: 5.014 sec - in org.apache.phoenix.end2end.AutoCommitIT
Running org.apache.phoenix.end2end.SaltedViewIT
Tests run: 1, Failures: 0, Errors: 0, Skipped: 0, Time elapsed: 13.284 sec - in org.apache.phoenix.end2end.SaltedViewIT
Running org.apache.phoenix.end2end.ServerExceptionIT
Tests run: 1, Failures: 0, Errors: 0, Skipped: 0, Time elapsed: 4.817 sec - in org.apache.phoenix.end2end.ServerExceptionIT
Running org.apache.phoenix.end2end.ViewIT
Tests run: 7, Failures: 0, Errors: 0, Skipped: 0, Time elapsed: 23.096 sec - in org.apache.phoenix.end2end.ViewIT
Running org.apache.phoenix.end2end.CSVCommonsLoaderIT
Tests run: 13, Failures: 0, Errors: 0, Skipped: 0, Time elapsed: 18.508 sec - in org.apache.phoenix.end2end.CSVCommonsLoaderIT
Running org.apache.phoenix.end2end.QueryPlanIT
Tests run: 1, Failures: 0, Errors: 0, Skipped: 0, Time elapsed: 35.983 sec - in org.apache.phoenix.end2end.QueryPlanIT
Running org.apache.phoenix.end2end.AlterTableIT
Tests run: 13, Failures: 0, Errors: 0, Skipped: 0, Time elapsed: 70.019 sec - in org.apache.phoenix.end2end.AlterTableIT
Running org.apache.phoenix.end2end.ArithmeticQueryIT
Tests run: 8, Failures: 0, Errors: 0, Skipped: 0, Time elapsed: 17.092 sec - in org.apache.phoenix.end2end.ArithmeticQueryIT
Running org.apache.phoenix.end2end.UpsertBigValuesIT
Tests run: 4, Failures: 0, Errors: 0, Skipped: 0, Time elapsed: 25.813 sec - in org.apache.phoenix.end2end.UpsertBigValuesIT
Running org.apache.phoenix.end2end.QueryExecWithoutSCNIT
Tests run: 1, Failures: 0, Errors: 0, Skipped: 0, Time elapsed: 9.35 sec - in org.apache.phoenix.end2end.QueryExecWithoutSCNIT
Running org.apache.phoenix.end2end.DeleteIT
Tests run: 15, Failures: 0, Errors: 0, Skipped: 0, Time elapsed: 36.742 sec - in org.apache.phoenix.end2end.DeleteIT

Results :

Tests run: 262, Failures: 0, Errors: 0, Skipped: 0

[INFO] 
[INFO] --- maven-failsafe-plugin:2.17:integration-test (NeedTheirOwnClusterTests) @ phoenix-core
---
[INFO] Failsafe report directory: <https://builds.apache.org/job/Phoenix-master-hadoop1/ws/phoenix-core/target/failsafe-reports>
[INFO] parallel='none', perCoreThreadCount=true, threadCount=0, useUnlimitedThreads=false,
threadCountSuites=0, threadCountClasses=0, threadCountMethods=0, parallelOptimized=true

-------------------------------------------------------
 T E S T S
-------------------------------------------------------
Running org.apache.phoenix.hbase.index.covered.example.EndToEndCoveredIndexingIT
Tests run: 11, Failures: 0, Errors: 0, Skipped: 0, Time elapsed: 156.128 sec - in org.apache.phoenix.hbase.index.covered.example.EndToEndCoveredIndexingIT
Running org.apache.phoenix.hbase.index.covered.example.FailWithoutRetriesIT
Tests run: 1, Failures: 0, Errors: 0, Skipped: 0, Time elapsed: 22.386 sec - in org.apache.phoenix.hbase.index.covered.example.FailWithoutRetriesIT
Running org.apache.phoenix.hbase.index.covered.example.EndtoEndIndexingWithCompressionIT
Tests run: 11, Failures: 0, Errors: 0, Skipped: 0, Time elapsed: 120.551 sec - in org.apache.phoenix.hbase.index.covered.example.EndtoEndIndexingWithCompressionIT
Running org.apache.phoenix.hbase.index.covered.EndToEndCoveredColumnsIndexBuilderIT
Tests run: 2, Failures: 0, Errors: 0, Skipped: 0, Time elapsed: 19.092 sec - in org.apache.phoenix.hbase.index.covered.EndToEndCoveredColumnsIndexBuilderIT
Running org.apache.phoenix.hbase.index.FailForUnsupportedHBaseVersionsIT
Tests run: 2, Failures: 0, Errors: 0, Skipped: 0, Time elapsed: 49.199 sec - in org.apache.phoenix.hbase.index.FailForUnsupportedHBaseVersionsIT
Running org.apache.phoenix.end2end.index.MutableIndexFailureIT
Tests run: 1, Failures: 0, Errors: 0, Skipped: 0, Time elapsed: 41.283 sec - in org.apache.phoenix.end2end.index.MutableIndexFailureIT
Running org.apache.phoenix.end2end.ContextClassloaderIT

Results :

Tests run: 28, Failures: 0, Errors: 0, Skipped: 0

[INFO] ------------------------------------------------------------------------
[INFO] Reactor Summary:
[INFO] 
[INFO] Apache Phoenix .................................... SUCCESS [2.595s]
[INFO] Phoenix Hadoop Compatibility ...................... SUCCESS [0.562s]
[INFO] Phoenix Core ...................................... FAILURE [1:00:30.553s]
[INFO] Phoenix - Flume ................................... SKIPPED
[INFO] Phoenix - Pig ..................................... SKIPPED
[INFO] Phoenix Hadoop1 Compatibility ..................... SKIPPED
[INFO] Phoenix Assembly .................................. SKIPPED
[INFO] ------------------------------------------------------------------------
[INFO] BUILD FAILURE
[INFO] ------------------------------------------------------------------------
[INFO] Total time: 1:00:34.116s
[INFO] Finished at: Tue May 27 01:06:39 UTC 2014
[INFO] Final Memory: 25M/466M
[INFO] ------------------------------------------------------------------------
[ERROR] Failed to execute goal org.apache.maven.plugins:maven-failsafe-plugin:2.17:integration-test
(NeedTheirOwnClusterTests) on project phoenix-core: Execution NeedTheirOwnClusterTests of
goal org.apache.maven.plugins:maven-failsafe-plugin:2.17:integration-test failed: java.lang.RuntimeException:
java.io.IOException: Stream Closed -> [Help 1]
[ERROR] 
[ERROR] To see the full stack trace of the errors, re-run Maven with the -e switch.
[ERROR] Re-run Maven using the -X switch to enable full debug logging.
[ERROR] 
[ERROR] For more information about the errors and possible solutions, please read the following
articles:
[ERROR] [Help 1] http://cwiki.apache.org/confluence/display/MAVEN/PluginExecutionException
[ERROR] 
[ERROR] After correcting the problems, you can resume the build with the command
[ERROR]   mvn <goals> -rf :phoenix-core
Build step 'Invoke top-level Maven targets' marked build as failure
Archiving artifacts
Recording test results

Mime
View raw message